daily pastebin goal
17%
SHARE
TWEET

Untitled

a guest Dec 5th, 2017 197 Never
Not a member of Pastebin yet? Sign Up, it unlocks many cool features!
  1. Executing tasks: [:app:assembleDebug]
  2.  
  3. Parallel execution with configuration on demand is an incubating feature.
  4. Configuration 'compile' in project ':app' is deprecated. Use 'implementation' instead.
  5. Configuration 'testCompile' in project ':app' is deprecated. Use 'testImplementation' instead.
  6. :app:preBuild UP-TO-DATE
  7. :app:preDebugBuild UP-TO-DATE
  8. :app:compileDebugAidl UP-TO-DATE
  9. :app:compileDebugRenderscript UP-TO-DATE
  10. :app:checkDebugManifest UP-TO-DATE
  11. :app:generateDebugBuildConfig UP-TO-DATE
  12. :app:prepareLintJar UP-TO-DATE
  13. :app:generateDebugResValues UP-TO-DATE
  14. :app:generateDebugResources UP-TO-DATE
  15. :app:mergeDebugResources UP-TO-DATE
  16. :app:createDebugCompatibleScreenManifests UP-TO-DATE
  17. :app:processDebugManifest
  18. :app:splitsDiscoveryTaskDebug UP-TO-DATE
  19. :app:processDebugResources
  20. :app:generateDebugSources
  21. :app:javaPreCompileDebug UP-TO-DATE
  22. :app:compileDebugJavaWithJavac UP-TO-DATE
  23. :app:compileDebugNdk NO-SOURCE
  24. :app:compileDebugSources UP-TO-DATE
  25. :app:mergeDebugShaders UP-TO-DATE
  26. :app:compileDebugShaders UP-TO-DATE
  27. :app:generateDebugAssets UP-TO-DATE
  28. :app:mergeDebugAssets UP-TO-DATE
  29. :app:transformClassesWithStackFramesFixerForDebug UP-TO-DATE
  30. :app:transformClassesWithDesugarForDebug
  31. Exception in thread "main" java.lang.IllegalStateException: Couldn't desugar invokedynamic for android/view/accessibility/AccessibilityManager.run using java/lang/invoke/LambdaMetafactory.metafactory(Ljava/lang/invoke/MethodHandles$Lookup;Ljava/lang/String;Ljava/lang/invoke/MethodType;Ljava/lang/invoke/MethodType;Ljava/lang/invoke/MethodHandle;Ljava/lang/invoke/MethodType;)Ljava/lang/invoke/CallSite; (6) with arguments [()V, android/view/accessibility/AccessibilityManager.lambda$notifyAccessibilityStateChanged$0(Landroid/view/accessibility/AccessibilityManager$AccessibilityStateChangeListener;Z)V (6), ()V]
  32.     at com.google.devtools.build.android.desugar.LambdaDesugaring$InvokedynamicRewriter.visitInvokeDynamicInsn(LambdaDesugaring.java:467)
  33.     at org.objectweb.asm.ClassReader.a(Unknown Source)
  34.     at org.objectweb.asm.ClassReader.b(Unknown Source)
  35.     at org.objectweb.asm.ClassReader.accept(Unknown Source)
  36.     at org.objectweb.asm.ClassReader.accept(Unknown Source)
  37.     at com.google.devtools.build.android.desugar.Desugar.desugarClassesInInput(Desugar.java:401)
  38.     at com.google.devtools.build.android.desugar.Desugar.desugarOneInput(Desugar.java:326)
  39.     at com.google.devtools.build.android.desugar.Desugar.desugar(Desugar.java:280)
  40.     at com.google.devtools.build.android.desugar.Desugar.main(Desugar.java:584)
  41. Caused by: java.lang.NoSuchMethodException: no such method: android.view.accessibility.AccessibilityManager.lambda$notifyAccessibilityStateChanged$0(AccessibilityStateChangeListener,boolean)void/invokeStatic
  42.     at java.lang.invoke.MemberName.makeAccessException(MemberName.java:871)
  43.     at java.lang.invoke.MemberName$Factory.resolveOrFail(MemberName.java:1003)
  44.     at java.lang.invoke.MethodHandles$Lookup.resolveOrFail(MethodHandles.java:1386)
  45.     at java.lang.invoke.MethodHandles$Lookup.findStatic(MethodHandles.java:780)
  46.     at com.google.devtools.build.android.desugar.LambdaDesugaring$InvokedynamicRewriter.toMethodHandle(LambdaDesugaring.java:604)
  47.     at com.google.devtools.build.android.desugar.LambdaDesugaring$InvokedynamicRewriter.toJvmMetatype(LambdaDesugaring.java:586)
  48.     at com.google.devtools.build.android.desugar.LambdaDesugaring$InvokedynamicRewriter.visitInvokeDynamicInsn(LambdaDesugaring.java:401)
  49.     ... 8 more
  50. Caused by: java.lang.NoSuchFieldError: method resolution failed
  51.     at java.lang.invoke.MethodHandleNatives.resolve(Native Method)
  52.     at java.lang.invoke.MemberName$Factory.resolve(MemberName.java:975)
  53.     at java.lang.invoke.MemberName$Factory.resolveOrFail(MemberName.java:1000)
  54.     ... 13 more
  55.  
  56.  
  57.  FAILED
  58.  
  59. FAILURE: Build failed with an exception.
  60.  
  61. * What went wrong:
  62. Execution failed for task ':app:transformClassesWithDesugarForDebug'.
  63. > com.android.build.api.transform.TransformException: java.lang.RuntimeException: java.lang.RuntimeException: com.android.ide.common.process.ProcessException: Error while executing java process with main class com.google.devtools.build.android.desugar.Desugar with arguments {--input D:\GitHub\sony\rat-test-app\app\build\intermediates\transforms\stackFramesFixer\debug\0.jar --output D:\GitHub\sony\rat-test-app\app\build\intermediates\transforms\desugar\debug\1.jar --input D:\GitHub\sony\rat-test-app\app\build\intermediates\transforms\stackFramesFixer\debug\1.jar --output D:\GitHub\sony\rat-test-app\app\build\intermediates\transforms\desugar\debug\2.jar --input D:\GitHub\sony\rat-test-app\app\build\intermediates\transforms\stackFramesFixer\debug\19.jar --output D:\GitHub\sony\rat-test-app\app\build\intermediates\transforms\desugar\debug\20.jar --classpath_entry D:\GitHub\sony\rat-test-app\app\build\intermediates\classes\debug --classpath_entry D:\GitHub\sony\rat-test-app\app\build\intermediates\transforms\stackFramesFixer\debug\0.jar --classpath_entry D:\GitHub\sony\rat-test-app\app\build\intermediates\transforms\stackFramesFixer\debug\1.jar --classpath_entry D:\GitHub\sony\rat-test-app\app\build\intermediates\transforms\stackFramesFixer\debug\2.jar --classpath_entry D:\GitHub\sony\rat-test-app\app\build\intermediates\transforms\stackFramesFixer\debug\3.jar --classpath_entry D:\GitHub\sony\rat-test-app\app\build\intermediates\transforms\stackFramesFixer\debug\4.jar --classpath_entry D:\GitHub\sony\rat-test-app\app\build\intermediates\transforms\stackFramesFixer\debug\5.jar --classpath_entry D:\GitHub\sony\rat-test-app\app\build\intermediates\transforms\stackFramesFixer\debug\6.jar --classpath_entry D:\GitHub\sony\rat-test-app\app\build\intermediates\transforms\stackFramesFixer\debug\7.jar --classpath_entry D:\GitHub\sony\rat-test-app\app\build\intermediates\transforms\stackFramesFixer\debug\8.jar --classpath_entry D:\GitHub\sony\rat-test-app\app\build\intermediates\transforms\stackFramesFixer\debug\9.jar --classpath_entry D:\GitHub\sony\rat-test-app\app\build\intermediates\transforms\stackFramesFixer\debug\10.jar --classpath_entry D:\GitHub\sony\rat-test-app\app\build\intermediates\transforms\stackFramesFixer\debug\11.jar --classpath_entry D:\GitHub\sony\rat-test-app\app\build\intermediates\transforms\stackFramesFixer\debug\12.jar --classpath_entry D:\GitHub\sony\rat-test-app\app\build\intermediates\transforms\stackFramesFixer\debug\13.jar --classpath_entry D:\GitHub\sony\rat-test-app\app\build\intermediates\transforms\stackFramesFixer\debug\14.jar --classpath_entry D:\GitHub\sony\rat-test-app\app\build\intermediates\transforms\stackFramesFixer\debug\15.jar --classpath_entry D:\GitHub\sony\rat-test-app\app\build\intermediates\transforms\stackFramesFixer\debug\16.jar --classpath_entry D:\GitHub\sony\rat-test-app\app\build\intermediates\transforms\stackFramesFixer\debug\17.jar --classpath_entry D:\GitHub\sony\rat-test-app\app\build\intermediates\transforms\stackFramesFixer\debug\18.jar --classpath_entry D:\GitHub\sony\rat-test-app\app\build\intermediates\transforms\stackFramesFixer\debug\19.jar --bootclasspath_entry C:\Users\23060884\AppData\Local\Android\Sdk\platforms\android-27\android.jar --bootclasspath_entry C:\Users\23060884\AppData\Local\Android\Sdk\platforms\android-27\optional\org.apache.http.legacy.jar --bootclasspath_entry C:\Program Files\Android\Android Studio\jre\jre\lib\resources.jar --bootclasspath_entry C:\Program Files\Android\Android Studio\jre\jre\lib\rt.jar --bootclasspath_entry C:\Program Files\Android\Android Studio\jre\jre\lib\jsse.jar --bootclasspath_entry C:\Program Files\Android\Android Studio\jre\jre\lib\jce.jar --bootclasspath_entry C:\Program Files\Android\Android Studio\jre\jre\lib\charsets.jar --min_sdk_version 24 --nodesugar_try_with_resources_if_needed --desugar_try_with_resources_omit_runtime_classes}
  64.  
  65. * Try:
  66. Run with --info or --debug option to get more log output.
  67.  
  68. * Exception is:
  69. org.gradle.api.tasks.TaskExecutionException: Execution failed for task ':app:transformClassesWithDesugarForDebug'.
  70.     at org.gradle.api.internal.tasks.execution.ExecuteActionsTaskExecuter.executeActions(ExecuteActionsTaskExecuter.java:100)
  71.     at org.gradle.api.internal.tasks.execution.ExecuteActionsTaskExecuter.execute(ExecuteActionsTaskExecuter.java:70)
  72.     at org.gradle.api.internal.tasks.execution.SkipUpToDateTaskExecuter.execute(SkipUpToDateTaskExecuter.java:63)
  73.     at org.gradle.api.internal.tasks.execution.ResolveTaskOutputCachingStateExecuter.execute(ResolveTaskOutputCachingStateExecuter.java:54)
  74.     at org.gradle.api.internal.tasks.execution.ValidatingTaskExecuter.execute(ValidatingTaskExecuter.java:58)
  75.     at org.gradle.api.internal.tasks.execution.SkipEmptySourceFilesTaskExecuter.execute(SkipEmptySourceFilesTaskExecuter.java:88)
  76.     at org.gradle.api.internal.tasks.execution.ResolveTaskArtifactStateTaskExecuter.execute(ResolveTaskArtifactStateTaskExecuter.java:52)
  77.     at org.gradle.api.internal.tasks.execution.SkipTaskWithNoActionsExecuter.execute(SkipTaskWithNoActionsExecuter.java:52)
  78.     at org.gradle.api.internal.tasks.execution.SkipOnlyIfTaskExecuter.execute(SkipOnlyIfTaskExecuter.java:54)
  79.     at org.gradle.api.internal.tasks.execution.ExecuteAtMostOnceTaskExecuter.execute(ExecuteAtMostOnceTaskExecuter.java:43)
  80.     at org.gradle.api.internal.tasks.execution.CatchExceptionTaskExecuter.execute(CatchExceptionTaskExecuter.java:34)
  81.     at org.gradle.execution.taskgraph.DefaultTaskGraphExecuter$EventFiringTaskWorker$1.run(DefaultTaskGraphExecuter.java:248)
  82.     at org.gradle.internal.progress.DefaultBuildOperationExecutor$RunnableBuildOperationWorker.execute(DefaultBuildOperationExecutor.java:336)
  83.     at org.gradle.internal.progress.DefaultBuildOperationExecutor$RunnableBuildOperationWorker.execute(DefaultBuildOperationExecutor.java:328)
  84.     at org.gradle.internal.progress.DefaultBuildOperationExecutor.execute(DefaultBuildOperationExecutor.java:197)
  85.     at org.gradle.internal.progress.DefaultBuildOperationExecutor.run(DefaultBuildOperationExecutor.java:107)
  86.     at org.gradle.execution.taskgraph.DefaultTaskGraphExecuter$EventFiringTaskWorker.execute(DefaultTaskGraphExecuter.java:241)
  87.     at org.gradle.execution.taskgraph.DefaultTaskGraphExecuter$EventFiringTaskWorker.execute(DefaultTaskGraphExecuter.java:230)
  88.     at org.gradle.execution.taskgraph.DefaultTaskPlanExecutor$TaskExecutorWorker.processTask(DefaultTaskPlanExecutor.java:124)
  89.     at org.gradle.execution.taskgraph.DefaultTaskPlanExecutor$TaskExecutorWorker.access$200(DefaultTaskPlanExecutor.java:80)
  90.     at org.gradle.execution.taskgraph.DefaultTaskPlanExecutor$TaskExecutorWorker$1.execute(DefaultTaskPlanExecutor.java:105)
  91.     at org.gradle.execution.taskgraph.DefaultTaskPlanExecutor$TaskExecutorWorker$1.execute(DefaultTaskPlanExecutor.java:99)
  92.     at org.gradle.execution.taskgraph.DefaultTaskExecutionPlan.execute(DefaultTaskExecutionPlan.java:625)
  93.     at org.gradle.execution.taskgraph.DefaultTaskExecutionPlan.executeWithTask(DefaultTaskExecutionPlan.java:580)
  94.     at org.gradle.execution.taskgraph.DefaultTaskPlanExecutor$TaskExecutorWorker.run(DefaultTaskPlanExecutor.java:99)
  95.     at org.gradle.internal.concurrent.ExecutorPolicy$CatchAndRecordFailures.onExecute(ExecutorPolicy.java:63)
  96.     at org.gradle.internal.concurrent.ManagedExecutorImpl$1.run(ManagedExecutorImpl.java:46)
  97.     at org.gradle.internal.concurrent.ThreadFactoryImpl$ManagedThreadRunnable.run(ThreadFactoryImpl.java:55)
  98. Caused by: java.lang.RuntimeException: com.android.build.api.transform.TransformException: java.lang.RuntimeException: java.lang.RuntimeException: com.android.ide.common.process.ProcessException: Error while executing java process with main class com.google.devtools.build.android.desugar.Desugar with arguments {--input D:\GitHub\sony\rat-test-app\app\build\intermediates\transforms\stackFramesFixer\debug\0.jar --output D:\GitHub\sony\rat-test-app\app\build\intermediates\transforms\desugar\debug\1.jar --input D:\GitHub\sony\rat-test-app\app\build\intermediates\transforms\stackFramesFixer\debug\1.jar --output D:\GitHub\sony\rat-test-app\app\build\intermediates\transforms\desugar\debug\2.jar --input D:\GitHub\sony\rat-test-app\app\build\intermediates\transforms\stackFramesFixer\debug\19.jar --output D:\GitHub\sony\rat-test-app\app\build\intermediates\transforms\desugar\debug\20.jar --classpath_entry D:\GitHub\sony\rat-test-app\app\build\intermediates\classes\debug --classpath_entry D:\GitHub\sony\rat-test-app\app\build\intermediates\transforms\stackFramesFixer\debug\0.jar --classpath_entry D:\GitHub\sony\rat-test-app\app\build\intermediates\transforms\stackFramesFixer\debug\1.jar --classpath_entry D:\GitHub\sony\rat-test-app\app\build\intermediates\transforms\stackFramesFixer\debug\2.jar --classpath_entry D:\GitHub\sony\rat-test-app\app\build\intermediates\transforms\stackFramesFixer\debug\3.jar --classpath_entry D:\GitHub\sony\rat-test-app\app\build\intermediates\transforms\stackFramesFixer\debug\4.jar --classpath_entry D:\GitHub\sony\rat-test-app\app\build\intermediates\transforms\stackFramesFixer\debug\5.jar --classpath_entry D:\GitHub\sony\rat-test-app\app\build\intermediates\transforms\stackFramesFixer\debug\6.jar --classpath_entry D:\GitHub\sony\rat-test-app\app\build\intermediates\transforms\stackFramesFixer\debug\7.jar --classpath_entry D:\GitHub\sony\rat-test-app\app\build\intermediates\transforms\stackFramesFixer\debug\8.jar --classpath_entry D:\GitHub\sony\rat-test-app\app\build\intermediates\transforms\stackFramesFixer\debug\9.jar --classpath_entry D:\GitHub\sony\rat-test-app\app\build\intermediates\transforms\stackFramesFixer\debug\10.jar --classpath_entry D:\GitHub\sony\rat-test-app\app\build\intermediates\transforms\stackFramesFixer\debug\11.jar --classpath_entry D:\GitHub\sony\rat-test-app\app\build\intermediates\transforms\stackFramesFixer\debug\12.jar --classpath_entry D:\GitHub\sony\rat-test-app\app\build\intermediates\transforms\stackFramesFixer\debug\13.jar --classpath_entry D:\GitHub\sony\rat-test-app\app\build\intermediates\transforms\stackFramesFixer\debug\14.jar --classpath_entry D:\GitHub\sony\rat-test-app\app\build\intermediates\transforms\stackFramesFixer\debug\15.jar --classpath_entry D:\GitHub\sony\rat-test-app\app\build\intermediates\transforms\stackFramesFixer\debug\16.jar --classpath_entry D:\GitHub\sony\rat-test-app\app\build\intermediates\transforms\stackFramesFixer\debug\17.jar --classpath_entry D:\GitHub\sony\rat-test-app\app\build\intermediates\transforms\stackFramesFixer\debug\18.jar --classpath_entry D:\GitHub\sony\rat-test-app\app\build\intermediates\transforms\stackFramesFixer\debug\19.jar --bootclasspath_entry C:\Users\23060884\AppData\Local\Android\Sdk\platforms\android-27\android.jar --bootclasspath_entry C:\Users\23060884\AppData\Local\Android\Sdk\platforms\android-27\optional\org.apache.http.legacy.jar --bootclasspath_entry C:\Program Files\Android\Android Studio\jre\jre\lib\resources.jar --bootclasspath_entry C:\Program Files\Android\Android Studio\jre\jre\lib\rt.jar --bootclasspath_entry C:\Program Files\Android\Android Studio\jre\jre\lib\jsse.jar --bootclasspath_entry C:\Program Files\Android\Android Studio\jre\jre\lib\jce.jar --bootclasspath_entry C:\Program Files\Android\Android Studio\jre\jre\lib\charsets.jar --min_sdk_version 24 --nodesugar_try_with_resources_if_needed --desugar_try_with_resources_omit_runtime_classes}
  99.     at com.android.builder.profile.Recorder$Block.handleException(Recorder.java:55)
  100.     at com.android.builder.profile.ThreadRecorder.record(ThreadRecorder.java:104)
  101.     at com.android.build.gradle.internal.pipeline.TransformTask.transform(TransformTask.java:213)
  102.     at org.gradle.internal.reflect.JavaMethod.invoke(JavaMethod.java:73)
  103.     at org.gradle.api.internal.project.taskfactory.DefaultTaskClassInfoStore$IncrementalTaskAction.doExecute(DefaultTaskClassInfoStore.java:173)
  104.     at org.gradle.api.internal.project.taskfactory.DefaultTaskClassInfoStore$StandardTaskAction.execute(DefaultTaskClassInfoStore.java:134)
  105.     at org.gradle.api.internal.project.taskfactory.DefaultTaskClassInfoStore$StandardTaskAction.execute(DefaultTaskClassInfoStore.java:121)
  106.     at org.gradle.api.internal.tasks.execution.ExecuteActionsTaskExecuter$1.run(ExecuteActionsTaskExecuter.java:122)
  107.     at org.gradle.internal.progress.DefaultBuildOperationExecutor$RunnableBuildOperationWorker.execute(DefaultBuildOperationExecutor.java:336)
  108.     at org.gradle.internal.progress.DefaultBuildOperationExecutor$RunnableBuildOperationWorker.execute(DefaultBuildOperationExecutor.java:328)
  109.     at org.gradle.internal.progress.DefaultBuildOperationExecutor.execute(DefaultBuildOperationExecutor.java:197)
  110.     at org.gradle.internal.progress.DefaultBuildOperationExecutor.run(DefaultBuildOperationExecutor.java:107)
  111.     at org.gradle.api.internal.tasks.execution.ExecuteActionsTaskExecuter.executeAction(ExecuteActionsTaskExecuter.java:111)
  112.     at org.gradle.api.internal.tasks.execution.ExecuteActionsTaskExecuter.executeActions(ExecuteActionsTaskExecuter.java:92)
  113.     ... 27 more
  114. Caused by: com.android.build.api.transform.TransformException: java.lang.RuntimeException: java.lang.RuntimeException: com.android.ide.common.process.ProcessException: Error while executing java process with main class com.google.devtools.build.android.desugar.Desugar with arguments {--input D:\GitHub\sony\rat-test-app\app\build\intermediates\transforms\stackFramesFixer\debug\0.jar --output D:\GitHub\sony\rat-test-app\app\build\intermediates\transforms\desugar\debug\1.jar --input D:\GitHub\sony\rat-test-app\app\build\intermediates\transforms\stackFramesFixer\debug\1.jar --output D:\GitHub\sony\rat-test-app\app\build\intermediates\transforms\desugar\debug\2.jar --input D:\GitHub\sony\rat-test-app\app\build\intermediates\transforms\stackFramesFixer\debug\19.jar --output D:\GitHub\sony\rat-test-app\app\build\intermediates\transforms\desugar\debug\20.jar --classpath_entry D:\GitHub\sony\rat-test-app\app\build\intermediates\classes\debug --classpath_entry D:\GitHub\sony\rat-test-app\app\build\intermediates\transforms\stackFramesFixer\debug\0.jar --classpath_entry D:\GitHub\sony\rat-test-app\app\build\intermediates\transforms\stackFramesFixer\debug\1.jar --classpath_entry D:\GitHub\sony\rat-test-app\app\build\intermediates\transforms\stackFramesFixer\debug\2.jar --classpath_entry D:\GitHub\sony\rat-test-app\app\build\intermediates\transforms\stackFramesFixer\debug\3.jar --classpath_entry D:\GitHub\sony\rat-test-app\app\build\intermediates\transforms\stackFramesFixer\debug\4.jar --classpath_entry D:\GitHub\sony\rat-test-app\app\build\intermediates\transforms\stackFramesFixer\debug\5.jar --classpath_entry D:\GitHub\sony\rat-test-app\app\build\intermediates\transforms\stackFramesFixer\debug\6.jar --classpath_entry D:\GitHub\sony\rat-test-app\app\build\intermediates\transforms\stackFramesFixer\debug\7.jar --classpath_entry D:\GitHub\sony\rat-test-app\app\build\intermediates\transforms\stackFramesFixer\debug\8.jar --classpath_entry D:\GitHub\sony\rat-test-app\app\build\intermediates\transforms\stackFramesFixer\debug\9.jar --classpath_entry D:\GitHub\sony\rat-test-app\app\build\intermediates\transforms\stackFramesFixer\debug\10.jar --classpath_entry D:\GitHub\sony\rat-test-app\app\build\intermediates\transforms\stackFramesFixer\debug\11.jar --classpath_entry D:\GitHub\sony\rat-test-app\app\build\intermediates\transforms\stackFramesFixer\debug\12.jar --classpath_entry D:\GitHub\sony\rat-test-app\app\build\intermediates\transforms\stackFramesFixer\debug\13.jar --classpath_entry D:\GitHub\sony\rat-test-app\app\build\intermediates\transforms\stackFramesFixer\debug\14.jar --classpath_entry D:\GitHub\sony\rat-test-app\app\build\intermediates\transforms\stackFramesFixer\debug\15.jar --classpath_entry D:\GitHub\sony\rat-test-app\app\build\intermediates\transforms\stackFramesFixer\debug\16.jar --classpath_entry D:\GitHub\sony\rat-test-app\app\build\intermediates\transforms\stackFramesFixer\debug\17.jar --classpath_entry D:\GitHub\sony\rat-test-app\app\build\intermediates\transforms\stackFramesFixer\debug\18.jar --classpath_entry D:\GitHub\sony\rat-test-app\app\build\intermediates\transforms\stackFramesFixer\debug\19.jar --bootclasspath_entry C:\Users\23060884\AppData\Local\Android\Sdk\platforms\android-27\android.jar --bootclasspath_entry C:\Users\23060884\AppData\Local\Android\Sdk\platforms\android-27\optional\org.apache.http.legacy.jar --bootclasspath_entry C:\Program Files\Android\Android Studio\jre\jre\lib\resources.jar --bootclasspath_entry C:\Program Files\Android\Android Studio\jre\jre\lib\rt.jar --bootclasspath_entry C:\Program Files\Android\Android Studio\jre\jre\lib\jsse.jar --bootclasspath_entry C:\Program Files\Android\Android Studio\jre\jre\lib\jce.jar --bootclasspath_entry C:\Program Files\Android\Android Studio\jre\jre\lib\charsets.jar --min_sdk_version 24 --nodesugar_try_with_resources_if_needed --desugar_try_with_resources_omit_runtime_classes}
  115.     at com.android.build.gradle.internal.transforms.DesugarTransform.transform(DesugarTransform.java:236)
  116.     at com.android.build.gradle.internal.pipeline.TransformTask$2.call(TransformTask.java:222)
  117.     at com.android.build.gradle.internal.pipeline.TransformTask$2.call(TransformTask.java:218)
  118.     at com.android.builder.profile.ThreadRecorder.record(ThreadRecorder.java:102)
  119.     ... 39 more
  120. Caused by: java.lang.RuntimeException: java.lang.RuntimeException: com.android.ide.common.process.ProcessException: Error while executing java process with main class com.google.devtools.build.android.desugar.Desugar with arguments {--input D:\GitHub\sony\rat-test-app\app\build\intermediates\transforms\stackFramesFixer\debug\0.jar --output D:\GitHub\sony\rat-test-app\app\build\intermediates\transforms\desugar\debug\1.jar --input D:\GitHub\sony\rat-test-app\app\build\intermediates\transforms\stackFramesFixer\debug\1.jar --output D:\GitHub\sony\rat-test-app\app\build\intermediates\transforms\desugar\debug\2.jar --input D:\GitHub\sony\rat-test-app\app\build\intermediates\transforms\stackFramesFixer\debug\19.jar --output D:\GitHub\sony\rat-test-app\app\build\intermediates\transforms\desugar\debug\20.jar --classpath_entry D:\GitHub\sony\rat-test-app\app\build\intermediates\classes\debug --classpath_entry D:\GitHub\sony\rat-test-app\app\build\intermediates\transforms\stackFramesFixer\debug\0.jar --classpath_entry D:\GitHub\sony\rat-test-app\app\build\intermediates\transforms\stackFramesFixer\debug\1.jar --classpath_entry D:\GitHub\sony\rat-test-app\app\build\intermediates\transforms\stackFramesFixer\debug\2.jar --classpath_entry D:\GitHub\sony\rat-test-app\app\build\intermediates\transforms\stackFramesFixer\debug\3.jar --classpath_entry D:\GitHub\sony\rat-test-app\app\build\intermediates\transforms\stackFramesFixer\debug\4.jar --classpath_entry D:\GitHub\sony\rat-test-app\app\build\intermediates\transforms\stackFramesFixer\debug\5.jar --classpath_entry D:\GitHub\sony\rat-test-app\app\build\intermediates\transforms\stackFramesFixer\debug\6.jar --classpath_entry D:\GitHub\sony\rat-test-app\app\build\intermediates\transforms\stackFramesFixer\debug\7.jar --classpath_entry D:\GitHub\sony\rat-test-app\app\build\intermediates\transforms\stackFramesFixer\debug\8.jar --classpath_entry D:\GitHub\sony\rat-test-app\app\build\intermediates\transforms\stackFramesFixer\debug\9.jar --classpath_entry D:\GitHub\sony\rat-test-app\app\build\intermediates\transforms\stackFramesFixer\debug\10.jar --classpath_entry D:\GitHub\sony\rat-test-app\app\build\intermediates\transforms\stackFramesFixer\debug\11.jar --classpath_entry D:\GitHub\sony\rat-test-app\app\build\intermediates\transforms\stackFramesFixer\debug\12.jar --classpath_entry D:\GitHub\sony\rat-test-app\app\build\intermediates\transforms\stackFramesFixer\debug\13.jar --classpath_entry D:\GitHub\sony\rat-test-app\app\build\intermediates\transforms\stackFramesFixer\debug\14.jar --classpath_entry D:\GitHub\sony\rat-test-app\app\build\intermediates\transforms\stackFramesFixer\debug\15.jar --classpath_entry D:\GitHub\sony\rat-test-app\app\build\intermediates\transforms\stackFramesFixer\debug\16.jar --classpath_entry D:\GitHub\sony\rat-test-app\app\build\intermediates\transforms\stackFramesFixer\debug\17.jar --classpath_entry D:\GitHub\sony\rat-test-app\app\build\intermediates\transforms\stackFramesFixer\debug\18.jar --classpath_entry D:\GitHub\sony\rat-test-app\app\build\intermediates\transforms\stackFramesFixer\debug\19.jar --bootclasspath_entry C:\Users\23060884\AppData\Local\Android\Sdk\platforms\android-27\android.jar --bootclasspath_entry C:\Users\23060884\AppData\Local\Android\Sdk\platforms\android-27\optional\org.apache.http.legacy.jar --bootclasspath_entry C:\Program Files\Android\Android Studio\jre\jre\lib\resources.jar --bootclasspath_entry C:\Program Files\Android\Android Studio\jre\jre\lib\rt.jar --bootclasspath_entry C:\Program Files\Android\Android Studio\jre\jre\lib\jsse.jar --bootclasspath_entry C:\Program Files\Android\Android Studio\jre\jre\lib\jce.jar --bootclasspath_entry C:\Program Files\Android\Android Studio\jre\jre\lib\charsets.jar --min_sdk_version 24 --nodesugar_try_with_resources_if_needed --desugar_try_with_resources_omit_runtime_classes}
  121.     at com.android.ide.common.internal.WaitableExecutor.waitForTasksWithQuickFail(WaitableExecutor.java:146)
  122.     at com.android.build.gradle.internal.transforms.DesugarTransform.transform(DesugarTransform.java:230)
  123.     ... 42 more
  124. Caused by: java.lang.RuntimeException: com.android.ide.common.process.ProcessException: Error while executing java process with main class com.google.devtools.build.android.desugar.Desugar with arguments {--input D:\GitHub\sony\rat-test-app\app\build\intermediates\transforms\stackFramesFixer\debug\0.jar --output D:\GitHub\sony\rat-test-app\app\build\intermediates\transforms\desugar\debug\1.jar --input D:\GitHub\sony\rat-test-app\app\build\intermediates\transforms\stackFramesFixer\debug\1.jar --output D:\GitHub\sony\rat-test-app\app\build\intermediates\transforms\desugar\debug\2.jar --input D:\GitHub\sony\rat-test-app\app\build\intermediates\transforms\stackFramesFixer\debug\19.jar --output D:\GitHub\sony\rat-test-app\app\build\intermediates\transforms\desugar\debug\20.jar --classpath_entry D:\GitHub\sony\rat-test-app\app\build\intermediates\classes\debug --classpath_entry D:\GitHub\sony\rat-test-app\app\build\intermediates\transforms\stackFramesFixer\debug\0.jar --classpath_entry D:\GitHub\sony\rat-test-app\app\build\intermediates\transforms\stackFramesFixer\debug\1.jar --classpath_entry D:\GitHub\sony\rat-test-app\app\build\intermediates\transforms\stackFramesFixer\debug\2.jar --classpath_entry D:\GitHub\sony\rat-test-app\app\build\intermediates\transforms\stackFramesFixer\debug\3.jar --classpath_entry D:\GitHub\sony\rat-test-app\app\build\intermediates\transforms\stackFramesFixer\debug\4.jar --classpath_entry D:\GitHub\sony\rat-test-app\app\build\intermediates\transforms\stackFramesFixer\debug\5.jar --classpath_entry D:\GitHub\sony\rat-test-app\app\build\intermediates\transforms\stackFramesFixer\debug\6.jar --classpath_entry D:\GitHub\sony\rat-test-app\app\build\intermediates\transforms\stackFramesFixer\debug\7.jar --classpath_entry D:\GitHub\sony\rat-test-app\app\build\intermediates\transforms\stackFramesFixer\debug\8.jar --classpath_entry D:\GitHub\sony\rat-test-app\app\build\intermediates\transforms\stackFramesFixer\debug\9.jar --classpath_entry D:\GitHub\sony\rat-test-app\app\build\intermediates\transforms\stackFramesFixer\debug\10.jar --classpath_entry D:\GitHub\sony\rat-test-app\app\build\intermediates\transforms\stackFramesFixer\debug\11.jar --classpath_entry D:\GitHub\sony\rat-test-app\app\build\intermediates\transforms\stackFramesFixer\debug\12.jar --classpath_entry D:\GitHub\sony\rat-test-app\app\build\intermediates\transforms\stackFramesFixer\debug\13.jar --classpath_entry D:\GitHub\sony\rat-test-app\app\build\intermediates\transforms\stackFramesFixer\debug\14.jar --classpath_entry D:\GitHub\sony\rat-test-app\app\build\intermediates\transforms\stackFramesFixer\debug\15.jar --classpath_entry D:\GitHub\sony\rat-test-app\app\build\intermediates\transforms\stackFramesFixer\debug\16.jar --classpath_entry D:\GitHub\sony\rat-test-app\app\build\intermediates\transforms\stackFramesFixer\debug\17.jar --classpath_entry D:\GitHub\sony\rat-test-app\app\build\intermediates\transforms\stackFramesFixer\debug\18.jar --classpath_entry D:\GitHub\sony\rat-test-app\app\build\intermediates\transforms\stackFramesFixer\debug\19.jar --bootclasspath_entry C:\Users\23060884\AppData\Local\Android\Sdk\platforms\android-27\android.jar --bootclasspath_entry C:\Users\23060884\AppData\Local\Android\Sdk\platforms\android-27\optional\org.apache.http.legacy.jar --bootclasspath_entry C:\Program Files\Android\Android Studio\jre\jre\lib\resources.jar --bootclasspath_entry C:\Program Files\Android\Android Studio\jre\jre\lib\rt.jar --bootclasspath_entry C:\Program Files\Android\Android Studio\jre\jre\lib\jsse.jar --bootclasspath_entry C:\Program Files\Android\Android Studio\jre\jre\lib\jce.jar --bootclasspath_entry C:\Program Files\Android\Android Studio\jre\jre\lib\charsets.jar --min_sdk_version 24 --nodesugar_try_with_resources_if_needed --desugar_try_with_resources_omit_runtime_classes}
  125. Caused by: com.android.ide.common.process.ProcessException: Error while executing java process with main class com.google.devtools.build.android.desugar.Desugar with arguments {--input D:\GitHub\sony\rat-test-app\app\build\intermediates\transforms\stackFramesFixer\debug\0.jar --output D:\GitHub\sony\rat-test-app\app\build\intermediates\transforms\desugar\debug\1.jar --input D:\GitHub\sony\rat-test-app\app\build\intermediates\transforms\stackFramesFixer\debug\1.jar --output D:\GitHub\sony\rat-test-app\app\build\intermediates\transforms\desugar\debug\2.jar --input D:\GitHub\sony\rat-test-app\app\build\intermediates\transforms\stackFramesFixer\debug\19.jar --output D:\GitHub\sony\rat-test-app\app\build\intermediates\transforms\desugar\debug\20.jar --classpath_entry D:\GitHub\sony\rat-test-app\app\build\intermediates\classes\debug --classpath_entry D:\GitHub\sony\rat-test-app\app\build\intermediates\transforms\stackFramesFixer\debug\0.jar --classpath_entry D:\GitHub\sony\rat-test-app\app\build\intermediates\transforms\stackFramesFixer\debug\1.jar --classpath_entry D:\GitHub\sony\rat-test-app\app\build\intermediates\transforms\stackFramesFixer\debug\2.jar --classpath_entry D:\GitHub\sony\rat-test-app\app\build\intermediates\transforms\stackFramesFixer\debug\3.jar --classpath_entry D:\GitHub\sony\rat-test-app\app\build\intermediates\transforms\stackFramesFixer\debug\4.jar --classpath_entry D:\GitHub\sony\rat-test-app\app\build\intermediates\transforms\stackFramesFixer\debug\5.jar --classpath_entry D:\GitHub\sony\rat-test-app\app\build\intermediates\transforms\stackFramesFixer\debug\6.jar --classpath_entry D:\GitHub\sony\rat-test-app\app\build\intermediates\transforms\stackFramesFixer\debug\7.jar --classpath_entry D:\GitHub\sony\rat-test-app\app\build\intermediates\transforms\stackFramesFixer\debug\8.jar --classpath_entry D:\GitHub\sony\rat-test-app\app\build\intermediates\transforms\stackFramesFixer\debug\9.jar --classpath_entry D:\GitHub\sony\rat-test-app\app\build\intermediates\transforms\stackFramesFixer\debug\10.jar --classpath_entry D:\GitHub\sony\rat-test-app\app\build\intermediates\transforms\stackFramesFixer\debug\11.jar --classpath_entry D:\GitHub\sony\rat-test-app\app\build\intermediates\transforms\stackFramesFixer\debug\12.jar --classpath_entry D:\GitHub\sony\rat-test-app\app\build\intermediates\transforms\stackFramesFixer\debug\13.jar --classpath_entry D:\GitHub\sony\rat-test-app\app\build\intermediates\transforms\stackFramesFixer\debug\14.jar --classpath_entry D:\GitHub\sony\rat-test-app\app\build\intermediates\transforms\stackFramesFixer\debug\15.jar --classpath_entry D:\GitHub\sony\rat-test-app\app\build\intermediates\transforms\stackFramesFixer\debug\16.jar --classpath_entry D:\GitHub\sony\rat-test-app\app\build\intermediates\transforms\stackFramesFixer\debug\17.jar --classpath_entry D:\GitHub\sony\rat-test-app\app\build\intermediates\transforms\stackFramesFixer\debug\18.jar --classpath_entry D:\GitHub\sony\rat-test-app\app\build\intermediates\transforms\stackFramesFixer\debug\19.jar --bootclasspath_entry C:\Users\23060884\AppData\Local\Android\Sdk\platforms\android-27\android.jar --bootclasspath_entry C:\Users\23060884\AppData\Local\Android\Sdk\platforms\android-27\optional\org.apache.http.legacy.jar --bootclasspath_entry C:\Program Files\Android\Android Studio\jre\jre\lib\resources.jar --bootclasspath_entry C:\Program Files\Android\Android Studio\jre\jre\lib\rt.jar --bootclasspath_entry C:\Program Files\Android\Android Studio\jre\jre\lib\jsse.jar --bootclasspath_entry C:\Program Files\Android\Android Studio\jre\jre\lib\jce.jar --bootclasspath_entry C:\Program Files\Android\Android Studio\jre\jre\lib\charsets.jar --min_sdk_version 24 --nodesugar_try_with_resources_if_needed --desugar_try_with_resources_omit_runtime_classes}
  126.     at com.android.build.gradle.internal.process.GradleProcessResult.buildProcessException(GradleProcessResult.java:73)
  127.     at com.android.build.gradle.internal.process.GradleProcessResult.assertNormalExitValue(GradleProcessResult.java:48)
  128.     at com.android.build.gradle.internal.transforms.DesugarTransform.lambda$processNonCachedOnes$3(DesugarTransform.java:316)
  129. Caused by: org.gradle.process.internal.ExecException: Process 'command 'C:\Program Files\Android\Android Studio\jre\bin\java.exe'' finished with non-zero exit value 1
  130.     at org.gradle.process.internal.DefaultExecHandle$ExecResultImpl.assertNormalExitValue(DefaultExecHandle.java:380)
  131.     at com.android.build.gradle.internal.process.GradleProcessResult.assertNormalExitValue(GradleProcessResult.java:46)
  132.     ... 1 more
  133.  
  134.  
  135. * Get more help at https://help.gradle.org
  136.  
  137. BUILD FAILED in 33s
  138.  
  139. 19 actionable tasks: 3 executed, 16 up-to-date
RAW Paste Data
We use cookies for various purposes including analytics. By continuing to use Pastebin, you agree to our use of cookies as described in the Cookies Policy. OK, I Understand
 
Top