hanslovsky

failed texture build

Aug 3rd, 2016
172
0
Never
Not a member of Pastebin yet? Sign Up, it unlocks many cool features!
Bash 1.05 KB | None | 0 0
  1. building 'skimage.feature._texture' extension
  2. compiling C sources
  3. C compiler: gcc -pthread -Wno-unused-result -Wsign-compare -DNDEBUG -g -fwrapv -O3 -Wall -Wstrict-prototypes -march=x86-64 -mtune=generic -O2 -pipe -fstack-protector-strong -fPIC
  4.  
  5. compile options: '-I/usr/lib/python3.5/site-packages/numpy/core/include -Iskimage/_shared -I/usr/lib/python3.5/site-packages/numpy/core/include -I/usr/include/python3.5m -c'
  6. gcc: _texture.c
  7. gcc: error: _texture.c: No such file or directory
  8. gcc: fatal error: no input files
  9. compilation terminated.
  10. gcc: error: _texture.c: No such file or directory
  11. gcc: fatal error: no input files
  12. compilation terminated.
  13. error: Command "gcc -pthread -Wno-unused-result -Wsign-compare -DNDEBUG -g -fwrapv -O3 -Wall -Wstrict-prototypes -march=x86-64 -mtune=generic -O2 -pipe -fstack-protector-strong -fPIC -I/usr/lib/python3.5/site-packages/numpy/core/include -Iskimage/_shared -I/usr/lib/python3.5/site-packages/numpy/core/include -I/usr/include/python3.5m -c _texture.c -o build/temp.linux-x86_64-3.5/_texture.o" failed with exit status 1
Advertisement
Add Comment
Please, Sign In to add comment