daily pastebin goal
0%
SHARE
TWEET

Untitled

a guest Nov 19th, 2017 46 Never
Not a member of Pastebin yet? Sign Up, it unlocks many cool features!
  1. Dist std stage2 (x86_64-unknown-linux-gnu -> x86_64-unknown-fuchsia)                                                                                                                                                                                                                                                                                                                                                                    
  2. Building stage2 std artifacts (x86_64-unknown-linux-gnu -> x86_64-unknown-fuchsia)                                                                                                                                                                                                                                                                                                                                                      
  3.    Compiling core v0.0.0 (file:///usr/local/google/home/phosek/fuchsia/infra/recipes/.recipe_deps/recipe_engine/workdir/rust/src/libcore)                                                                                                                                                                                                                                                                                                
  4.    Compiling cc v1.0.3                                                                                                                                                                                              
  5.    Compiling cfg-if v0.1.2                                                                                                                                                                                                                                                                                                                                                                                                              
  6.    Compiling libc v0.2.33                                                                                                                                                                                                                                                                                                                                                                                                                
  7.    Compiling unwind v0.0.0 (file:///usr/local/google/home/phosek/fuchsia/infra/recipes/.recipe_deps/recipe_engine/workdir/rust/src/libunwind)                                                                                                                                                                                                                                                                                            
  8.    Compiling filetime v0.1.14                                                                                                                                                                                      
  9.    Compiling build_helper v0.1.0 (file:///usr/local/google/home/phosek/fuchsia/infra/recipes/.recipe_deps/recipe_engine/workdir/rust/src/build_helper)                                                              
  10.    Compiling std v0.0.0 (file:///usr/local/google/home/phosek/fuchsia/infra/recipes/.recipe_deps/recipe_engine/workdir/rust/src/libstd)                                                                            
  11.    Compiling alloc_jemalloc v0.0.0 (file:///usr/local/google/home/phosek/fuchsia/infra/recipes/.recipe_deps/recipe_engine/workdir/rust/src/liballoc_jemalloc)                                                      
  12.    Compiling compiler_builtins v0.0.0 (file:///usr/local/google/home/phosek/fuchsia/infra/recipes/.recipe_deps/recipe_engine/workdir/rust/src/rustc/compiler_builtins_shim)                                                                                                                                                                                                                                                              
  13.    Compiling libc v0.0.0 (file:///usr/local/google/home/phosek/fuchsia/infra/recipes/.recipe_deps/recipe_engine/workdir/rust/src/rustc/libc_shim)                                                                  
  14.    Compiling std_unicode v0.0.0 (file:///usr/local/google/home/phosek/fuchsia/infra/recipes/.recipe_deps/recipe_engine/workdir/rust/src/libstd_unicode)                                                            
  15.    Compiling alloc v0.0.0 (file:///usr/local/google/home/phosek/fuchsia/infra/recipes/.recipe_deps/recipe_engine/workdir/rust/src/liballoc)                                                                                                                                                                                                                                                                                              
  16.    Compiling panic_abort v0.0.0 (file:///usr/local/google/home/phosek/fuchsia/infra/recipes/.recipe_deps/recipe_engine/workdir/rust/src/libpanic_abort)                                                            
  17.    Compiling alloc_system v0.0.0 (file:///usr/local/google/home/phosek/fuchsia/infra/recipes/.recipe_deps/recipe_engine/workdir/rust/src/liballoc_system)                                                            
  18.    Compiling panic_unwind v0.0.0 (file:///usr/local/google/home/phosek/fuchsia/infra/recipes/.recipe_deps/recipe_engine/workdir/rust/src/libpanic_unwind)                                                            
  19. warning: redundant linker flag specified for library `zircon`                                                                                                                                                        
  20.                                                                                                                                                                                                                    
  21. error: linking with `/usr/local/google/home/phosek/fuchsia/infra/recipes/.recipe_deps/recipe_engine/workdir/cipd/bin/clang` failed: exit code: 1                                                                      
  22.   |                                                                                                                                                                                                                
  23.   = note: "/usr/local/google/home/phosek/fuchsia/infra/recipes/.recipe_deps/recipe_engine/workdir/cipd/bin/clang" "-m64" "-L" "/tmp/rust37SjGR/build/build/x86_64-unknown-linux-gnu/stage2/lib/rustlib/x86_64-unknown-fuchsia/lib" "/tmp/rust37SjGR/build/build/x86_64-unknown-linux-gnu/stage2-std/x86_64-unknown-fuchsia/release/deps/std-900492c518518de6.std0.rcgu.o" "-o" "/tmp/rust37SjGR/build/build/x86_64-unknown-linux-gnu/stag
  24. e2-std/x86_64-unknown-fuchsia/release/deps/libstd-900492c518518de6.so" "/tmp/rust37SjGR/build/build/x86_64-unknown-linux-gnu/stage2-std/x86_64-unknown-fuchsia/release/deps/std-900492c518518de6.crate.metadata.rcgu.o" "/tmp/rust37SjGR/build/build/x86_64-unknown-linux-gnu/stage2-std/x86_64-unknown-fuchsia/release/deps/std-900492c518518de6.crate.allocator.rcgu.o" "-Wl,-O1" "-nodefaultlibs" "-L" "/tmp/rust37SjGR/build/build/x8
  25. 6_64-unknown-linux-gnu/stage2-std/x86_64-unknown-fuchsia/release/deps" "-L" "/tmp/rust37SjGR/build/build/x86_64-unknown-linux-gnu/stage2-std/release/deps" "-L" "/tmp/rust37SjGR/build/build/x86_64-unknown-linux-gnu/stage2-std/x86_64-unknown-fuchsia/release/build/compiler_builtins-99d026c58a4d1f20/out" "-L" "/tmp/rust37SjGR/build/build/x86_64-unknown-linux-gnu/stage2/lib/rustlib/x86_64-unknown-fuchsia/lib" "-l" "zircon" "-l
  26. " "backtrace" "-l" "fdio" "-l" "launchpad" "-Wl,-Bstatic" "-Wl,--whole-archive" "/tmp/rustc.PO3CfQwI9HTQ/liballoc_system-9ff2c67f40fe5858.rlib" "-Wl,--no-whole-archive" "-Wl,--whole-archive" "/tmp/rustc.PO3CfQwI9HTQ/libpanic_unwind-5bef2c52ac19d279.rlib" "-Wl,--no-whole-archive" "-Wl,--whole-archive" "/tmp/rustc.PO3CfQwI9HTQ/libunwind-3830ae5679a0b739.rlib" "-Wl,--no-whole-archive" "-Wl,--whole-archive" "/tmp/rustc.PO3CfQ
  27. wI9HTQ/liblibc-e1c7eeeb00260d82.rlib" "-Wl,--no-whole-archive" "-Wl,--whole-archive" "/tmp/rustc.PO3CfQwI9HTQ/liballoc-bad119b0f880de53.rlib" "-Wl,--no-whole-archive" "-Wl,--whole-archive" "/tmp/rustc.PO3CfQwI9HTQ/libstd_unicode-c87147d9878a34a6.rlib" "-Wl,--no-whole-archive" "-Wl,--whole-archive" "/tmp/rustc.PO3CfQwI9HTQ/libcore-f61c023fb8fcfea8.rlib" "-Wl,--no-whole-archive" "/tmp/rustc.PO3CfQwI9HTQ/libcompiler_builtins
  28. -3b206b25583c2149.rlib" "-Wl,-Bdynamic" "-l" "unwind" "-l" "c" "-l" "fdio" "-shared" "-Wl,-rpath,$ORIGIN/../lib"                                                                                                                                                                                                                                                                                                                        
  29.   = note: /usr/local/google/home/phosek/fuchsia/infra/recipes/.recipe_deps/recipe_engine/workdir/cipd/bin/ld.lld: error: unable to find library -lzircon                                                                                                                                                                                                                                                                                
  30.           /usr/local/google/home/phosek/fuchsia/infra/recipes/.recipe_deps/recipe_engine/workdir/cipd/bin/ld.lld: error: unable to find library -lfdio                                                              
  31.           /usr/local/google/home/phosek/fuchsia/infra/recipes/.recipe_deps/recipe_engine/workdir/cipd/bin/ld.lld: error: unable to find library -llaunchpad                                                        
  32.           /usr/local/google/home/phosek/fuchsia/infra/recipes/.recipe_deps/recipe_engine/workdir/cipd/bin/ld.lld: error: unable to find library -lfdio                                                              
  33.           clang-6.0: error: linker command failed with exit code 1 (use -v to see invocation)                                                                                                                      
  34.                                                                                                                                                                                                                                                                                                                                                                                                                                          
  35.                                                                                                                                                                                                                    
  36. error: aborting due to previous error                                                                    
  37.                                                      
  38. error: Could not compile `std`.                                                                                                                                                                                    
  39.                                                                                                          
  40. Caused by:                                                                                                                                                                                                                                                                                                                                                                                                                              
  41.   process didn't exit successfully: `/tmp/rust37SjGR/build/build/bootstrap/debug/rustc --crate-name std /usr/local/google/home/phosek/fuchsia/infra/recipes/.recipe_deps/recipe_engine/workdir/rust/src/libstd/lib.rs --error-format json --crate-type dylib --crate-type rlib --emit=dep-info,link -C prefer-dynamic -C opt-level=2 --cfg feature="alloc_jemalloc" --cfg feature="backtrace" --cfg feature="jemalloc" --cfg feature="pan
  42. ic-unwind" --cfg feature="panic_unwind" -C metadata=900492c518518de6 -C extra-filename=-900492c518518de6 --out-dir /tmp/rust37SjGR/build/build/x86_64-unknown-linux-gnu/stage2-std/x86_64-unknown-fuchsia/release/deps --target x86_64-unknown-fuchsia -L dependency=/tmp/rust37SjGR/build/build/x86_64-unknown-linux-gnu/stage2-std/x86_64-unknown-fuchsia/release/deps -L dependency=/tmp/rust37SjGR/build/build/x86_64-unknown-linux-g
  43. nu/stage2-std/release/deps --extern unwind=/tmp/rust37SjGR/build/build/x86_64-unknown-linux-gnu/stage2-std/x86_64-unknown-fuchsia/release/deps/libunwind-3830ae5679a0b739.rlib --extern alloc_jemalloc=/tmp/rust37SjGR/build/build/x86_64-unknown-linux-gnu/stage2-std/x86_64-unknown-fuchsia/release/deps/liballoc_jemalloc-d968840184876236.rlib --extern compiler_builtins=/tmp/rust37SjGR/build/build/x86_64-unknown-linux-gnu/stage2
  44. -std/x86_64-unknown-fuchsia/release/deps/libcompiler_builtins-3b206b25583c2149.rlib --extern alloc_system=/tmp/rust37SjGR/build/build/x86_64-unknown-linux-gnu/stage2-std/x86_64-unknown-fuchsia/release/deps/liballoc_system-9ff2c67f40fe5858.rlib --extern panic_unwind=/tmp/rust37SjGR/build/build/x86_64-unknown-linux-gnu/stage2-std/x86_64-unknown-fuchsia/release/deps/libpanic_unwind-5bef2c52ac19d279.rlib --extern std_unicode=
  45. /tmp/rust37SjGR/build/build/x86_64-unknown-linux-gnu/stage2-std/x86_64-unknown-fuchsia/release/deps/libstd_unicode-c87147d9878a34a6.rlib --extern core=/tmp/rust37SjGR/build/build/x86_64-unknown-linux-gnu/stage2-std/x86_64-unknown-fuchsia/release/deps/libcore-f61c023fb8fcfea8.rlib --extern libc=/tmp/rust37SjGR/build/build/x86_64-unknown-linux-gnu/stage2-std/x86_64-unknown-fuchsia/release/deps/liblibc-e1c7eeeb00260d82.rlib
  46. --extern alloc=/tmp/rust37SjGR/build/build/x86_64-unknown-linux-gnu/stage2-std/x86_64-unknown-fuchsia/release/deps/liballoc-bad119b0f880de53.rlib --extern panic_abort=/tmp/rust37SjGR/build/build/x86_64-unknown-linux-gnu/stage2-std/x86_64-unknown-fuchsia/release/deps/libpanic_abort-e9dd47ab30424812.rlib -l backtrace -l zircon -l fdio -l launchpad -L native=/tmp/rust37SjGR/build/build/x86_64-unknown-linux-gnu/stage2-std/x86
  47. _64-unknown-fuchsia/release/build/compiler_builtins-99d026c58a4d1f20/out` (exit code: 101)                                                                                                                            
  48. thread 'main' panicked at 'command did not execute successfully: "/tmp/rust37SjGR/build/build/x86_64-unknown-linux-gnu/stage0/bin/cargo" "build" "--target" "x86_64-unknown-fuchsia" "-j" "56" "--release" "--features" "panic-unwind jemalloc backtrace" "--manifest-path" "/usr/local/google/home/phosek/fuchsia/infra/recipes/.recipe_deps/recipe_engine/workdir/rust/src/libstd/Cargo.toml" "--message-format" "json"                
  49. expected success, got: exit code: 101', /usr/local/google/home/phosek/fuchsia/infra/recipes/.recipe_deps/recipe_engine/workdir/rust/src/bootstrap/compile.rs:882:8                                                                                                                                                                                                                                                                      
  50. note: Run with `RUST_BACKTRACE=1` for a backtrace.                                                                                                                                                                                                                                                                                                                                                                                      
  51. failed to run: /tmp/rust37SjGR/build/build/bootstrap/debug/bootstrap install --config /tmp/rust37SjGR/build/config.toml                                                                                                                                                                                                                                                                                                                  
  52. Build completed unsuccessfully in 0:25:13                                                                                                                                                                          
  53. step returned non-zero exit code: 1
RAW Paste Data
Top