Advertisement
Guest User

Untitled

a guest
Dec 13th, 2016
90
Never
Not a member of Pastebin yet? Sign Up, it unlocks many cool features!
Bash 45.76 KB | None
  1. scons: Reading SConscript files ...
  2. scons: done reading SConscript files.
  3. scons: Building targets ...
  4. /home/ubuntu/source/staging_dir/toolchain-mipsel_74kc_gcc-5.4.0_musl-1.1.15/bin/mipsel-openwrt-linux-musl-gcc -o src/bloomd/config.o -c -std=c99 -D_GNU_SOURCE -O2 -pthread -Isrc/bloomd/ -Ideps/inih/ -Ideps/libev/ -Isrc/libbloom/ -I/home/ubuntu/source/build_dir/toolchain-mipsel_74kc_gcc-5.4.0_musl-1.1.15/gcc-5.4.0/gcc/config/i386 src/bloomd/config.c
  5. mipsel-openwrt-linux-musl-gcc: warning: environment variable 'STAGING_DIR' not defined
  6. /home/ubuntu/source/staging_dir/toolchain-mipsel_74kc_gcc-5.4.0_musl-1.1.15/bin/mipsel-openwrt-linux-musl-gcc -o src/bloomd/networking.o -c -std=c99 -D_GNU_SOURCE -O2 -pthread -Isrc/bloomd/ -Ideps/inih/ -Ideps/libev/ -Isrc/libbloom/ src/bloomd/networking.c
  7. mipsel-openwrt-linux-musl-gcc: warning: environment variable 'STAGING_DIR' not defined
  8. /home/ubuntu/source/staging_dir/toolchain-mipsel_74kc_gcc-5.4.0_musl-1.1.15/bin/mipsel-openwrt-linux-musl-gcc -o src/bloomd/barrier.o -c -std=c99 -D_GNU_SOURCE -O2 -pthread -Isrc/bloomd/ -Ideps/inih/ -Ideps/libev/ -Isrc/libbloom/ -I/home/ubuntu/source/build_dir/toolchain-mipsel_74kc_gcc-5.4.0_musl-1.1.15/gcc-5.4.0/gcc/config/i386 src/bloomd/barrier.c
  9. mipsel-openwrt-linux-musl-gcc: warning: environment variable 'STAGING_DIR' not defined
  10. /home/ubuntu/source/staging_dir/toolchain-mipsel_74kc_gcc-5.4.0_musl-1.1.15/bin/mipsel-openwrt-linux-musl-gcc -o src/bloomd/conn_handler.o -c -std=c99 -D_GNU_SOURCE -O2 -pthread -Isrc/bloomd/ -Ideps/inih/ -Ideps/libev/ -Isrc/libbloom/ -I/home/ubuntu/source/build_dir/toolchain-mipsel_74kc_gcc-5.4.0_musl-1.1.15/gcc-5.4.0/gcc/config/i386 src/bloomd/conn_handler.c
  11. mipsel-openwrt-linux-musl-gcc: warning: environment variable 'STAGING_DIR' not defined
  12. /home/ubuntu/source/staging_dir/toolchain-mipsel_74kc_gcc-5.4.0_musl-1.1.15/bin/mipsel-openwrt-linux-musl-gcc -o src/bloomd/filter.o -c -std=c99 -D_GNU_SOURCE -O2 -pthread -Isrc/bloomd/ -Ideps/inih/ -Ideps/libev/ -Isrc/libbloom/ -I/home/ubuntu/source/build_dir/toolchain-mipsel_74kc_gcc-5.4.0_musl-1.1.15/gcc-5.4.0/gcc/config/i386 src/bloomd/filter.c
  13. mipsel-openwrt-linux-musl-gcc: warning: environment variable 'STAGING_DIR' not defined
  14. /home/ubuntu/source/staging_dir/toolchain-mipsel_74kc_gcc-5.4.0_musl-1.1.15/bin/mipsel-openwrt-linux-musl-gcc -o src/bloomd/filter_manager.o -c -std=c99 -D_GNU_SOURCE -O2 -pthread -Isrc/bloomd/ -Ideps/inih/ -Ideps/libev/ -Isrc/libbloom/ -I/home/ubuntu/source/build_dir/toolchain-mipsel_74kc_gcc-5.4.0_musl-1.1.15/gcc-5.4.0/gcc/config/i386 src/bloomd/filter_manager.c
  15. mipsel-openwrt-linux-musl-gcc: warning: environment variable 'STAGING_DIR' not defined
  16. /home/ubuntu/source/staging_dir/toolchain-mipsel_74kc_gcc-5.4.0_musl-1.1.15/bin/mipsel-openwrt-linux-musl-gcc -o src/bloomd/background.o -c -std=c99 -D_GNU_SOURCE -O2 -pthread -Isrc/bloomd/ -Ideps/inih/ -Ideps/libev/ -Isrc/libbloom/ -I/home/ubuntu/source/build_dir/toolchain-mipsel_74kc_gcc-5.4.0_musl-1.1.15/gcc-5.4.0/gcc/config/i386 src/bloomd/background.c
  17. mipsel-openwrt-linux-musl-gcc: warning: environment variable 'STAGING_DIR' not defined
  18. /home/ubuntu/source/staging_dir/toolchain-mipsel_74kc_gcc-5.4.0_musl-1.1.15/bin/mipsel-openwrt-linux-musl-gcc -o src/bloomd/art.o -c -std=c99 -D_GNU_SOURCE -O2 -pthread -Isrc/bloomd/ -Ideps/inih/ -Ideps/libev/ -Isrc/libbloom/ -I/home/ubuntu/source/build_dir/toolchain-mipsel_74kc_gcc-5.4.0_musl-1.1.15/gcc-5.4.0/gcc/config/i386 src/bloomd/art.c
  19. mipsel-openwrt-linux-musl-gcc: warning: environment variable 'STAGING_DIR' not defined
  20. In file included from /home/ubuntu/source/build_dir/toolchain-mipsel_74kc_gcc-5.4.0_musl-1.1.15/gcc-5.4.0/gcc/config/i386/xmmintrin.h:31:0,
  21.                  from /home/ubuntu/source/build_dir/toolchain-mipsel_74kc_gcc-5.4.0_musl-1.1.15/gcc-5.4.0/gcc/config/i386/emmintrin.h:31,
  22.                  from src/bloomd/art.c:5:
  23. /home/ubuntu/source/build_dir/toolchain-mipsel_74kc_gcc-5.4.0_musl-1.1.15/gcc-5.4.0/gcc/config/i386/mmintrin.h:32:9: warning: #pragma GCC target is not supported for this machine [-Wpragmas]
  24.  #pragma GCC target("mmx")
  25.          ^
  26. /home/ubuntu/source/build_dir/toolchain-mipsel_74kc_gcc-5.4.0_musl-1.1.15/gcc-5.4.0/gcc/config/i386/mmintrin.h: In function '_mm_empty':
  27. /home/ubuntu/source/build_dir/toolchain-mipsel_74kc_gcc-5.4.0_musl-1.1.15/gcc-5.4.0/gcc/config/i386/mmintrin.h:51:3: warning: implicit declaration of function '__builtin_ia32_emms' [-Wimplicit-function-declaration]
  28.    __builtin_ia32_emms ();
  29.    ^
  30. /home/ubuntu/source/build_dir/toolchain-mipsel_74kc_gcc-5.4.0_musl-1.1.15/gcc-5.4.0/gcc/config/i386/mmintrin.h: In function '_mm_cvtsi32_si64':
  31. /home/ubuntu/source/build_dir/toolchain-mipsel_74kc_gcc-5.4.0_musl-1.1.15/gcc-5.4.0/gcc/config/i386/mmintrin.h:64:18: warning: implicit declaration of function '__builtin_ia32_vec_init_v2si' [-Wimplicit-function-declaration]
  32.    return (__m64) __builtin_ia32_vec_init_v2si (__i, 0);
  33.                   ^
  34. /home/ubuntu/source/build_dir/toolchain-mipsel_74kc_gcc-5.4.0_musl-1.1.15/gcc-5.4.0/gcc/config/i386/mmintrin.h:64:3: error: can't convert between vector values of different size
  35.   return (__m64) __builtin_ia32_vec_init_v2si (__i, 0);
  36.   ^
  37. /home/ubuntu/source/build_dir/toolchain-mipsel_74kc_gcc-5.4.0_musl-1.1.15/gcc-5.4.0/gcc/config/i386/mmintrin.h: In function '_mm_cvtsi64_si32':
  38. /home/ubuntu/source/build_dir/toolchain-mipsel_74kc_gcc-5.4.0_musl-1.1.15/gcc-5.4.0/gcc/config/i386/mmintrin.h:107:10: warning: implicit declaration of function '__builtin_ia32_vec_ext_v2si' [-Wimplicit-function-declaration]
  39.   return __builtin_ia32_vec_ext_v2si ((__v2si)__i, 0);
  40.          ^
  41. /home/ubuntu/source/build_dir/toolchain-mipsel_74kc_gcc-5.4.0_musl-1.1.15/gcc-5.4.0/gcc/config/i386/mmintrin.h: In function '_mm_packs_pi16':
  42. /home/ubuntu/source/build_dir/toolchain-mipsel_74kc_gcc-5.4.0_musl-1.1.15/gcc-5.4.0/gcc/config/i386/mmintrin.h:146:18: warning: implicit declaration of function '__builtin_ia32_packsswb' [-Wimplicit-function-declaration]
  43.   return (__m64) __builtin_ia32_packsswb ((__v4hi)__m1, (__v4hi)__m2);
  44.                  ^
  45. /home/ubuntu/source/build_dir/toolchain-mipsel_74kc_gcc-5.4.0_musl-1.1.15/gcc-5.4.0/gcc/config/i386/mmintrin.h:146:3: error: can't convert between vector values of different size
  46.    return (__m64) __builtin_ia32_packsswb ((__v4hi)__m1, (__v4hi)__m2);
  47.    ^
  48. /home/ubuntu/source/build_dir/toolchain-mipsel_74kc_gcc-5.4.0_musl-1.1.15/gcc-5.4.0/gcc/config/i386/mmintrin.h: In function '_mm_packs_pi32':
  49. /home/ubuntu/source/build_dir/toolchain-mipsel_74kc_gcc-5.4.0_musl-1.1.15/gcc-5.4.0/gcc/config/i386/mmintrin.h:161:18: warning: implicit declaration of function '__builtin_ia32_packssdw' [-Wimplicit-function-declaration]
  50.    return (__m64) __builtin_ia32_packssdw ((__v2si)__m1, (__v2si)__m2);
  51.                   ^
  52. /home/ubuntu/source/build_dir/toolchain-mipsel_74kc_gcc-5.4.0_musl-1.1.15/gcc-5.4.0/gcc/config/i386/mmintrin.h:161:3: error: can't convert between vector values of different size
  53.   return (__m64) __builtin_ia32_packssdw ((__v2si)__m1, (__v2si)__m2);
  54.   ^
  55. /home/ubuntu/source/build_dir/toolchain-mipsel_74kc_gcc-5.4.0_musl-1.1.15/gcc-5.4.0/gcc/config/i386/mmintrin.h: In function '_mm_packs_pu16':
  56. /home/ubuntu/source/build_dir/toolchain-mipsel_74kc_gcc-5.4.0_musl-1.1.15/gcc-5.4.0/gcc/config/i386/mmintrin.h:176:18: warning: implicit declaration of function '__builtin_ia32_packuswb' [-Wimplicit-function-declaration]
  57.   return (__m64) __builtin_ia32_packuswb ((__v4hi)__m1, (__v4hi)__m2);
  58.                  ^
  59. /home/ubuntu/source/build_dir/toolchain-mipsel_74kc_gcc-5.4.0_musl-1.1.15/gcc-5.4.0/gcc/config/i386/mmintrin.h:176:3: error: can't convert between vector values of different size
  60.    return (__m64) __builtin_ia32_packuswb ((__v4hi)__m1, (__v4hi)__m2);
  61.    ^
  62. /home/ubuntu/source/build_dir/toolchain-mipsel_74kc_gcc-5.4.0_musl-1.1.15/gcc-5.4.0/gcc/config/i386/mmintrin.h: In function '_mm_unpackhi_pi8':
  63. /home/ubuntu/source/build_dir/toolchain-mipsel_74kc_gcc-5.4.0_musl-1.1.15/gcc-5.4.0/gcc/config/i386/mmintrin.h:190:18: warning: implicit declaration of function '__builtin_ia32_punpckhbw' [-Wimplicit-function-declaration]
  64.    return (__m64) __builtin_ia32_punpckhbw ((__v8qi)__m1, (__v8qi)__m2);
  65.                   ^
  66. /home/ubuntu/source/build_dir/toolchain-mipsel_74kc_gcc-5.4.0_musl-1.1.15/gcc-5.4.0/gcc/config/i386/mmintrin.h:190:3: error: can't convert between vector values of different size
  67.   return (__m64) __builtin_ia32_punpckhbw ((__v8qi)__m1, (__v8qi)__m2);
  68.   ^
  69. /home/ubuntu/source/build_dir/toolchain-mipsel_74kc_gcc-5.4.0_musl-1.1.15/gcc-5.4.0/gcc/config/i386/mmintrin.h: In function '_mm_unpackhi_pi16':
  70. /home/ubuntu/source/build_dir/toolchain-mipsel_74kc_gcc-5.4.0_musl-1.1.15/gcc-5.4.0/gcc/config/i386/mmintrin.h:204:18: warning: implicit declaration of function '__builtin_ia32_punpckhwd' [-Wimplicit-function-declaration]
  71.   return (__m64) __builtin_ia32_punpckhwd ((__v4hi)__m1, (__v4hi)__m2);
  72.                  ^
  73. /home/ubuntu/source/build_dir/toolchain-mipsel_74kc_gcc-5.4.0_musl-1.1.15/gcc-5.4.0/gcc/config/i386/mmintrin.h:204:3: error: can't convert between vector values of different size
  74.    return (__m64) __builtin_ia32_punpckhwd ((__v4hi)__m1, (__v4hi)__m2);
  75.    ^
  76. /home/ubuntu/source/build_dir/toolchain-mipsel_74kc_gcc-5.4.0_musl-1.1.15/gcc-5.4.0/gcc/config/i386/mmintrin.h: In function '_mm_unpackhi_pi32':
  77. /home/ubuntu/source/build_dir/toolchain-mipsel_74kc_gcc-5.4.0_musl-1.1.15/gcc-5.4.0/gcc/config/i386/mmintrin.h:218:18: warning: implicit declaration of function '__builtin_ia32_punpckhdq' [-Wimplicit-function-declaration]
  78.    return (__m64) __builtin_ia32_punpckhdq ((__v2si)__m1, (__v2si)__m2);
  79.                   ^
  80. /home/ubuntu/source/build_dir/toolchain-mipsel_74kc_gcc-5.4.0_musl-1.1.15/gcc-5.4.0/gcc/config/i386/mmintrin.h:218:3: error: can't convert between vector values of different size
  81.   return (__m64) __builtin_ia32_punpckhdq ((__v2si)__m1, (__v2si)__m2);
  82.   ^
  83. /home/ubuntu/source/build_dir/toolchain-mipsel_74kc_gcc-5.4.0_musl-1.1.15/gcc-5.4.0/gcc/config/i386/mmintrin.h: In function '_mm_unpacklo_pi8':
  84. /home/ubuntu/source/build_dir/toolchain-mipsel_74kc_gcc-5.4.0_musl-1.1.15/gcc-5.4.0/gcc/config/i386/mmintrin.h:232:18: warning: implicit declaration of function '__builtin_ia32_punpcklbw' [-Wimplicit-function-declaration]
  85.   return (__m64) __builtin_ia32_punpcklbw ((__v8qi)__m1, (__v8qi)__m2);
  86.                  ^
  87. /home/ubuntu/source/build_dir/toolchain-mipsel_74kc_gcc-5.4.0_musl-1.1.15/gcc-5.4.0/gcc/config/i386/mmintrin.h:232:3: error: can't convert between vector values of different size
  88.    return (__m64) __builtin_ia32_punpcklbw ((__v8qi)__m1, (__v8qi)__m2);
  89.    ^
  90. /home/ubuntu/source/build_dir/toolchain-mipsel_74kc_gcc-5.4.0_musl-1.1.15/gcc-5.4.0/gcc/config/i386/mmintrin.h: In function '_mm_unpacklo_pi16':
  91. /home/ubuntu/source/build_dir/toolchain-mipsel_74kc_gcc-5.4.0_musl-1.1.15/gcc-5.4.0/gcc/config/i386/mmintrin.h:246:18: warning: implicit declaration of function '__builtin_ia32_punpcklwd' [-Wimplicit-function-declaration]
  92.    return (__m64) __builtin_ia32_punpcklwd ((__v4hi)__m1, (__v4hi)__m2);
  93.                   ^
  94. /home/ubuntu/source/build_dir/toolchain-mipsel_74kc_gcc-5.4.0_musl-1.1.15/gcc-5.4.0/gcc/config/i386/mmintrin.h:246:3: error: can't convert between vector values of different size
  95.   return (__m64) __builtin_ia32_punpcklwd ((__v4hi)__m1, (__v4hi)__m2);
  96.   ^
  97. /home/ubuntu/source/build_dir/toolchain-mipsel_74kc_gcc-5.4.0_musl-1.1.15/gcc-5.4.0/gcc/config/i386/mmintrin.h: In function '_mm_unpacklo_pi32':
  98. /home/ubuntu/source/build_dir/toolchain-mipsel_74kc_gcc-5.4.0_musl-1.1.15/gcc-5.4.0/gcc/config/i386/mmintrin.h:260:18: warning: implicit declaration of function '__builtin_ia32_punpckldq' [-Wimplicit-function-declaration]
  99.   return (__m64) __builtin_ia32_punpckldq ((__v2si)__m1, (__v2si)__m2);
  100.                  ^
  101. /home/ubuntu/source/build_dir/toolchain-mipsel_74kc_gcc-5.4.0_musl-1.1.15/gcc-5.4.0/gcc/config/i386/mmintrin.h:260:3: error: can't convert between vector values of different size
  102.    return (__m64) __builtin_ia32_punpckldq ((__v2si)__m1, (__v2si)__m2);
  103.    ^
  104. /home/ubuntu/source/build_dir/toolchain-mipsel_74kc_gcc-5.4.0_musl-1.1.15/gcc-5.4.0/gcc/config/i386/mmintrin.h: In function '_mm_add_pi8':
  105. /home/ubuntu/source/build_dir/toolchain-mipsel_74kc_gcc-5.4.0_musl-1.1.15/gcc-5.4.0/gcc/config/i386/mmintrin.h:273:18: warning: implicit declaration of function '__builtin_ia32_paddb' [-Wimplicit-function-declaration]
  106.    return (__m64) __builtin_ia32_paddb ((__v8qi)__m1, (__v8qi)__m2);
  107.                   ^
  108. /home/ubuntu/source/build_dir/toolchain-mipsel_74kc_gcc-5.4.0_musl-1.1.15/gcc-5.4.0/gcc/config/i386/mmintrin.h:273:3: error: can't convert between vector values of different size
  109.   return (__m64) __builtin_ia32_paddb ((__v8qi)__m1, (__v8qi)__m2);
  110.   ^
  111. /home/ubuntu/source/build_dir/toolchain-mipsel_74kc_gcc-5.4.0_musl-1.1.15/gcc-5.4.0/gcc/config/i386/mmintrin.h: In function '_mm_add_pi16':
  112. /home/ubuntu/source/build_dir/toolchain-mipsel_74kc_gcc-5.4.0_musl-1.1.15/gcc-5.4.0/gcc/config/i386/mmintrin.h:286:18: warning: implicit declaration of function '__builtin_ia32_paddw' [-Wimplicit-function-declaration]
  113.   return (__m64) __builtin_ia32_paddw ((__v4hi)__m1, (__v4hi)__m2);
  114.                  ^
  115. /home/ubuntu/source/build_dir/toolchain-mipsel_74kc_gcc-5.4.0_musl-1.1.15/gcc-5.4.0/gcc/config/i386/mmintrin.h:286:3: error: can't convert between vector values of different size
  116.    return (__m64) __builtin_ia32_paddw ((__v4hi)__m1, (__v4hi)__m2);
  117.    ^
  118. /home/ubuntu/source/build_dir/toolchain-mipsel_74kc_gcc-5.4.0_musl-1.1.15/gcc-5.4.0/gcc/config/i386/mmintrin.h: In function '_mm_add_pi32':
  119. /home/ubuntu/source/build_dir/toolchain-mipsel_74kc_gcc-5.4.0_musl-1.1.15/gcc-5.4.0/gcc/config/i386/mmintrin.h:299:18: warning: implicit declaration of function '__builtin_ia32_paddd' [-Wimplicit-function-declaration]
  120.    return (__m64) __builtin_ia32_paddd ((__v2si)__m1, (__v2si)__m2);
  121.                   ^
  122. /home/ubuntu/source/build_dir/toolchain-mipsel_74kc_gcc-5.4.0_musl-1.1.15/gcc-5.4.0/gcc/config/i386/mmintrin.h:299:3: error: can't convert between vector values of different size
  123.   return (__m64) __builtin_ia32_paddd ((__v2si)__m1, (__v2si)__m2);
  124.   ^
  125. /home/ubuntu/source/build_dir/toolchain-mipsel_74kc_gcc-5.4.0_musl-1.1.15/gcc-5.4.0/gcc/config/i386/mmintrin.h: At top level:
  126. /home/ubuntu/source/build_dir/toolchain-mipsel_74kc_gcc-5.4.0_musl-1.1.15/gcc-5.4.0/gcc/config/i386/mmintrin.h:311:9: warning: #pragma GCC target is not supported for this machine [-Wpragmas]
  127. #pragma GCC target("sse2")
  128.         ^
  129. /home/ubuntu/source/build_dir/toolchain-mipsel_74kc_gcc-5.4.0_musl-1.1.15/gcc-5.4.0/gcc/config/i386/mmintrin.h: In function '_mm_add_si64':
  130. /home/ubuntu/source/build_dir/toolchain-mipsel_74kc_gcc-5.4.0_musl-1.1.15/gcc-5.4.0/gcc/config/i386/mmintrin.h:318:18: warning: implicit declaration of function '__builtin_ia32_paddq' [-Wimplicit-function-declaration]
  131.   return (__m64) __builtin_ia32_paddq ((__v1di)__m1, (__v1di)__m2);
  132.                  ^
  133. /home/ubuntu/source/build_dir/toolchain-mipsel_74kc_gcc-5.4.0_musl-1.1.15/gcc-5.4.0/gcc/config/i386/mmintrin.h:318:3: error: can't convert between vector values of different size
  134.    return (__m64) __builtin_ia32_paddq ((__v1di)__m1, (__v1di)__m2);
  135.    ^
  136. /home/ubuntu/source/build_dir/toolchain-mipsel_74kc_gcc-5.4.0_musl-1.1.15/gcc-5.4.0/gcc/config/i386/mmintrin.h: In function '_mm_adds_pi8':
  137. /home/ubuntu/source/build_dir/toolchain-mipsel_74kc_gcc-5.4.0_musl-1.1.15/gcc-5.4.0/gcc/config/i386/mmintrin.h:330:18: warning: implicit declaration of function '__builtin_ia32_paddsb' [-Wimplicit-function-declaration]
  138.    return (__m64) __builtin_ia32_paddsb ((__v8qi)__m1, (__v8qi)__m2);
  139.                   ^
  140. /home/ubuntu/source/build_dir/toolchain-mipsel_74kc_gcc-5.4.0_musl-1.1.15/gcc-5.4.0/gcc/config/i386/mmintrin.h:330:3: error: can't convert between vector values of different size
  141.   return (__m64) __builtin_ia32_paddsb ((__v8qi)__m1, (__v8qi)__m2);
  142.   ^
  143. /home/ubuntu/source/build_dir/toolchain-mipsel_74kc_gcc-5.4.0_musl-1.1.15/gcc-5.4.0/gcc/config/i386/mmintrin.h: In function '_mm_adds_pi16':
  144. /home/ubuntu/source/build_dir/toolchain-mipsel_74kc_gcc-5.4.0_musl-1.1.15/gcc-5.4.0/gcc/config/i386/mmintrin.h:344:18: warning: implicit declaration of function '__builtin_ia32_paddsw' [-Wimplicit-function-declaration]
  145.   return (__m64) __builtin_ia32_paddsw ((__v4hi)__m1, (__v4hi)__m2);
  146.                  ^
  147. /home/ubuntu/source/build_dir/toolchain-mipsel_74kc_gcc-5.4.0_musl-1.1.15/gcc-5.4.0/gcc/config/i386/mmintrin.h:344:3: error: can't convert between vector values of different size
  148.    return (__m64) __builtin_ia32_paddsw ((__v4hi)__m1, (__v4hi)__m2);
  149.    ^
  150. /home/ubuntu/source/build_dir/toolchain-mipsel_74kc_gcc-5.4.0_musl-1.1.15/gcc-5.4.0/gcc/config/i386/mmintrin.h: In function '_mm_adds_pu8':
  151. /home/ubuntu/source/build_dir/toolchain-mipsel_74kc_gcc-5.4.0_musl-1.1.15/gcc-5.4.0/gcc/config/i386/mmintrin.h:358:18: warning: implicit declaration of function '__builtin_ia32_paddusb' [-Wimplicit-function-declaration]
  152.    return (__m64) __builtin_ia32_paddusb ((__v8qi)__m1, (__v8qi)__m2);
  153.                   ^
  154. /home/ubuntu/source/build_dir/toolchain-mipsel_74kc_gcc-5.4.0_musl-1.1.15/gcc-5.4.0/gcc/config/i386/mmintrin.h:358:3: error: can't convert between vector values of different size
  155.   return (__m64) __builtin_ia32_paddusb ((__v8qi)__m1, (__v8qi)__m2);
  156.   ^
  157. /home/ubuntu/source/build_dir/toolchain-mipsel_74kc_gcc-5.4.0_musl-1.1.15/gcc-5.4.0/gcc/config/i386/mmintrin.h: In function '_mm_adds_pu16':
  158. /home/ubuntu/source/build_dir/toolchain-mipsel_74kc_gcc-5.4.0_musl-1.1.15/gcc-5.4.0/gcc/config/i386/mmintrin.h:372:18: warning: implicit declaration of function '__builtin_ia32_paddusw' [-Wimplicit-function-declaration]
  159.   return (__m64) __builtin_ia32_paddusw ((__v4hi)__m1, (__v4hi)__m2);
  160.                  ^
  161. /home/ubuntu/source/build_dir/toolchain-mipsel_74kc_gcc-5.4.0_musl-1.1.15/gcc-5.4.0/gcc/config/i386/mmintrin.h:372:3: error: can't convert between vector values of different size
  162.    return (__m64) __builtin_ia32_paddusw ((__v4hi)__m1, (__v4hi)__m2);
  163.    ^
  164. /home/ubuntu/source/build_dir/toolchain-mipsel_74kc_gcc-5.4.0_musl-1.1.15/gcc-5.4.0/gcc/config/i386/mmintrin.h: In function '_mm_sub_pi8':
  165. /home/ubuntu/source/build_dir/toolchain-mipsel_74kc_gcc-5.4.0_musl-1.1.15/gcc-5.4.0/gcc/config/i386/mmintrin.h:385:18: warning: implicit declaration of function '__builtin_ia32_psubb' [-Wimplicit-function-declaration]
  166.    return (__m64) __builtin_ia32_psubb ((__v8qi)__m1, (__v8qi)__m2);
  167.                   ^
  168. /home/ubuntu/source/build_dir/toolchain-mipsel_74kc_gcc-5.4.0_musl-1.1.15/gcc-5.4.0/gcc/config/i386/mmintrin.h:385:3: error: can't convert between vector values of different size
  169.   return (__m64) __builtin_ia32_psubb ((__v8qi)__m1, (__v8qi)__m2);
  170.   ^
  171. /home/ubuntu/source/build_dir/toolchain-mipsel_74kc_gcc-5.4.0_musl-1.1.15/gcc-5.4.0/gcc/config/i386/mmintrin.h: In function '_mm_sub_pi16':
  172. /home/ubuntu/source/build_dir/toolchain-mipsel_74kc_gcc-5.4.0_musl-1.1.15/gcc-5.4.0/gcc/config/i386/mmintrin.h:398:18: warning: implicit declaration of function '__builtin_ia32_psubw' [-Wimplicit-function-declaration]
  173.   return (__m64) __builtin_ia32_psubw ((__v4hi)__m1, (__v4hi)__m2);
  174.                  ^
  175. /home/ubuntu/source/build_dir/toolchain-mipsel_74kc_gcc-5.4.0_musl-1.1.15/gcc-5.4.0/gcc/config/i386/mmintrin.h:398:3: error: can't convert between vector values of different size
  176.    return (__m64) __builtin_ia32_psubw ((__v4hi)__m1, (__v4hi)__m2);
  177.    ^
  178. /home/ubuntu/source/build_dir/toolchain-mipsel_74kc_gcc-5.4.0_musl-1.1.15/gcc-5.4.0/gcc/config/i386/mmintrin.h: In function '_mm_sub_pi32':
  179. /home/ubuntu/source/build_dir/toolchain-mipsel_74kc_gcc-5.4.0_musl-1.1.15/gcc-5.4.0/gcc/config/i386/mmintrin.h:411:18: warning: implicit declaration of function '__builtin_ia32_psubd' [-Wimplicit-function-declaration]
  180.    return (__m64) __builtin_ia32_psubd ((__v2si)__m1, (__v2si)__m2);
  181.                   ^
  182. /home/ubuntu/source/build_dir/toolchain-mipsel_74kc_gcc-5.4.0_musl-1.1.15/gcc-5.4.0/gcc/config/i386/mmintrin.h:411:3: error: can't convert between vector values of different size
  183.   return (__m64) __builtin_ia32_psubd ((__v2si)__m1, (__v2si)__m2);
  184.   ^
  185. /home/ubuntu/source/build_dir/toolchain-mipsel_74kc_gcc-5.4.0_musl-1.1.15/gcc-5.4.0/gcc/config/i386/mmintrin.h: At top level:
  186. /home/ubuntu/source/build_dir/toolchain-mipsel_74kc_gcc-5.4.0_musl-1.1.15/gcc-5.4.0/gcc/config/i386/mmintrin.h:423:9: warning: #pragma GCC target is not supported for this machine [-Wpragmas]
  187. #pragma GCC target("sse2")
  188.         ^
  189. /home/ubuntu/source/build_dir/toolchain-mipsel_74kc_gcc-5.4.0_musl-1.1.15/gcc-5.4.0/gcc/config/i386/mmintrin.h: In function '_mm_sub_si64':
  190. /home/ubuntu/source/build_dir/toolchain-mipsel_74kc_gcc-5.4.0_musl-1.1.15/gcc-5.4.0/gcc/config/i386/mmintrin.h:430:18: warning: implicit declaration of function '__builtin_ia32_psubq' [-Wimplicit-function-declaration]
  191.   return (__m64) __builtin_ia32_psubq ((__v1di)__m1, (__v1di)__m2);
  192.                  ^
  193. /home/ubuntu/source/build_dir/toolchain-mipsel_74kc_gcc-5.4.0_musl-1.1.15/gcc-5.4.0/gcc/config/i386/mmintrin.h:430:3: error: can't convert between vector values of different size
  194.    return (__m64) __builtin_ia32_psubq ((__v1di)__m1, (__v1di)__m2);
  195.    ^
  196. /home/ubuntu/source/build_dir/toolchain-mipsel_74kc_gcc-5.4.0_musl-1.1.15/gcc-5.4.0/gcc/config/i386/mmintrin.h: In function '_mm_subs_pi8':
  197. /home/ubuntu/source/build_dir/toolchain-mipsel_74kc_gcc-5.4.0_musl-1.1.15/gcc-5.4.0/gcc/config/i386/mmintrin.h:442:18: warning: implicit declaration of function '__builtin_ia32_psubsb' [-Wimplicit-function-declaration]
  198.    return (__m64) __builtin_ia32_psubsb ((__v8qi)__m1, (__v8qi)__m2);
  199.                   ^
  200. /home/ubuntu/source/build_dir/toolchain-mipsel_74kc_gcc-5.4.0_musl-1.1.15/gcc-5.4.0/gcc/config/i386/mmintrin.h:442:3: error: can't convert between vector values of different size
  201.   return (__m64) __builtin_ia32_psubsb ((__v8qi)__m1, (__v8qi)__m2);
  202.   ^
  203. /home/ubuntu/source/build_dir/toolchain-mipsel_74kc_gcc-5.4.0_musl-1.1.15/gcc-5.4.0/gcc/config/i386/mmintrin.h: In function '_mm_subs_pi16':
  204. /home/ubuntu/source/build_dir/toolchain-mipsel_74kc_gcc-5.4.0_musl-1.1.15/gcc-5.4.0/gcc/config/i386/mmintrin.h:456:18: warning: implicit declaration of function '__builtin_ia32_psubsw' [-Wimplicit-function-declaration]
  205.   return (__m64) __builtin_ia32_psubsw ((__v4hi)__m1, (__v4hi)__m2);
  206.                  ^
  207. /home/ubuntu/source/build_dir/toolchain-mipsel_74kc_gcc-5.4.0_musl-1.1.15/gcc-5.4.0/gcc/config/i386/mmintrin.h:456:3: error: can't convert between vector values of different size
  208.    return (__m64) __builtin_ia32_psubsw ((__v4hi)__m1, (__v4hi)__m2);
  209.    ^
  210. /home/ubuntu/source/build_dir/toolchain-mipsel_74kc_gcc-5.4.0_musl-1.1.15/gcc-5.4.0/gcc/config/i386/mmintrin.h: In function '_mm_subs_pu8':
  211. /home/ubuntu/source/build_dir/toolchain-mipsel_74kc_gcc-5.4.0_musl-1.1.15/gcc-5.4.0/gcc/config/i386/mmintrin.h:470:18: warning: implicit declaration of function '__builtin_ia32_psubusb' [-Wimplicit-function-declaration]
  212.    return (__m64) __builtin_ia32_psubusb ((__v8qi)__m1, (__v8qi)__m2);
  213.                   ^
  214. /home/ubuntu/source/build_dir/toolchain-mipsel_74kc_gcc-5.4.0_musl-1.1.15/gcc-5.4.0/gcc/config/i386/mmintrin.h:470:3: error: can't convert between vector values of different size
  215.   return (__m64) __builtin_ia32_psubusb ((__v8qi)__m1, (__v8qi)__m2);
  216.   ^
  217. /home/ubuntu/source/build_dir/toolchain-mipsel_74kc_gcc-5.4.0_musl-1.1.15/gcc-5.4.0/gcc/config/i386/mmintrin.h: In function '_mm_subs_pu16':
  218. /home/ubuntu/source/build_dir/toolchain-mipsel_74kc_gcc-5.4.0_musl-1.1.15/gcc-5.4.0/gcc/config/i386/mmintrin.h:484:18: warning: implicit declaration of function '__builtin_ia32_psubusw' [-Wimplicit-function-declaration]
  219.   return (__m64) __builtin_ia32_psubusw ((__v4hi)__m1, (__v4hi)__m2);
  220.                  ^
  221. /home/ubuntu/source/build_dir/toolchain-mipsel_74kc_gcc-5.4.0_musl-1.1.15/gcc-5.4.0/gcc/config/i386/mmintrin.h:484:3: error: can't convert between vector values of different size
  222.    return (__m64) __builtin_ia32_psubusw ((__v4hi)__m1, (__v4hi)__m2);
  223.    ^
  224. /home/ubuntu/source/build_dir/toolchain-mipsel_74kc_gcc-5.4.0_musl-1.1.15/gcc-5.4.0/gcc/config/i386/mmintrin.h: In function '_mm_madd_pi16':
  225. /home/ubuntu/source/build_dir/toolchain-mipsel_74kc_gcc-5.4.0_musl-1.1.15/gcc-5.4.0/gcc/config/i386/mmintrin.h:499:18: warning: implicit declaration of function '__builtin_ia32_pmaddwd' [-Wimplicit-function-declaration]
  226.    return (__m64) __builtin_ia32_pmaddwd ((__v4hi)__m1, (__v4hi)__m2);
  227.                   ^
  228. /home/ubuntu/source/build_dir/toolchain-mipsel_74kc_gcc-5.4.0_musl-1.1.15/gcc-5.4.0/gcc/config/i386/mmintrin.h:499:3: error: can't convert between vector values of different size
  229.   return (__m64) __builtin_ia32_pmaddwd ((__v4hi)__m1, (__v4hi)__m2);
  230.   ^
  231. /home/ubuntu/source/build_dir/toolchain-mipsel_74kc_gcc-5.4.0_musl-1.1.15/gcc-5.4.0/gcc/config/i386/mmintrin.h: In function '_mm_mulhi_pi16':
  232. /home/ubuntu/source/build_dir/toolchain-mipsel_74kc_gcc-5.4.0_musl-1.1.15/gcc-5.4.0/gcc/config/i386/mmintrin.h:513:18: warning: implicit declaration of function '__builtin_ia32_pmulhw' [-Wimplicit-function-declaration]
  233.   return (__m64) __builtin_ia32_pmulhw ((__v4hi)__m1, (__v4hi)__m2);
  234.                  ^
  235. /home/ubuntu/source/build_dir/toolchain-mipsel_74kc_gcc-5.4.0_musl-1.1.15/gcc-5.4.0/gcc/config/i386/mmintrin.h:513:3: error: can't convert between vector values of different size
  236.    return (__m64) __builtin_ia32_pmulhw ((__v4hi)__m1, (__v4hi)__m2);
  237.    ^
  238. /home/ubuntu/source/build_dir/toolchain-mipsel_74kc_gcc-5.4.0_musl-1.1.15/gcc-5.4.0/gcc/config/i386/mmintrin.h: In function '_mm_mullo_pi16':
  239. /home/ubuntu/source/build_dir/toolchain-mipsel_74kc_gcc-5.4.0_musl-1.1.15/gcc-5.4.0/gcc/config/i386/mmintrin.h:527:18: warning: implicit declaration of function '__builtin_ia32_pmullw' [-Wimplicit-function-declaration]
  240.    return (__m64) __builtin_ia32_pmullw ((__v4hi)__m1, (__v4hi)__m2);
  241.                   ^
  242. /home/ubuntu/source/build_dir/toolchain-mipsel_74kc_gcc-5.4.0_musl-1.1.15/gcc-5.4.0/gcc/config/i386/mmintrin.h:527:3: error: can't convert between vector values of different size
  243.   return (__m64) __builtin_ia32_pmullw ((__v4hi)__m1, (__v4hi)__m2);
  244.   ^
  245. /home/ubuntu/source/build_dir/toolchain-mipsel_74kc_gcc-5.4.0_musl-1.1.15/gcc-5.4.0/gcc/config/i386/mmintrin.h: In function '_mm_sll_pi16':
  246. /home/ubuntu/source/build_dir/toolchain-mipsel_74kc_gcc-5.4.0_musl-1.1.15/gcc-5.4.0/gcc/config/i386/mmintrin.h:540:18: warning: implicit declaration of function '__builtin_ia32_psllw' [-Wimplicit-function-declaration]
  247.   return (__m64) __builtin_ia32_psllw ((__v4hi)__m, (__v4hi)__count);
  248.                  ^
  249. /home/ubuntu/source/build_dir/toolchain-mipsel_74kc_gcc-5.4.0_musl-1.1.15/gcc-5.4.0/gcc/config/i386/mmintrin.h:540:3: error: can't convert between vector values of different size
  250.    return (__m64) __builtin_ia32_psllw ((__v4hi)__m, (__v4hi)__count);
  251.    ^
  252. /home/ubuntu/source/build_dir/toolchain-mipsel_74kc_gcc-5.4.0_musl-1.1.15/gcc-5.4.0/gcc/config/i386/mmintrin.h: In function '_mm_slli_pi16':
  253. /home/ubuntu/source/build_dir/toolchain-mipsel_74kc_gcc-5.4.0_musl-1.1.15/gcc-5.4.0/gcc/config/i386/mmintrin.h:552:18: warning: implicit declaration of function '__builtin_ia32_psllwi' [-Wimplicit-function-declaration]
  254.    return (__m64) __builtin_ia32_psllwi ((__v4hi)__m, __count);
  255.                   ^
  256. /home/ubuntu/source/build_dir/toolchain-mipsel_74kc_gcc-5.4.0_musl-1.1.15/gcc-5.4.0/gcc/config/i386/mmintrin.h:552:3: error: can't convert between vector values of different size
  257.   return (__m64) __builtin_ia32_psllwi ((__v4hi)__m, __count);
  258.   ^
  259. /home/ubuntu/source/build_dir/toolchain-mipsel_74kc_gcc-5.4.0_musl-1.1.15/gcc-5.4.0/gcc/config/i386/mmintrin.h: In function '_mm_sll_pi32':
  260. /home/ubuntu/source/build_dir/toolchain-mipsel_74kc_gcc-5.4.0_musl-1.1.15/gcc-5.4.0/gcc/config/i386/mmintrin.h:565:18: warning: implicit declaration of function '__builtin_ia32_pslld' [-Wimplicit-function-declaration]
  261.   return (__m64) __builtin_ia32_pslld ((__v2si)__m, (__v2si)__count);
  262.                  ^
  263. /home/ubuntu/source/build_dir/toolchain-mipsel_74kc_gcc-5.4.0_musl-1.1.15/gcc-5.4.0/gcc/config/i386/mmintrin.h:565:3: error: can't convert between vector values of different size
  264.    return (__m64) __builtin_ia32_pslld ((__v2si)__m, (__v2si)__count);
  265.    ^
  266. /home/ubuntu/source/build_dir/toolchain-mipsel_74kc_gcc-5.4.0_musl-1.1.15/gcc-5.4.0/gcc/config/i386/mmintrin.h: In function '_mm_slli_pi32':
  267. /home/ubuntu/source/build_dir/toolchain-mipsel_74kc_gcc-5.4.0_musl-1.1.15/gcc-5.4.0/gcc/config/i386/mmintrin.h:577:18: warning: implicit declaration of function '__builtin_ia32_pslldi' [-Wimplicit-function-declaration]
  268.    return (__m64) __builtin_ia32_pslldi ((__v2si)__m, __count);
  269.                   ^
  270. /home/ubuntu/source/build_dir/toolchain-mipsel_74kc_gcc-5.4.0_musl-1.1.15/gcc-5.4.0/gcc/config/i386/mmintrin.h:577:3: error: can't convert between vector values of different size
  271.   return (__m64) __builtin_ia32_pslldi ((__v2si)__m, __count);
  272.   ^
  273. /home/ubuntu/source/build_dir/toolchain-mipsel_74kc_gcc-5.4.0_musl-1.1.15/gcc-5.4.0/gcc/config/i386/mmintrin.h: In function '_mm_sll_si64':
  274. /home/ubuntu/source/build_dir/toolchain-mipsel_74kc_gcc-5.4.0_musl-1.1.15/gcc-5.4.0/gcc/config/i386/mmintrin.h:590:18: warning: implicit declaration of function '__builtin_ia32_psllq' [-Wimplicit-function-declaration]
  275.   return (__m64) __builtin_ia32_psllq ((__v1di)__m, (__v1di)__count);
  276.                  ^
  277. /home/ubuntu/source/build_dir/toolchain-mipsel_74kc_gcc-5.4.0_musl-1.1.15/gcc-5.4.0/gcc/config/i386/mmintrin.h:590:3: error: can't convert between vector values of different size
  278.    return (__m64) __builtin_ia32_psllq ((__v1di)__m, (__v1di)__count);
  279.    ^
  280. /home/ubuntu/source/build_dir/toolchain-mipsel_74kc_gcc-5.4.0_musl-1.1.15/gcc-5.4.0/gcc/config/i386/mmintrin.h: In function '_mm_slli_si64':
  281. /home/ubuntu/source/build_dir/toolchain-mipsel_74kc_gcc-5.4.0_musl-1.1.15/gcc-5.4.0/gcc/config/i386/mmintrin.h:602:18: warning: implicit declaration of function '__builtin_ia32_psllqi' [-Wimplicit-function-declaration]
  282.    return (__m64) __builtin_ia32_psllqi ((__v1di)__m, __count);
  283.                   ^
  284. /home/ubuntu/source/build_dir/toolchain-mipsel_74kc_gcc-5.4.0_musl-1.1.15/gcc-5.4.0/gcc/config/i386/mmintrin.h:602:3: error: can't convert between vector values of different size
  285.   return (__m64) __builtin_ia32_psllqi ((__v1di)__m, __count);
  286.   ^
  287. /home/ubuntu/source/build_dir/toolchain-mipsel_74kc_gcc-5.4.0_musl-1.1.15/gcc-5.4.0/gcc/config/i386/mmintrin.h: In function '_mm_sra_pi16':
  288. /home/ubuntu/source/build_dir/toolchain-mipsel_74kc_gcc-5.4.0_musl-1.1.15/gcc-5.4.0/gcc/config/i386/mmintrin.h:615:18: warning: implicit declaration of function '__builtin_ia32_psraw' [-Wimplicit-function-declaration]
  289.   return (__m64) __builtin_ia32_psraw ((__v4hi)__m, (__v4hi)__count);
  290.                  ^
  291. /home/ubuntu/source/build_dir/toolchain-mipsel_74kc_gcc-5.4.0_musl-1.1.15/gcc-5.4.0/gcc/config/i386/mmintrin.h:615:3: error: can't convert between vector values of different size
  292.    return (__m64) __builtin_ia32_psraw ((__v4hi)__m, (__v4hi)__count);
  293.    ^
  294. /home/ubuntu/source/build_dir/toolchain-mipsel_74kc_gcc-5.4.0_musl-1.1.15/gcc-5.4.0/gcc/config/i386/mmintrin.h: In function '_mm_srai_pi16':
  295. /home/ubuntu/source/build_dir/toolchain-mipsel_74kc_gcc-5.4.0_musl-1.1.15/gcc-5.4.0/gcc/config/i386/mmintrin.h:627:18: warning: implicit declaration of function '__builtin_ia32_psrawi' [-Wimplicit-function-declaration]
  296.    return (__m64) __builtin_ia32_psrawi ((__v4hi)__m, __count);
  297.                   ^
  298. /home/ubuntu/source/build_dir/toolchain-mipsel_74kc_gcc-5.4.0_musl-1.1.15/gcc-5.4.0/gcc/config/i386/mmintrin.h:627:3: error: can't convert between vector values of different size
  299.   return (__m64) __builtin_ia32_psrawi ((__v4hi)__m, __count);
  300.   ^
  301. /home/ubuntu/source/build_dir/toolchain-mipsel_74kc_gcc-5.4.0_musl-1.1.15/gcc-5.4.0/gcc/config/i386/mmintrin.h: In function '_mm_sra_pi32':
  302. /home/ubuntu/source/build_dir/toolchain-mipsel_74kc_gcc-5.4.0_musl-1.1.15/gcc-5.4.0/gcc/config/i386/mmintrin.h:640:18: warning: implicit declaration of function '__builtin_ia32_psrad' [-Wimplicit-function-declaration]
  303.   return (__m64) __builtin_ia32_psrad ((__v2si)__m, (__v2si)__count);
  304.                  ^
  305. /home/ubuntu/source/build_dir/toolchain-mipsel_74kc_gcc-5.4.0_musl-1.1.15/gcc-5.4.0/gcc/config/i386/mmintrin.h:640:3: error: can't convert between vector values of different size
  306.    return (__m64) __builtin_ia32_psrad ((__v2si)__m, (__v2si)__count);
  307.    ^
  308. /home/ubuntu/source/build_dir/toolchain-mipsel_74kc_gcc-5.4.0_musl-1.1.15/gcc-5.4.0/gcc/config/i386/mmintrin.h: In function '_mm_srai_pi32':
  309. /home/ubuntu/source/build_dir/toolchain-mipsel_74kc_gcc-5.4.0_musl-1.1.15/gcc-5.4.0/gcc/config/i386/mmintrin.h:652:18: warning: implicit declaration of function '__builtin_ia32_psradi' [-Wimplicit-function-declaration]
  310.    return (__m64) __builtin_ia32_psradi ((__v2si)__m, __count);
  311.                   ^
  312. /home/ubuntu/source/build_dir/toolchain-mipsel_74kc_gcc-5.4.0_musl-1.1.15/gcc-5.4.0/gcc/config/i386/mmintrin.h:652:3: error: can't convert between vector values of different size
  313.   return (__m64) __builtin_ia32_psradi ((__v2si)__m, __count);
  314.   ^
  315. /home/ubuntu/source/build_dir/toolchain-mipsel_74kc_gcc-5.4.0_musl-1.1.15/gcc-5.4.0/gcc/config/i386/mmintrin.h: In function '_mm_srl_pi16':
  316. /home/ubuntu/source/build_dir/toolchain-mipsel_74kc_gcc-5.4.0_musl-1.1.15/gcc-5.4.0/gcc/config/i386/mmintrin.h:665:18: warning: implicit declaration of function '__builtin_ia32_psrlw' [-Wimplicit-function-declaration]
  317.   return (__m64) __builtin_ia32_psrlw ((__v4hi)__m, (__v4hi)__count);
  318.                  ^
  319. /home/ubuntu/source/build_dir/toolchain-mipsel_74kc_gcc-5.4.0_musl-1.1.15/gcc-5.4.0/gcc/config/i386/mmintrin.h:665:3: error: can't convert between vector values of different size
  320.    return (__m64) __builtin_ia32_psrlw ((__v4hi)__m, (__v4hi)__count);
  321.    ^
  322. /home/ubuntu/source/build_dir/toolchain-mipsel_74kc_gcc-5.4.0_musl-1.1.15/gcc-5.4.0/gcc/config/i386/mmintrin.h: In function '_mm_srli_pi16':
  323. /home/ubuntu/source/build_dir/toolchain-mipsel_74kc_gcc-5.4.0_musl-1.1.15/gcc-5.4.0/gcc/config/i386/mmintrin.h:677:18: warning: implicit declaration of function '__builtin_ia32_psrlwi' [-Wimplicit-function-declaration]
  324.    return (__m64) __builtin_ia32_psrlwi ((__v4hi)__m, __count);
  325.                   ^
  326. /home/ubuntu/source/build_dir/toolchain-mipsel_74kc_gcc-5.4.0_musl-1.1.15/gcc-5.4.0/gcc/config/i386/mmintrin.h:677:3: error: can't convert between vector values of different size
  327.   return (__m64) __builtin_ia32_psrlwi ((__v4hi)__m, __count);
  328.   ^
  329. /home/ubuntu/source/build_dir/toolchain-mipsel_74kc_gcc-5.4.0_musl-1.1.15/gcc-5.4.0/gcc/config/i386/mmintrin.h: In function '_mm_srl_pi32':
  330. /home/ubuntu/source/build_dir/toolchain-mipsel_74kc_gcc-5.4.0_musl-1.1.15/gcc-5.4.0/gcc/config/i386/mmintrin.h:690:18: warning: implicit declaration of function '__builtin_ia32_psrld' [-Wimplicit-function-declaration]
  331.   return (__m64) __builtin_ia32_psrld ((__v2si)__m, (__v2si)__count);
  332.                  ^
  333. /home/ubuntu/source/build_dir/toolchain-mipsel_74kc_gcc-5.4.0_musl-1.1.15/gcc-5.4.0/gcc/config/i386/mmintrin.h:690:3: error: can't convert between vector values of different size
  334.    return (__m64) __builtin_ia32_psrld ((__v2si)__m, (__v2si)__count);
  335.    ^
  336. /home/ubuntu/source/build_dir/toolchain-mipsel_74kc_gcc-5.4.0_musl-1.1.15/gcc-5.4.0/gcc/config/i386/mmintrin.h: In function '_mm_srli_pi32':
  337. /home/ubuntu/source/build_dir/toolchain-mipsel_74kc_gcc-5.4.0_musl-1.1.15/gcc-5.4.0/gcc/config/i386/mmintrin.h:702:18: warning: implicit declaration of function '__builtin_ia32_psrldi' [-Wimplicit-function-declaration]
  338.    return (__m64) __builtin_ia32_psrldi ((__v2si)__m, __count);
  339.                   ^
  340. /home/ubuntu/source/build_dir/toolchain-mipsel_74kc_gcc-5.4.0_musl-1.1.15/gcc-5.4.0/gcc/config/i386/mmintrin.h:702:3: error: can't convert between vector values of different size
  341.   return (__m64) __builtin_ia32_psrldi ((__v2si)__m, __count);
  342.   ^
  343. /home/ubuntu/source/build_dir/toolchain-mipsel_74kc_gcc-5.4.0_musl-1.1.15/gcc-5.4.0/gcc/config/i386/mmintrin.h: In function '_mm_srl_si64':
  344. /home/ubuntu/source/build_dir/toolchain-mipsel_74kc_gcc-5.4.0_musl-1.1.15/gcc-5.4.0/gcc/config/i386/mmintrin.h:715:18: warning: implicit declaration of function '__builtin_ia32_psrlq' [-Wimplicit-function-declaration]
  345.   return (__m64) __builtin_ia32_psrlq ((__v1di)__m, (__v1di)__count);
  346.                  ^
  347. /home/ubuntu/source/build_dir/toolchain-mipsel_74kc_gcc-5.4.0_musl-1.1.15/gcc-5.4.0/gcc/config/i386/mmintrin.h:715:3: error: can't convert between vector values of different size
  348.    return (__m64) __builtin_ia32_psrlq ((__v1di)__m, (__v1di)__count);
  349.    ^
  350. /home/ubuntu/source/build_dir/toolchain-mipsel_74kc_gcc-5.4.0_musl-1.1.15/gcc-5.4.0/gcc/config/i386/mmintrin.h: In function '_mm_srli_si64':
  351. /home/ubuntu/source/build_dir/toolchain-mipsel_74kc_gcc-5.4.0_musl-1.1.15/gcc-5.4.0/gcc/config/i386/mmintrin.h:727:18: warning: implicit declaration of function '__builtin_ia32_psrlqi' [-Wimplicit-function-declaration]
  352.    return (__m64) __builtin_ia32_psrlqi ((__v1di)__m, __count);
  353.                   ^
  354. /home/ubuntu/source/build_dir/toolchain-mipsel_74kc_gcc-5.4.0_musl-1.1.15/gcc-5.4.0/gcc/config/i386/mmintrin.h:727:3: error: can't convert between vector values of different size
  355.   return (__m64) __builtin_ia32_psrlqi ((__v1di)__m, __count);
  356.   ^
  357. /home/ubuntu/source/build_dir/toolchain-mipsel_74kc_gcc-5.4.0_musl-1.1.15/gcc-5.4.0/gcc/config/i386/mmintrin.h: In function '_mm_and_si64':
  358. /home/ubuntu/source/build_dir/toolchain-mipsel_74kc_gcc-5.4.0_musl-1.1.15/gcc-5.4.0/gcc/config/i386/mmintrin.h:740:10: warning: implicit declaration of function '__builtin_ia32_pand' [-Wimplicit-function-declaration]
  359.   return __builtin_ia32_pand (__m1, __m2);
  360.          ^
  361. /home/ubuntu/source/build_dir/toolchain-mipsel_74kc_gcc-5.4.0_musl-1.1.15/gcc-5.4.0/gcc/config/i386/mmintrin.h:740:10: error: incompatible types when returning type 'int' but '__m64 {aka __vector(2) int}' was expected
  362. /home/ubuntu/source/build_dir/toolchain-mipsel_74kc_gcc-5.4.0_musl-1.1.15/gcc-5.4.0/gcc/config/i386/mmintrin.h: In function '_mm_andnot_si64':
  363. /home/ubuntu/source/build_dir/toolchain-mipsel_74kc_gcc-5.4.0_musl-1.1.15/gcc-5.4.0/gcc/config/i386/mmintrin.h:754:10: warning: implicit declaration of function '__builtin_ia32_pandn' [-Wimplicit-function-declaration]
  364.   return __builtin_ia32_pandn (__m1, __m2);
  365.          ^
  366. /home/ubuntu/source/build_dir/toolchain-mipsel_74kc_gcc-5.4.0_musl-1.1.15/gcc-5.4.0/gcc/config/i386/mmintrin.h:754:10: error: incompatible types when returning type 'int' but '__m64 {aka __vector(2) int}' was expected
  367. /home/ubuntu/source/build_dir/toolchain-mipsel_74kc_gcc-5.4.0_musl-1.1.15/gcc-5.4.0/gcc/config/i386/mmintrin.h: In function '_mm_or_si64':
  368. /home/ubuntu/source/build_dir/toolchain-mipsel_74kc_gcc-5.4.0_musl-1.1.15/gcc-5.4.0/gcc/config/i386/mmintrin.h:767:10: warning: implicit declaration of function '__builtin_ia32_por' [-Wimplicit-function-declaration]
  369.   return __builtin_ia32_por (__m1, __m2);
  370.          ^
  371. /home/ubuntu/source/build_dir/toolchain-mipsel_74kc_gcc-5.4.0_musl-1.1.15/gcc-5.4.0/gcc/config/i386/mmintrin.h:767:10: error: incompatible types when returning type 'int' but '__m64 {aka __vector(2) int}' was expected
  372. /home/ubuntu/source/build_dir/toolchain-mipsel_74kc_gcc-5.4.0_musl-1.1.15/gcc-5.4.0/gcc/config/i386/mmintrin.h: In function '_mm_xor_si64':
  373. /home/ubuntu/source/build_dir/toolchain-mipsel_74kc_gcc-5.4.0_musl-1.1.15/gcc-5.4.0/gcc/config/i386/mmintrin.h:780:10: warning: implicit declaration of function '__builtin_ia32_pxor' [-Wimplicit-function-declaration]
  374.   return __builtin_ia32_pxor (__m1, __m2);
  375.          ^
  376. /home/ubuntu/source/build_dir/toolchain-mipsel_74kc_gcc-5.4.0_musl-1.1.15/gcc-5.4.0/gcc/config/i386/mmintrin.h:780:10: error: incompatible types when returning type 'int' but '__m64 {aka __vector(2) int}' was expected
  377. /home/ubuntu/source/build_dir/toolchain-mipsel_74kc_gcc-5.4.0_musl-1.1.15/gcc-5.4.0/gcc/config/i386/mmintrin.h: In function '_mm_cmpeq_pi8':
  378. /home/ubuntu/source/build_dir/toolchain-mipsel_74kc_gcc-5.4.0_musl-1.1.15/gcc-5.4.0/gcc/config/i386/mmintrin.h:794:18: warning: implicit declaration of function '__builtin_ia32_pcmpeqb' [-Wimplicit-function-declaration]
  379.   return (__m64) __builtin_ia32_pcmpeqb ((__v8qi)__m1, (__v8qi)__m2);
  380.                  ^
  381. /home/ubuntu/source/build_dir/toolchain-mipsel_74kc_gcc-5.4.0_musl-1.1.15/gcc-5.4.0/gcc/config/i386/mmintrin.h:794:3: error: can't convert between vector values of different size
  382.    return (__m64) __builtin_ia32_pcmpeqb ((__v8qi)__m1, (__v8qi)__m2);
  383.    ^
  384. /home/ubuntu/source/build_dir/toolchain-mipsel_74kc_gcc-5.4.0_musl-1.1.15/gcc-5.4.0/gcc/config/i386/mmintrin.h: In function '_mm_cmpgt_pi8':
  385. /home/ubuntu/source/build_dir/toolchain-mipsel_74kc_gcc-5.4.0_musl-1.1.15/gcc-5.4.0/gcc/config/i386/mmintrin.h:806:18: warning: implicit declaration of function '__builtin_ia32_pcmpgtb' [-Wimplicit-function-declaration]
  386.    return (__m64) __builtin_ia32_pcmpgtb ((__v8qi)__m1, (__v8qi)__m2);
  387.                   ^
  388. /home/ubuntu/source/build_dir/toolchain-mipsel_74kc_gcc-5.4.0_musl-1.1.15/gcc-5.4.0/gcc/config/i386/mmintrin.h:806:3: error: can't convert between vector values of different size
  389.   return (__m64) __builtin_ia32_pcmpgtb ((__v8qi)__m1, (__v8qi)__m2);
  390.   ^
  391. /home/ubuntu/source/build_dir/toolchain-mipsel_74kc_gcc-5.4.0_musl-1.1.15/gcc-5.4.0/gcc/config/i386/mmintrin.h: In function '_mm_cmpeq_pi16':
  392. /home/ubuntu/source/build_dir/toolchain-mipsel_74kc_gcc-5.4.0_musl-1.1.15/gcc-5.4.0/gcc/config/i386/mmintrin.h:820:18: warning: implicit declaration of function '__builtin_ia32_pcmpeqw' [-Wimplicit-function-declaration]
  393.   return (__m64) __builtin_ia32_pcmpeqw ((__v4hi)__m1, (__v4hi)__m2);
  394.                  ^
  395. /home/ubuntu/source/build_dir/toolchain-mipsel_74kc_gcc-5.4.0_musl-1.1.15/gcc-5.4.0/gcc/config/i386/mmintrin.h:820:3: error: can't convert between vector values of different size
  396.    return (__m64) __builtin_ia32_pcmpeqw ((__v4hi)__m1, (__v4hi)__m2);
  397.    ^
  398. /home/ubuntu/source/build_dir/toolchain-mipsel_74kc_gcc-5.4.0_musl-1.1.15/gcc-5.4.0/gcc/config/i386/mmintrin.h: In function '_mm_cmpgt_pi16':
  399. /home/ubuntu/source/build_dir/toolchain-mipsel_74kc_gcc-5.4.0_musl-1.1.15/gcc-5.4.0/gcc/config/i386/mmintrin.h:832:18: warning: implicit declaration of function '__builtin_ia32_pcmpgtw' [-Wimplicit-function-declaration]
  400.    return (__m64) __builtin_ia32_pcmpgtw ((__v4hi)__m1, (__v4hi)__m2);
  401.                   ^
  402. /home/ubuntu/source/build_dir/toolchain-mipsel_74kc_gcc-5.4.0_musl-1.1.15/gcc-5.4.0/gcc/config/i386/mmintrin.h:832:3: error: can't convert between vector values of different size
  403.   return (__m64) __builtin_ia32_pcmpgtw ((__v4hi)__m1, (__v4hi)__m2);
  404.   ^
  405. /home/ubuntu/source/build_dir/toolchain-mipsel_74kc_gcc-5.4.0_musl-1.1.15/gcc-5.4.0/gcc/config/i386/mmintrin.h: In function '_mm_cmpeq_pi32':
  406. /home/ubuntu/source/build_dir/toolchain-mipsel_74kc_gcc-5.4.0_musl-1.1.15/gcc-5.4.0/gcc/config/i386/mmintrin.h:846:18: warning: implicit declaration of function '__builtin_ia32_pcmpeqd' [-Wimplicit-function-declaration]
  407.   return (__m64) __builtin_ia32_pcmpeqd ((__v2si)__m1, (__v2si)__m2);
  408.                  ^
  409. /home/ubuntu/source/build_dir/toolchain-mipsel_74kc_gcc-5.4.0_musl-1.1.15/gcc-5.4.0/gcc/config/i386/mmintrin.h:846:3: error: can't convert between vector values of different size
  410.    return (__m64) __builtin_ia32_pcmpeqd ((__v2si)__m1, (__v2si)__m2);
  411.    ^
  412. /home/ubuntu/source/build_dir/toolchain-mipsel_74kc_gcc-5.4.0_musl-1.1.15/gcc-5.4.0/gcc/config/i386/mmintrin.h: In function '_mm_cmpgt_pi32':
  413. /home/ubuntu/source/build_dir/toolchain-mipsel_74kc_gcc-5.4.0_musl-1.1.15/gcc-5.4.0/gcc/config/i386/mmintrin.h:858:18: warning: implicit declaration of function '__builtin_ia32_pcmpgtd' [-Wimplicit-function-declaration]
  414.    return (__m64) __builtin_ia32_pcmpgtd ((__v2si)__m1, (__v2si)__m2);
  415.                   ^
  416. /home/ubuntu/source/build_dir/toolchain-mipsel_74kc_gcc-5.4.0_musl-1.1.15/gcc-5.4.0/gcc/config/i386/mmintrin.h:858:3: error: can't convert between vector values of different size
  417.   return (__m64) __builtin_ia32_pcmpgtd ((__v2si)__m1, (__v2si)__m2);
  418.   ^
  419. /home/ubuntu/source/build_dir/toolchain-mipsel_74kc_gcc-5.4.0_musl-1.1.15/gcc-5.4.0/gcc/config/i386/mmintrin.h: In function '_mm_set_pi32':
  420. /home/ubuntu/source/build_dir/toolchain-mipsel_74kc_gcc-5.4.0_musl-1.1.15/gcc-5.4.0/gcc/config/i386/mmintrin.h:878:3: error: can't convert between vector values of different size
  421.    return (__m64) __builtin_ia32_vec_init_v2si (__i0, __i1);
  422.    ^
  423. /home/ubuntu/source/build_dir/toolchain-mipsel_74kc_gcc-5.4.0_musl-1.1.15/gcc-5.4.0/gcc/config/i386/mmintrin.h: In function '_mm_set_pi16':
  424. /home/ubuntu/source/build_dir/toolchain-mipsel_74kc_gcc-5.4.0_musl-1.1.15/gcc-5.4.0/gcc/config/i386/mmintrin.h:885:18: warning: implicit declaration of function '__builtin_ia32_vec_init_v4hi' [-Wimplicit-function-declaration]
  425.    return (__m64) __builtin_ia32_vec_init_v4hi (__w0, __w1, __w2, __w3);
  426.                   ^
  427. /home/ubuntu/source/build_dir/toolchain-mipsel_74kc_gcc-5.4.0_musl-1.1.15/gcc-5.4.0/gcc/config/i386/mmintrin.h:885:3: error: can't convert between vector values of different size
  428.   return (__m64) __builtin_ia32_vec_init_v4hi (__w0, __w1, __w2, __w3);
  429.   ^
  430. /home/ubuntu/source/build_dir/toolchain-mipsel_74kc_gcc-5.4.0_musl-1.1.15/gcc-5.4.0/gcc/config/i386/mmintrin.h: In function '_mm_set_pi8':
  431. /home/ubuntu/source/build_dir/toolchain-mipsel_74kc_gcc-5.4.0_musl-1.1.15/gcc-5.4.0/gcc/config/i386/mmintrin.h:893:18: warning: implicit declaration of function '__builtin_ia32_vec_init_v8qi' [-Wimplicit-function-declaration]
  432.   return (__m64) __builtin_ia32_vec_init_v8qi (__b0, __b1, __b2, __b3,
  433.                  ^
  434. /home/ubuntu/source/build_dir/toolchain-mipsel_74kc_gcc-5.4.0_musl-1.1.15/gcc-5.4.0/gcc/config/i386/mmintrin.h:894:13: error: can't convert between vector values of different size
  435.              __b4, __b5, __b6, __b7);
  436.              ^
  437. In file included from /home/ubuntu/source/build_dir/toolchain-mipsel_74kc_gcc-5.4.0_musl-1.1.15/gcc-5.4.0/gcc/config/i386/emmintrin.h:31:0,
  438.                  from src/bloomd/art.c:5:
  439. /home/ubuntu/source/build_dir/toolchain-mipsel_74kc_gcc-5.4.0_musl-1.1.15/gcc-5.4.0/gcc/config/i386/xmmintrin.h: At top level:
  440. /home/ubuntu/source/build_dir/toolchain-mipsel_74kc_gcc-5.4.0_musl-1.1.15/gcc-5.4.0/gcc/config/i386/xmmintrin.h:34:23: fatal error: mm_malloc.h: No such file or directory
  441. compilation terminated.
  442. scons: *** [src/bloomd/art.o] Error 1
  443. scons: building terminated because of errors.
Advertisement
RAW Paste Data Copied
Advertisement