SHARE
TWEET

Untitled

a guest Jun 19th, 2017 44 Never
Not a member of Pastebin yet? Sign Up, it unlocks many cool features!
  1. ./../../src/server/zone/managers/object/ObjectManager.cpp: In member function ‘void server::zone::managers::object::ObjectManager::registerObjectTypes()’:
  2. ../../../src/server/zone/managers/object/ObjectManager.cpp:250: error: ‘LightsaberCrystalComponent’ was not declared in this scope
  3. ../../../src/server/zone/managers/object/ObjectManager.cpp:250: error: no matching function for call to ‘server::zone::managers::object::SceneObjectFactory<server::zone::objects::scene::SceneObject*(), unsigned int>::registerObject(const int&)’
  4. make[3]: *** [server/zone/managers/object/ObjectManager.o] Error 1
  5. make[3]: *** Waiting for unfinished jobs....
  6. make[3]: Leaving directory `/home/swgemu/workspace/MMOCoreORB-Testing/build/unix/src'
  7. make[2]: *** [all-recursive] Error 1
  8. make[2]: Leaving directory `/home/swgemu/workspace/MMOCoreORB-Testing/build/unix'
  9. make[1]: *** [all] Error 2
  10. make[1]: Leaving directory `/home/swgemu/workspace/MMOCoreORB-Testing/build/unix'
  11. make: *** [all] Error 2
  12. swgemu@ubuntu:~/workspace/MMOCoreORB-Testing$
RAW Paste Data
Top