ahorn07

Github driver (TL-WN823N) on Linux Mint 19.1, kernel 4.15

Jan 18th, 2019
668
0
Never
Not a member of Pastebin yet? Sign Up, it unlocks many cool features!
Bash 3.71 KB | None | 0 0
  1. $ sudo make
  2.      
  3. "******************************************"
  4. "NO SKRC,we will use default KSRC"
  5. "******************************************"
  6. make ARCH=x86_64 CROSS_COMPILE= -C /lib/modules/4.15.0-43-generic/build M=/home/aidan/Downloads/Wi-Fi_driver/tl-wn823N-drivers-for-ubuntu-master modules
  7. make[1]: Entering directory '/usr/src/linux-headers-4.15.0-43-generic'
  8. Makefile:975: "Cannot use CONFIG_STACK_VALIDATION=y, please install libelf-dev, libelf-devel or elfutils-libelf-devel"
  9. "******************************************"
  10. "NO SKRC,we will use default KSRC"
  11. "******************************************"
  12.   CC [M]  /home/aidan/Downloads/Wi-Fi_driver/tl-wn823N-drivers-for-ubuntu-master/core/rtw_cmd.o
  13. In file included from /home/aidan/Downloads/Wi-Fi_driver/tl-wn823N-drivers-for-ubuntu-master/include/osdep_service.h:41:0,
  14.                  from /home/aidan/Downloads/Wi-Fi_driver/tl-wn823N-drivers-for-ubuntu-master/include/drv_types.h:32,
  15.                  from /home/aidan/Downloads/Wi-Fi_driver/tl-wn823N-drivers-for-ubuntu-master/core/rtw_cmd.c:22:
  16. /home/aidan/Downloads/Wi-Fi_driver/tl-wn823N-drivers-for-ubuntu-master/include/osdep_service_linux.h: In function ‘_init_timer’:
  17. /home/aidan/Downloads/Wi-Fi_driver/tl-wn823N-drivers-for-ubuntu-master/include/osdep_service_linux.h:267:8: error: ‘_timer {aka struct timer_list}’ has no member named ‘data’
  18.   ptimer->data = (unsigned long)cntx;
  19.         ^~
  20. /home/aidan/Downloads/Wi-Fi_driver/tl-wn823N-drivers-for-ubuntu-master/include/osdep_service_linux.h:268:2: error: implicit declaration of function ‘init_timer’; did you mean ‘_init_timer’? [-Werror=implicit-function-declaration]
  21.   init_timer(ptimer);
  22.   ^~~~~~~~~~
  23.   _init_timer
  24. In file included from /home/aidan/Downloads/Wi-Fi_driver/tl-wn823N-drivers-for-ubuntu-master/include/drv_types.h:32:0,
  25.                  from /home/aidan/Downloads/Wi-Fi_driver/tl-wn823N-drivers-for-ubuntu-master/core/rtw_cmd.c:22:
  26. /home/aidan/Downloads/Wi-Fi_driver/tl-wn823N-drivers-for-ubuntu-master/include/osdep_service.h: In function ‘thread_enter’:
  27. /home/aidan/Downloads/Wi-Fi_driver/tl-wn823N-drivers-for-ubuntu-master/include/osdep_service.h:343:2: error: implicit declaration of function ‘allow_signal’; did you mean ‘do_signal’? [-Werror=implicit-function-declaration]
  28.   allow_signal(SIGTERM);
  29.   ^~~~~~~~~~~~
  30.   do_signal
  31. /home/aidan/Downloads/Wi-Fi_driver/tl-wn823N-drivers-for-ubuntu-master/include/osdep_service.h: In function ‘flush_signals_thread’:
  32. /home/aidan/Downloads/Wi-Fi_driver/tl-wn823N-drivers-for-ubuntu-master/include/osdep_service.h:353:6: error: implicit declaration of function ‘signal_pending’; did you mean ‘timer_pending’? [-Werror=implicit-function-declaration]
  33.   if (signal_pending (current))
  34.       ^~~~~~~~~~~~~~
  35.       timer_pending
  36. /home/aidan/Downloads/Wi-Fi_driver/tl-wn823N-drivers-for-ubuntu-master/include/osdep_service.h:355:3: error: implicit declaration of function ‘flush_signals’; did you mean ‘do_signal’? [-Werror=implicit-function-declaration]
  37.    flush_signals(current);
  38.    ^~~~~~~~~~~~~
  39.    do_signal
  40. cc1: some warnings being treated as errors
  41. scripts/Makefile.build:332: recipe for target '/home/aidan/Downloads/Wi-Fi_driver/tl-wn823N-drivers-for-ubuntu-master/core/rtw_cmd.o' failed
  42. make[2]: *** [/home/aidan/Downloads/Wi-Fi_driver/tl-wn823N-drivers-for-ubuntu-master/core/rtw_cmd.o] Error 1
  43. Makefile:1551: recipe for target '_module_/home/aidan/Downloads/Wi-Fi_driver/tl-wn823N-drivers-for-ubuntu-master' failed
  44. make[1]: *** [_module_/home/aidan/Downloads/Wi-Fi_driver/tl-wn823N-drivers-for-ubuntu-master] Error 2
  45. make[1]: Leaving directory '/usr/src/linux-headers-4.15.0-43-generic'
  46. Makefile:1696: recipe for target 'modules' failed
  47. make: *** [modules] Error 2
Advertisement
Add Comment
Please, Sign In to add comment