liuk4friends

Netdata failed build log #4

Jan 29th, 2022
366
0
Never
Not a member of Pastebin yet? Sign Up, it unlocks many cool features!
Bash 191.48 KB | None | 0 0
  1. Mac-mini-di-Luca:tmp admin$ wget -O /tmp/netdata-kickstart.sh https://my-netdata.io/kickstart.sh
  2. --2022-01-29 19:25:08--  https://my-netdata.io/kickstart.sh
  3. Risoluzione di my-netdata.io (my-netdata.io)... 188.114.96.22, 188.114.97.22
  4. Connessione a my-netdata.io (my-netdata.io)|188.114.96.22|:443... connesso.
  5. Richiesta HTTP inviata, in attesa di risposta... 200 OK
  6. Lunghezza: non specificato [application/octet-stream]
  7. Salvataggio in: «/tmp/netdata-kickstart.sh»
  8.  
  9. /tmp/netdata-kickst     [ <=>                ]  43,36K  --.-KB/s    in 0,009s  
  10.  
  11. 2022-01-29 19:25:08 (4,81 MB/s) - «/tmp/netdata-kickstart.sh» salvato [44404]
  12.  
  13. Mac-mini-di-Luca:tmp admin$ CFLAGS="-I/usr/local/opt/[email protected]/include/" LDFLAGS="-L/usr/local/opt/[email protected]/lib" sh /tmp/netdata-kickstart.sh
  14.  
  15.  --- Using /var/folders/tm/bh_rhtyj47x8b5nl3dh3cm400000gn/T/netdata-kickstart-XXXXXXXXXX.zzC0dahv as a temporary directory. ---
  16.  --- No existing installations of netdata found, assuming this is a fresh install. ---
  17.  --- Fetching script to detect required packages... ---
  18. [/var/folders/tm/bh_rhtyj47x8b5nl3dh3cm400000gn/T/netdata-kickstart-XXXXXXXXXX.zzC0dahv]$ curl --fail -q -sSL --connect-timeout 10 --retry 3 --output /var/folders/tm/bh_rhtyj47x8b5nl3dh3cm400000gn/T/netdata-kickstart-XXXXXXXXXX.zzC0dahv/install-required-packages.sh https://raw.githubusercontent.com/netdata/netdata/master/packaging/installer/install-required-packages.sh
  19.  OK
  20.  
  21.  --- Running downloaded script to detect required packages... ---
  22. [/var/folders/tm/bh_rhtyj47x8b5nl3dh3cm400000gn/T/netdata-kickstart-XXXXXXXXXX.zzC0dahv]$ /usr/local/bin/bash /var/folders/tm/bh_rhtyj47x8b5nl3dh3cm400000gn/T/netdata-kickstart-XXXXXXXXXX.zzC0dahv/install-required-packages.sh netdata
  23.  
  24. We detected these:
  25. Distribution    : macos
  26. Version         : 19.6.0
  27. Codename        :
  28. Package Manager : install_brew
  29. Packages Tree   : macos
  30. Detection Method: uname
  31. Default Python v: 2 (will install python3 too)
  32.  
  33. Searching for distro_sdk ...
  34. Searching for autoconf_archive ...
  35. Searching for autogen ...
  36. Searching for libtool ...
  37. Searching for libz_dev ...
  38. Searching for libuuid_dev ...
  39. Searching for libmnl_dev ...
  40. Searching for json_c_dev ...
  41. Searching for libuv ...
  42. Searching for lz4 ...
  43. Searching for openssl ...
  44. Searching for judy ...
  45. Searching for libelf ...
  46.  
  47. The following command will be run:
  48.  
  49.  >> IMPORTANT <<
  50.     Please make sure your system is up to date
  51.     by running:  brew upgrade
  52.  
  53. brew install autoconf-archive autogen json-c-devel
  54.  
  55.  
  56. Press ENTER to run it >
  57. brew install autoconf-archive autogen json-c-devel
  58. Running `brew update --preinstall`...
  59. ==> Auto-updated Homebrew!
  60. Updated 3 taps (homebrew/core, homebrew/cask and homebrew/services).
  61. ==> New Formulae
  62. ascii2binary                       atlas                              weggli
  63. ==> Updated Formulae
  64. Updated 116 formulae.
  65. ==> New Casks
  66. soulseek
  67. ==> Updated Casks
  68. Updated 77 casks.
  69.  
  70. Warning: No available formula with the name "json-c-devel".
  71. ==> Searching for similarly named formulae...
  72. Error: No similarly named formulae found.
  73. ==> Searching for a previously deleted formula (in the last month)...
  74. Error: No previously deleted formula found.
  75. ==> Searching taps on GitHub...
  76. Error: No formulae found in taps.
  77.  
  78.  
  79.  
  80. We are very sorry!
  81.  
  82. Installation of required packages failed.
  83.  
  84. What to do now:
  85.  
  86.   1. Make sure your system is updated.
  87.      Most of the times, updating your system will resolve the issue.
  88.  
  89.   2. If the error message is about a specific package, try removing
  90.      that package from the command and run it again.
  91.      Depending on the broken package, you may be able to continue.
  92.  
  93.   3. Let us know. We may be able to help.
  94.      Open a github issue with the above log, at:
  95.  
  96.            https://github.com/netdata/netdata/issues
  97.  
  98.  
  99.  FAILED
  100.  
  101.  WARNING  It failed to install all the required packages, but installation might still be possible.
  102.  
  103. [/var/folders/tm/bh_rhtyj47x8b5nl3dh3cm400000gn/T/netdata-kickstart-XXXXXXXXXX.zzC0dahv]$ curl --fail -q -sSL --connect-timeout 10 --retry 3 --output /var/folders/tm/bh_rhtyj47x8b5nl3dh3cm400000gn/T/netdata-kickstart-XXXXXXXXXX.zzC0dahv/sha256sum.txt https://storage.googleapis.com/netdata-nightlies/sha256sums.txt
  104.  OK
  105.  
  106. [/var/folders/tm/bh_rhtyj47x8b5nl3dh3cm400000gn/T/netdata-kickstart-XXXXXXXXXX.zzC0dahv]$ curl --fail -q -sSL --connect-timeout 10 --retry 3 --output /var/folders/tm/bh_rhtyj47x8b5nl3dh3cm400000gn/T/netdata-kickstart-XXXXXXXXXX.zzC0dahv/netdata-latest.tar.gz https://storage.googleapis.com/netdata-nightlies/netdata-latest.tar.gz
  107.  OK
  108.  
  109. [/var/folders/tm/bh_rhtyj47x8b5nl3dh3cm400000gn/T/netdata-kickstart-XXXXXXXXXX.zzC0dahv]$ tar -xf /var/folders/tm/bh_rhtyj47x8b5nl3dh3cm400000gn/T/netdata-kickstart-XXXXXXXXXX.zzC0dahv/netdata-latest.tar.gz -C /var/folders/tm/bh_rhtyj47x8b5nl3dh3cm400000gn/T/netdata-kickstart-XXXXXXXXXX.zzC0dahv
  110.  OK
  111.  
  112.  --- Building netdata ---
  113. [/var/folders/tm/bh_rhtyj47x8b5nl3dh3cm400000gn/T/netdata-kickstart-XXXXXXXXXX.zzC0dahv/netdata-v1.33.0-9-g162f2b62b]$ sudo ./netdata-installer.sh --install-no-prefix /usr/local/netdata --auto-update --require-cloud
  114. Password:
  115.  
  116.   ^
  117.   |.-.   .-.   .-.   .-.   .  netdata                                        
  118.   |   '-'   '-'   '-'   '-'   real-time performance monitoring, done right!  
  119.   +----+-----+-----+-----+-----+-----+-----+-----+-----+-----+-----+-----+--->
  120.  
  121.  
  122.   You are about to build and install netdata to your system.
  123.  
  124.   The build process will use /tmp for
  125.   any temporary files. You can override this by setting $TMPDIR to a
  126.   writable directory where you can execute files.
  127.  
  128.   It will be installed at these locations:
  129.  
  130.    - the daemon     at /usr/local/netdata/usr/sbin/netdata
  131.    - config files   in /usr/local/netdata/etc/netdata
  132.    - web files      in /usr/local/netdata/usr/share/netdata
  133.    - plugins        in /usr/local/netdata/usr/libexec/netdata
  134.    - cache files    in /usr/local/netdata/var/cache/netdata
  135.    - db files       in /usr/local/netdata/var/lib/netdata
  136.    - log files      in /usr/local/netdata/var/log/netdata
  137.    - pid file       at /usr/local/netdata/var/run/netdata.pid
  138.    - logrotate file at /etc/logrotate.d/netdata
  139.  
  140.   This installer allows you to change the installation path.
  141.   Press Control-C and run the same command with --help for help.
  142.  
  143.  
  144.   NOTE:
  145.   Anonymous usage stats will be collected and sent to Netdata.
  146.   To opt-out, pass --disable-telemetry option to the installer or export
  147.   the environment variable DO_NOT_TRACK to a non-zero or non-empty value
  148.   (e.g: export DO_NOT_TRACK=1).
  149.  
  150. [/private/var/folders/tm/bh_rhtyj47x8b5nl3dh3cm400000gn/T/netdata-kickstart-XXXXXXXXXX.zzC0dahv/netdata-v1.33.0-9-g162f2b62b]# curl -q -sSL --connect-timeout 10 --retry 3 --output /var/folders/zz/zyxvpxvq6csfxvn_n0000000000000/T/netdata-protobuf-XXXXXX.p5uppL5d/protobuf-cpp-3.17.3.tar.gz https://github.com/protocolbuffers/protobuf/releases/download/v3.17.3/protobuf-cpp-3.17.3.tar.gz
  151.  OK  
  152.  
  153. protobuf-cpp-3.17.3.tar.gz: OK
  154. [/private/var/folders/tm/bh_rhtyj47x8b5nl3dh3cm400000gn/T/netdata-kickstart-XXXXXXXXXX.zzC0dahv/netdata-v1.33.0-9-g162f2b62b]# tar -xf /var/folders/zz/zyxvpxvq6csfxvn_n0000000000000/T/netdata-protobuf-XXXXXX.p5uppL5d/protobuf-cpp-3.17.3.tar.gz -C /var/folders/zz/zyxvpxvq6csfxvn_n0000000000000/T/netdata-protobuf-XXXXXX.p5uppL5d
  155.  OK  
  156.  
  157. [/var/folders/zz/zyxvpxvq6csfxvn_n0000000000000/T/netdata-protobuf-XXXXXX.p5uppL5d/protobuf-3.17.3]# env CFLAGS=-fPIC CXXFLAGS= LDFLAGS= ./configure --disable-shared --without-zlib --disable-dependency-tracking --with-pic
  158. checking whether to enable maintainer-specific portions of Makefiles... yes
  159. checking build system type... x86_64-apple-darwin19.6.0
  160. checking host system type... x86_64-apple-darwin19.6.0
  161. checking target system type... x86_64-apple-darwin19.6.0
  162. checking for a BSD-compatible install... /usr/bin/install -c
  163. checking whether build environment is sane... yes
  164. checking for a thread-safe mkdir -p... ./install-sh -c -d
  165. checking for gawk... no
  166. checking for mawk... no
  167. checking for nawk... no
  168. checking for awk... awk
  169. checking whether make sets $(MAKE)... yes
  170. checking whether make supports nested variables... yes
  171. checking whether UID '0' is supported by ustar format... yes
  172. checking whether GID '0' is supported by ustar format... yes
  173. checking how to create a ustar tar archive... gnutar
  174. checking whether make supports nested variables... (cached) yes
  175. checking for gcc... gcc
  176. checking whether the C compiler works... yes
  177. checking for C compiler default output file name... a.out
  178. checking for suffix of executables...
  179. checking whether we are cross compiling... no
  180. checking for suffix of object files... o
  181. checking whether we are using the GNU C compiler... yes
  182. checking whether gcc accepts -g... yes
  183. checking for gcc option to accept ISO C89... none needed
  184. checking whether gcc understands -c and -o together... yes
  185. checking whether make supports the include directive... yes (GNU style)
  186. checking dependency style of gcc... none
  187. checking for g++... g++
  188. checking whether we are using the GNU C++ compiler... yes
  189. checking whether g++ accepts -g... yes
  190. checking dependency style of g++... none
  191. checking how to run the C preprocessor... gcc -E
  192. checking for gcc... gcc
  193. checking whether we are using the GNU C compiler... (cached) yes
  194. checking whether gcc accepts -g... yes
  195. checking for gcc option to accept ISO C89... (cached) none needed
  196. checking whether gcc understands -c and -o together... (cached) yes
  197. checking dependency style of gcc... (cached) none
  198. checking how to run the C preprocessor... gcc -E
  199. checking how to run the C++ preprocessor... g++ -E
  200. checking for g++... g++
  201. checking whether we are using the GNU C++ compiler... (cached) yes
  202. checking whether g++ accepts -g... yes
  203. checking dependency style of g++... (cached) none
  204. checking how to run the C++ preprocessor... g++ -E
  205. checking for grep that handles long lines and -e... /usr/bin/grep
  206. checking for egrep... /usr/bin/grep -E
  207. checking for ANSI C header files... yes
  208. checking for sys/types.h... yes
  209. checking for sys/stat.h... yes
  210. checking for stdlib.h... yes
  211. checking for string.h... yes
  212. checking for memory.h... yes
  213. checking for strings.h... yes
  214. checking for inttypes.h... yes
  215. checking for stdint.h... yes
  216. checking for unistd.h... yes
  217. checking minix/config.h usability... no
  218. checking minix/config.h presence... no
  219. checking for minix/config.h... no
  220. checking whether it is safe to define __EXTENSIONS__... yes
  221. checking for ar... ar
  222. checking the archiver (ar) interface... ar
  223. checking for gcc... gcc
  224. checking whether we are using the GNU Objective C compiler... yes
  225. checking whether gcc accepts -g... yes
  226. checking dependency style of gcc... none
  227. checking C++ compiler flags...... use user-supplied:
  228. checking whether __SUNPRO_CC is declared... no
  229. checking how to print strings... printf
  230. checking for a sed that does not truncate output... /usr/bin/sed
  231. checking for fgrep... /usr/bin/grep -F
  232. checking for ld used by gcc... /Applications/Xcode.app/Contents/Developer/Toolchains/XcodeDefault.xctoolchain/usr/bin/ld
  233. checking if the linker (/Applications/Xcode.app/Contents/Developer/Toolchains/XcodeDefault.xctoolchain/usr/bin/ld) is GNU ld... no
  234. checking for BSD- or MS-compatible name lister (nm)... /usr/bin/nm -B
  235. checking the name lister (/usr/bin/nm -B) interface... BSD nm
  236. checking whether ln -s works... yes
  237. checking the maximum length of command line arguments... 196608
  238. checking how to convert x86_64-apple-darwin19.6.0 file names to x86_64-apple-darwin19.6.0 format... func_convert_file_noop
  239. checking how to convert x86_64-apple-darwin19.6.0 file names to toolchain format... func_convert_file_noop
  240. checking for /Applications/Xcode.app/Contents/Developer/Toolchains/XcodeDefault.xctoolchain/usr/bin/ld option to reload object files... -r
  241. checking for objdump... objdump
  242. checking how to recognize dependent libraries... pass_all
  243. checking for dlltool... no
  244. checking how to associate runtime and link libraries... printf %s\n
  245. checking for archiver @FILE support... no
  246. checking for strip... strip
  247. checking for ranlib... ranlib
  248. checking command to parse /usr/bin/nm -B output from gcc object... ok
  249. checking for sysroot... no
  250. checking for a working dd... /bin/dd
  251. checking how to truncate binary pipes... /bin/dd bs=4096 count=1
  252. checking for mt... no
  253. checking if : is a manifest tool... no
  254. checking for dsymutil... dsymutil
  255. checking for nmedit... nmedit
  256. checking for lipo... lipo
  257. checking for otool... otool
  258. checking for otool64... no
  259. checking for -single_module linker flag... yes
  260. checking for -exported_symbols_list linker flag... yes
  261. checking for -force_load linker flag... yes
  262. checking for dlfcn.h... yes
  263. checking for objdir... .libs
  264. checking if gcc supports -fno-rtti -fno-exceptions... yes
  265. checking for gcc option to produce PIC... -fno-common -DPIC
  266. checking if gcc PIC flag -fno-common -DPIC works... yes
  267. checking if gcc static flag -static works... no
  268. checking if gcc supports -c -o file.o... yes
  269. checking if gcc supports -c -o file.o... (cached) yes
  270. checking whether the gcc linker (/Applications/Xcode.app/Contents/Developer/Toolchains/XcodeDefault.xctoolchain/usr/bin/ld) supports shared libraries... yes
  271. checking dynamic linker characteristics... darwin19.6.0 dyld
  272. checking how to hardcode library paths into programs... immediate
  273. checking whether stripping libraries is possible... yes
  274. checking if libtool supports shared libraries... yes
  275. checking whether to build shared libraries... no
  276. checking whether to build static libraries... yes
  277. checking how to run the C++ preprocessor... g++ -E
  278. checking for ld used by g++... /Applications/Xcode.app/Contents/Developer/Toolchains/XcodeDefault.xctoolchain/usr/bin/ld
  279. checking if the linker (/Applications/Xcode.app/Contents/Developer/Toolchains/XcodeDefault.xctoolchain/usr/bin/ld) is GNU ld... no
  280. checking whether the g++ linker (/Applications/Xcode.app/Contents/Developer/Toolchains/XcodeDefault.xctoolchain/usr/bin/ld) supports shared libraries... yes
  281. checking for g++ option to produce PIC... -fno-common -DPIC
  282. checking if g++ PIC flag -fno-common -DPIC works... yes
  283. checking if g++ static flag -static works... no
  284. checking if g++ supports -c -o file.o... yes
  285. checking if g++ supports -c -o file.o... (cached) yes
  286. checking whether the g++ linker (/Applications/Xcode.app/Contents/Developer/Toolchains/XcodeDefault.xctoolchain/usr/bin/ld) supports shared libraries... yes
  287. checking dynamic linker characteristics... darwin19.6.0 dyld
  288. checking how to hardcode library paths into programs... immediate
  289. checking whether the linker supports version scripts... no
  290. checking for ANSI C header files... (cached) yes
  291. checking fcntl.h usability... yes
  292. checking fcntl.h presence... yes
  293. checking for fcntl.h... yes
  294. checking for inttypes.h... (cached) yes
  295. checking limits.h usability... yes
  296. checking limits.h presence... yes
  297. checking for limits.h... yes
  298. checking for stdlib.h... (cached) yes
  299. checking for unistd.h... (cached) yes
  300. checking for working memcmp... yes
  301. checking for working strtod... yes
  302. checking for ftruncate... yes
  303. checking for memset... yes
  304. checking for mkdir... yes
  305. checking for strchr... yes
  306. checking for strerror... yes
  307. checking for strtol... yes
  308. checking whether g++ supports C++11 features by default... no
  309. checking whether g++ supports C++11 features with -std=c++11... yes
  310. checking whether -latomic is needed... no
  311. checking whether gcc is Clang... yes
  312. checking whether pthreads work with "-pthread" and "-lpthread"... yes
  313. checking whether Clang needs flag to prevent "argument unused" warning when linking with -pthread... no
  314. checking for joinable pthread attribute... PTHREAD_CREATE_JOINABLE
  315. checking whether more special flags are required for pthreads... no
  316. checking for PTHREAD_PRIO_INHERIT... yes
  317. checking the location of hash_map... <unordered_map>
  318. checking whether -llog is needed... no
  319. checking that generated files are newer than configure... done
  320. configure: creating ./config.status
  321. config.status: creating Makefile
  322. config.status: creating src/Makefile
  323. config.status: creating benchmarks/Makefile
  324. config.status: creating conformance/Makefile
  325. config.status: creating protobuf.pc
  326. config.status: creating protobuf-lite.pc
  327. config.status: creating config.h
  328. config.status: executing depfiles commands
  329. config.status: executing libtool commands
  330. === configuring in third_party/googletest (/var/folders/zz/zyxvpxvq6csfxvn_n0000000000000/T/netdata-protobuf-XXXXXX.p5uppL5d/protobuf-3.17.3/third_party/googletest)
  331. configure: running /bin/sh ./configure --disable-option-checking '--prefix=/usr/local'  '--disable-shared' '--without-zlib' '--disable-dependency-tracking' '--with-pic' 'CFLAGS=-fPIC' 'LDFLAGS=' 'CXXFLAGS=' --cache-file=/dev/null --srcdir=.
  332. checking for a BSD-compatible install... /usr/bin/install -c
  333. checking whether build environment is sane... yes
  334. checking for a thread-safe mkdir -p... build-aux/install-sh -c -d
  335. checking for gawk... no
  336. checking for mawk... no
  337. checking for nawk... no
  338. checking for awk... awk
  339. checking whether make sets $(MAKE)... yes
  340. checking whether make supports nested variables... yes
  341. checking that generated files are newer than configure... done
  342. configure: creating ./config.status
  343. config.status: creating Makefile
  344. === configuring in googletest (/var/folders/zz/zyxvpxvq6csfxvn_n0000000000000/T/netdata-protobuf-XXXXXX.p5uppL5d/protobuf-3.17.3/third_party/googletest/googletest)
  345. configure: running /bin/sh ./configure --disable-option-checking '--prefix=/usr/local'  '--disable-shared' '--without-zlib' '--disable-dependency-tracking' '--with-pic' 'CFLAGS=-fPIC' 'LDFLAGS=' 'CXXFLAGS=' --cache-file=/dev/null --srcdir=.
  346. checking for a BSD-compatible install... /usr/bin/install -c
  347. checking whether build environment is sane... yes
  348. checking for a thread-safe mkdir -p... build-aux/install-sh -c -d
  349. checking for gawk... no
  350. checking for mawk... no
  351. checking for nawk... no
  352. checking for awk... awk
  353. checking whether make sets $(MAKE)... yes
  354. checking whether make supports nested variables... yes
  355. checking for gcc... gcc
  356. checking whether the C compiler works... yes
  357. checking for C compiler default output file name... a.out
  358. checking for suffix of executables...
  359. checking whether we are cross compiling... no
  360. checking for suffix of object files... o
  361. checking whether we are using the GNU C compiler... yes
  362. checking whether gcc accepts -g... yes
  363. checking for gcc option to accept ISO C89... none needed
  364. checking whether gcc understands -c and -o together... yes
  365. checking whether make supports the include directive... yes (GNU style)
  366. checking dependency style of gcc... none
  367. checking for g++... g++
  368. checking whether we are using the GNU C++ compiler... yes
  369. checking whether g++ accepts -g... yes
  370. checking dependency style of g++... none
  371. checking build system type... x86_64-apple-darwin19.6.0
  372. checking host system type... x86_64-apple-darwin19.6.0
  373. checking how to print strings... printf
  374. checking for a sed that does not truncate output... /usr/bin/sed
  375. checking for grep that handles long lines and -e... /usr/bin/grep
  376. checking for egrep... /usr/bin/grep -E
  377. checking for fgrep... /usr/bin/grep -F
  378. checking for ld used by gcc... /Applications/Xcode.app/Contents/Developer/Toolchains/XcodeDefault.xctoolchain/usr/bin/ld
  379. checking if the linker (/Applications/Xcode.app/Contents/Developer/Toolchains/XcodeDefault.xctoolchain/usr/bin/ld) is GNU ld... no
  380. checking for BSD- or MS-compatible name lister (nm)... /usr/bin/nm -B
  381. checking the name lister (/usr/bin/nm -B) interface... BSD nm
  382. checking whether ln -s works... yes
  383. checking the maximum length of command line arguments... 196608
  384. checking how to convert x86_64-apple-darwin19.6.0 file names to x86_64-apple-darwin19.6.0 format... func_convert_file_noop
  385. checking how to convert x86_64-apple-darwin19.6.0 file names to toolchain format... func_convert_file_noop
  386. checking for /Applications/Xcode.app/Contents/Developer/Toolchains/XcodeDefault.xctoolchain/usr/bin/ld option to reload object files... -r
  387. checking for objdump... objdump
  388. checking how to recognize dependent libraries... pass_all
  389. checking for dlltool... no
  390. checking how to associate runtime and link libraries... printf %s\n
  391. checking for ar... ar
  392. checking for archiver @FILE support... no
  393. checking for strip... strip
  394. checking for ranlib... ranlib
  395. checking command to parse /usr/bin/nm -B output from gcc object... ok
  396. checking for sysroot... no
  397. checking for a working dd... /bin/dd
  398. checking how to truncate binary pipes... /bin/dd bs=4096 count=1
  399. checking for mt... no
  400. checking if : is a manifest tool... no
  401. checking for dsymutil... dsymutil
  402. checking for nmedit... nmedit
  403. checking for lipo... lipo
  404. checking for otool... otool
  405. checking for otool64... no
  406. checking for -single_module linker flag... yes
  407. checking for -exported_symbols_list linker flag... yes
  408. checking for -force_load linker flag... yes
  409. checking how to run the C preprocessor... gcc -E
  410. checking for ANSI C header files... yes
  411. checking for sys/types.h... yes
  412. checking for sys/stat.h... yes
  413. checking for stdlib.h... yes
  414. checking for string.h... yes
  415. checking for memory.h... yes
  416. checking for strings.h... yes
  417. checking for inttypes.h... yes
  418. checking for stdint.h... yes
  419. checking for unistd.h... yes
  420. checking for dlfcn.h... yes
  421. checking for objdir... .libs
  422. checking if gcc supports -fno-rtti -fno-exceptions... yes
  423. checking for gcc option to produce PIC... -fno-common -DPIC
  424. checking if gcc PIC flag -fno-common -DPIC works... yes
  425. checking if gcc static flag -static works... no
  426. checking if gcc supports -c -o file.o... yes
  427. checking if gcc supports -c -o file.o... (cached) yes
  428. checking whether the gcc linker (/Applications/Xcode.app/Contents/Developer/Toolchains/XcodeDefault.xctoolchain/usr/bin/ld) supports shared libraries... yes
  429. checking dynamic linker characteristics... darwin19.6.0 dyld
  430. checking how to hardcode library paths into programs... immediate
  431. checking whether stripping libraries is possible... yes
  432. checking if libtool supports shared libraries... yes
  433. checking whether to build shared libraries... no
  434. checking whether to build static libraries... yes
  435. checking how to run the C++ preprocessor... g++ -E
  436. checking for ld used by g++... /Applications/Xcode.app/Contents/Developer/Toolchains/XcodeDefault.xctoolchain/usr/bin/ld
  437. checking if the linker (/Applications/Xcode.app/Contents/Developer/Toolchains/XcodeDefault.xctoolchain/usr/bin/ld) is GNU ld... no
  438. checking whether the g++ linker (/Applications/Xcode.app/Contents/Developer/Toolchains/XcodeDefault.xctoolchain/usr/bin/ld) supports shared libraries... yes
  439. checking for g++ option to produce PIC... -fno-common -DPIC
  440. checking if g++ PIC flag -fno-common -DPIC works... yes
  441. checking if g++ static flag -static works... no
  442. checking if g++ supports -c -o file.o... yes
  443. checking if g++ supports -c -o file.o... (cached) yes
  444. checking whether the g++ linker (/Applications/Xcode.app/Contents/Developer/Toolchains/XcodeDefault.xctoolchain/usr/bin/ld) supports shared libraries... yes
  445. checking dynamic linker characteristics... darwin19.6.0 dyld
  446. checking how to hardcode library paths into programs... immediate
  447. checking for python... /usr/bin/python
  448. checking for the pthreads library -lpthreads... no
  449. checking whether pthreads work without any flags... yes
  450. checking for joinable pthread attribute... PTHREAD_CREATE_JOINABLE
  451. checking if more special flags are required for pthreads... -D_THREAD_SAFE
  452. checking whether to check for GCC pthread/shared inconsistencies... no
  453. checking that generated files are newer than configure... done
  454. configure: creating ./config.status
  455. config.status: creating Makefile
  456. config.status: creating scripts/gtest-config
  457. config.status: creating build-aux/config.h
  458. config.status: executing depfiles commands
  459. config.status: executing libtool commands
  460. === configuring in googlemock (/var/folders/zz/zyxvpxvq6csfxvn_n0000000000000/T/netdata-protobuf-XXXXXX.p5uppL5d/protobuf-3.17.3/third_party/googletest/googlemock)
  461. configure: running /bin/sh ./configure --disable-option-checking '--prefix=/usr/local'  '--disable-shared' '--without-zlib' '--disable-dependency-tracking' '--with-pic' 'CFLAGS=-fPIC' 'LDFLAGS=' 'CXXFLAGS=' --cache-file=/dev/null --srcdir=.
  462. checking for a BSD-compatible install... /usr/bin/install -c
  463. checking whether build environment is sane... yes
  464. checking for a thread-safe mkdir -p... build-aux/install-sh -c -d
  465. checking for gawk... no
  466. checking for mawk... no
  467. checking for nawk... no
  468. checking for awk... awk
  469. checking whether make sets $(MAKE)... yes
  470. checking whether make supports nested variables... yes
  471. checking for gcc... gcc
  472. checking whether the C compiler works... yes
  473. checking for C compiler default output file name... a.out
  474. checking for suffix of executables...
  475. checking whether we are cross compiling... no
  476. checking for suffix of object files... o
  477. checking whether we are using the GNU C compiler... yes
  478. checking whether gcc accepts -g... yes
  479. checking for gcc option to accept ISO C89... none needed
  480. checking whether gcc understands -c and -o together... yes
  481. checking whether make supports the include directive... yes (GNU style)
  482. checking dependency style of gcc... none
  483. checking for g++... g++
  484. checking whether we are using the GNU C++ compiler... yes
  485. checking whether g++ accepts -g... yes
  486. checking dependency style of g++... none
  487. checking build system type... x86_64-apple-darwin19.6.0
  488. checking host system type... x86_64-apple-darwin19.6.0
  489. checking how to print strings... printf
  490. checking for a sed that does not truncate output... /usr/bin/sed
  491. checking for grep that handles long lines and -e... /usr/bin/grep
  492. checking for egrep... /usr/bin/grep -E
  493. checking for fgrep... /usr/bin/grep -F
  494. checking for ld used by gcc... /Applications/Xcode.app/Contents/Developer/Toolchains/XcodeDefault.xctoolchain/usr/bin/ld
  495. checking if the linker (/Applications/Xcode.app/Contents/Developer/Toolchains/XcodeDefault.xctoolchain/usr/bin/ld) is GNU ld... no
  496. checking for BSD- or MS-compatible name lister (nm)... /usr/bin/nm -B
  497. checking the name lister (/usr/bin/nm -B) interface... BSD nm
  498. checking whether ln -s works... yes
  499. checking the maximum length of command line arguments... 196608
  500. checking how to convert x86_64-apple-darwin19.6.0 file names to x86_64-apple-darwin19.6.0 format... func_convert_file_noop
  501. checking how to convert x86_64-apple-darwin19.6.0 file names to toolchain format... func_convert_file_noop
  502. checking for /Applications/Xcode.app/Contents/Developer/Toolchains/XcodeDefault.xctoolchain/usr/bin/ld option to reload object files... -r
  503. checking for objdump... objdump
  504. checking how to recognize dependent libraries... pass_all
  505. checking for dlltool... no
  506. checking how to associate runtime and link libraries... printf %s\n
  507. checking for ar... ar
  508. checking for archiver @FILE support... no
  509. checking for strip... strip
  510. checking for ranlib... ranlib
  511. checking command to parse /usr/bin/nm -B output from gcc object... ok
  512. checking for sysroot... no
  513. checking for a working dd... /bin/dd
  514. checking how to truncate binary pipes... /bin/dd bs=4096 count=1
  515. checking for mt... no
  516. checking if : is a manifest tool... no
  517. checking for dsymutil... dsymutil
  518. checking for nmedit... nmedit
  519. checking for lipo... lipo
  520. checking for otool... otool
  521. checking for otool64... no
  522. checking for -single_module linker flag... yes
  523. checking for -exported_symbols_list linker flag... yes
  524. checking for -force_load linker flag... yes
  525. checking how to run the C preprocessor... gcc -E
  526. checking for ANSI C header files... yes
  527. checking for sys/types.h... yes
  528. checking for sys/stat.h... yes
  529. checking for stdlib.h... yes
  530. checking for string.h... yes
  531. checking for memory.h... yes
  532. checking for strings.h... yes
  533. checking for inttypes.h... yes
  534. checking for stdint.h... yes
  535. checking for unistd.h... yes
  536. checking for dlfcn.h... yes
  537. checking for objdir... .libs
  538. checking if gcc supports -fno-rtti -fno-exceptions... yes
  539. checking for gcc option to produce PIC... -fno-common -DPIC
  540. checking if gcc PIC flag -fno-common -DPIC works... yes
  541. checking if gcc static flag -static works... no
  542. checking if gcc supports -c -o file.o... yes
  543. checking if gcc supports -c -o file.o... (cached) yes
  544. checking whether the gcc linker (/Applications/Xcode.app/Contents/Developer/Toolchains/XcodeDefault.xctoolchain/usr/bin/ld) supports shared libraries... yes
  545. checking dynamic linker characteristics... darwin19.6.0 dyld
  546. checking how to hardcode library paths into programs... immediate
  547. checking whether stripping libraries is possible... yes
  548. checking if libtool supports shared libraries... yes
  549. checking whether to build shared libraries... no
  550. checking whether to build static libraries... yes
  551. checking how to run the C++ preprocessor... g++ -E
  552. checking for ld used by g++... /Applications/Xcode.app/Contents/Developer/Toolchains/XcodeDefault.xctoolchain/usr/bin/ld
  553. checking if the linker (/Applications/Xcode.app/Contents/Developer/Toolchains/XcodeDefault.xctoolchain/usr/bin/ld) is GNU ld... no
  554. checking whether the g++ linker (/Applications/Xcode.app/Contents/Developer/Toolchains/XcodeDefault.xctoolchain/usr/bin/ld) supports shared libraries... yes
  555. checking for g++ option to produce PIC... -fno-common -DPIC
  556. checking if g++ PIC flag -fno-common -DPIC works... yes
  557. checking if g++ static flag -static works... no
  558. checking if g++ supports -c -o file.o... yes
  559. checking if g++ supports -c -o file.o... (cached) yes
  560. checking whether the g++ linker (/Applications/Xcode.app/Contents/Developer/Toolchains/XcodeDefault.xctoolchain/usr/bin/ld) supports shared libraries... yes
  561. checking dynamic linker characteristics... darwin19.6.0 dyld
  562. checking how to hardcode library paths into programs... immediate
  563. checking for python... /usr/bin/python
  564. checking for the pthreads library -lpthreads... no
  565. checking whether pthreads work without any flags... yes
  566. checking for joinable pthread attribute... PTHREAD_CREATE_JOINABLE
  567. checking if more special flags are required for pthreads... -D_THREAD_SAFE
  568. checking whether to check for GCC pthread/shared inconsistencies... no
  569. checking for gtest-config... no
  570. checking that generated files are newer than configure... done
  571. configure: creating ./config.status
  572. config.status: creating Makefile
  573. config.status: creating scripts/gmock-config
  574. config.status: creating build-aux/config.h
  575. config.status: executing depfiles commands
  576. config.status: executing libtool commands
  577.  OK  
  578.  
  579. [/var/folders/zz/zyxvpxvq6csfxvn_n0000000000000/T/netdata-protobuf-XXXXXX.p5uppL5d/protobuf-3.17.3]# env CFLAGS=-fPIC CXXFLAGS= LDFLAGS= make -j4
  580. /Applications/Xcode.app/Contents/Developer/usr/bin/make  all-recursive
  581. Making all in .
  582. make[2]: Nothing to be done for `all-am'.
  583. Making all in src
  584.  CXX      google/protobuf/compiler/code_generator.lo
  585.  CXX      google/protobuf/compiler/command_line_interface.lo
  586.  CXX      google/protobuf/compiler/plugin.lo
  587.  CXX      google/protobuf/compiler/plugin.pb.lo
  588.  CXX      google/protobuf/compiler/subprocess.lo
  589.  CXX      google/protobuf/compiler/zip_writer.lo
  590.  CXX      google/protobuf/compiler/main.o
  591.  CXX      google/protobuf/stubs/bytestream.lo
  592.  CXX      google/protobuf/stubs/common.lo
  593.  CXX      google/protobuf/stubs/int128.lo
  594.  CXX      google/protobuf/io/io_win32.lo
  595.  CXX      google/protobuf/stubs/status.lo
  596.  CXX      google/protobuf/stubs/statusor.lo
  597.  CXX      google/protobuf/stubs/stringpiece.lo
  598.  CXX      google/protobuf/stubs/stringprintf.lo
  599.  CXX      google/protobuf/stubs/structurally_valid.lo
  600.  CXX      google/protobuf/stubs/strutil.lo
  601.  CXX      google/protobuf/stubs/time.lo
  602.  CXX      google/protobuf/any_lite.lo
  603.  CXX      google/protobuf/arena.lo
  604.  CXX      google/protobuf/arenastring.lo
  605.  CXX      google/protobuf/extension_set.lo
  606.  CXX      google/protobuf/field_access_listener.lo
  607.  CXX      google/protobuf/generated_enum_util.lo
  608.  CXX      google/protobuf/generated_message_util.lo
  609.  CXX      google/protobuf/generated_message_table_driven_lite.lo
  610.  CXX      google/protobuf/implicit_weak_message.lo
  611.  CXX      google/protobuf/map.lo
  612.  CXX      google/protobuf/message_lite.lo
  613.  CXX      google/protobuf/parse_context.lo
  614.  CXX      google/protobuf/repeated_field.lo
  615.  CXX      google/protobuf/wire_format_lite.lo
  616.  CXX      google/protobuf/io/coded_stream.lo
  617.  CXX      google/protobuf/io/strtod.lo
  618.  CXX      google/protobuf/io/zero_copy_stream.lo
  619.  CXX      google/protobuf/io/zero_copy_stream_impl.lo
  620.  CXX      google/protobuf/io/zero_copy_stream_impl_lite.lo
  621.  CXX      google/protobuf/any.pb.lo
  622.  CXX      google/protobuf/api.pb.lo
  623.  CXX      google/protobuf/any.lo
  624.  CXX      google/protobuf/descriptor.lo
  625.  CXX      google/protobuf/descriptor_database.lo
  626.  CXX      google/protobuf/descriptor.pb.lo
  627.  CXX      google/protobuf/duration.pb.lo
  628.  CXX      google/protobuf/dynamic_message.lo
  629.  CXX      google/protobuf/empty.pb.lo
  630.  CXX      google/protobuf/extension_set_heavy.lo
  631.  CXX      google/protobuf/field_mask.pb.lo
  632.  CXX      google/protobuf/generated_message_reflection.lo
  633.  CXX      google/protobuf/generated_message_table_driven.lo
  634.  CXX      google/protobuf/map_field.lo
  635.  CXX      google/protobuf/message.lo
  636.  CXX      google/protobuf/reflection_ops.lo
  637.  CXX      google/protobuf/service.lo
  638.  CXX      google/protobuf/source_context.pb.lo
  639.  CXX      google/protobuf/struct.pb.lo
  640.  CXX      google/protobuf/stubs/substitute.lo
  641.  CXX      google/protobuf/text_format.lo
  642.  CXX      google/protobuf/timestamp.pb.lo
  643.  CXX      google/protobuf/type.pb.lo
  644.  CXX      google/protobuf/unknown_field_set.lo
  645.  CXX      google/protobuf/wire_format.lo
  646.  CXX      google/protobuf/wrappers.pb.lo
  647.  CXX      google/protobuf/io/gzip_stream.lo
  648.  CXX      google/protobuf/io/printer.lo
  649.  CXX      google/protobuf/io/tokenizer.lo
  650.  CXX      google/protobuf/compiler/importer.lo
  651.  CXX      google/protobuf/compiler/parser.lo
  652.  CXX      google/protobuf/util/delimited_message_util.lo
  653.  CXX      google/protobuf/util/field_comparator.lo
  654.  CXX      google/protobuf/util/field_mask_util.lo
  655.  CXX      google/protobuf/util/internal/datapiece.lo
  656.  CXX      google/protobuf/util/internal/default_value_objectwriter.lo
  657.  CXX      google/protobuf/util/internal/error_listener.lo
  658.  CXX      google/protobuf/util/internal/field_mask_utility.lo
  659.  CXX      google/protobuf/util/internal/json_escaping.lo
  660.  CXX      google/protobuf/util/internal/json_objectwriter.lo
  661.  CXX      google/protobuf/util/internal/json_stream_parser.lo
  662.  CXX      google/protobuf/util/internal/object_writer.lo
  663.  CXX      google/protobuf/util/internal/protostream_objectsource.lo
  664.  CXX      google/protobuf/util/internal/protostream_objectwriter.lo
  665.  CXX      google/protobuf/util/internal/proto_writer.lo
  666.  CXX      google/protobuf/util/internal/type_info.lo
  667.  CXX      google/protobuf/util/internal/type_info_test_helper.lo
  668.  CXX      google/protobuf/util/internal/utility.lo
  669.  CXX      google/protobuf/util/json_util.lo
  670.  CXX      google/protobuf/util/message_differencer.lo
  671.  CXX      google/protobuf/util/time_util.lo
  672.  CXX      google/protobuf/util/type_resolver_util.lo
  673.  CXX      google/protobuf/compiler/cpp/cpp_enum.lo
  674.  CXX      google/protobuf/compiler/cpp/cpp_enum_field.lo
  675.  CXX      google/protobuf/compiler/cpp/cpp_extension.lo
  676.  CXX      google/protobuf/compiler/cpp/cpp_field.lo
  677.  CXX      google/protobuf/compiler/cpp/cpp_file.lo
  678.  CXX      google/protobuf/compiler/cpp/cpp_generator.lo
  679.  CXX      google/protobuf/compiler/cpp/cpp_helpers.lo
  680.  CXX      google/protobuf/compiler/cpp/cpp_map_field.lo
  681.  CXX      google/protobuf/compiler/cpp/cpp_message.lo
  682.  CXX      google/protobuf/compiler/cpp/cpp_message_field.lo
  683. google/protobuf/compiler/cpp/cpp_helpers.cc:173:6: warning: function 'Base63Char' is not needed and will
  684.      not be emitted [-Wunneeded-internal-declaration]
  685. char Base63Char(int value) {
  686.     ^
  687.  CXX      google/protobuf/compiler/cpp/cpp_padding_optimizer.lo
  688. 1 warning generated.
  689.  CXX      google/protobuf/compiler/cpp/cpp_parse_function_generator.lo
  690.  CXX      google/protobuf/compiler/cpp/cpp_primitive_field.lo
  691.  CXX      google/protobuf/compiler/cpp/cpp_service.lo
  692.  CXX      google/protobuf/compiler/cpp/cpp_string_field.lo
  693.  CXX      google/protobuf/compiler/java/java_context.lo
  694.  CXX      google/protobuf/compiler/java/java_enum.lo
  695.  CXX      google/protobuf/compiler/java/java_enum_lite.lo
  696.  CXX      google/protobuf/compiler/java/java_enum_field.lo
  697.  CXX      google/protobuf/compiler/java/java_enum_field_lite.lo
  698.  CXX      google/protobuf/compiler/java/java_extension.lo
  699.  CXX      google/protobuf/compiler/java/java_extension_lite.lo
  700.  CXX      google/protobuf/compiler/java/java_field.lo
  701.  CXX      google/protobuf/compiler/java/java_file.lo
  702.  CXX      google/protobuf/compiler/java/java_generator.lo
  703. In file included from google/protobuf/compiler/java/java_field.cc:45:
  704. ./google/protobuf/compiler/java/java_map_field.h:68:15: warning: 'GetBoxedType' overrides a member
  705.      function but is not marked 'override' [-Winconsistent-missing-override]
  706.  std::string GetBoxedType() const;
  707.              ^
  708. ./google/protobuf/compiler/java/java_field.h:92:23: note: overridden virtual function is here
  709.  virtual std::string GetBoxedType() const = 0;
  710.                      ^
  711.  CXX      google/protobuf/compiler/java/java_generator_factory.lo
  712. 1 warning generated.
  713.  CXX      google/protobuf/compiler/java/java_helpers.lo
  714.  CXX      google/protobuf/compiler/java/java_kotlin_generator.lo
  715. In file included from google/protobuf/compiler/java/java_generator_factory.cc:42:
  716. ./google/protobuf/compiler/java/java_message_lite.h:53:16: warning: 'Generate' overrides a member
  717.      function but is not marked 'override' [-Winconsistent-missing-override]
  718.  virtual void Generate(io::Printer* printer);
  719.               ^
  720. ./google/protobuf/compiler/java/java_message.h:79:16: note: overridden virtual function is here
  721.  virtual void Generate(io::Printer* printer) = 0;
  722.               ^
  723. In file included from google/protobuf/compiler/java/java_generator_factory.cc:42:
  724. ./google/protobuf/compiler/java/java_message_lite.h:54:16: warning: 'GenerateInterface' overrides a
  725.      member function but is not marked 'override' [-Winconsistent-missing-override]
  726.  virtual void GenerateInterface(io::Printer* printer);
  727.               ^
  728. ./google/protobuf/compiler/java/java_message.h:83:16: note: overridden virtual function is here
  729.  virtual void GenerateInterface(io::Printer* printer) = 0;
  730.               ^
  731. In file included from google/protobuf/compiler/java/java_generator_factory.cc:42:
  732. ./google/protobuf/compiler/java/java_message_lite.h:55:16: warning: 'GenerateExtensionRegistrationCode'
  733.      overrides a member function but is not marked 'override' [-Winconsistent-missing-override]
  734.  virtual void GenerateExtensionRegistrationCode(io::Printer* printer);
  735.               ^
  736. ./google/protobuf/compiler/java/java_message.h:87:16: note: overridden virtual function is here
  737.  virtual void GenerateExtensionRegistrationCode(io::Printer* printer) = 0;
  738.               ^
  739. In file included from google/protobuf/compiler/java/java_generator_factory.cc:42:
  740. ./google/protobuf/compiler/java/java_message_lite.h:56:16: warning: 'GenerateStaticVariables' overrides a
  741.      member function but is not marked 'override' [-Winconsistent-missing-override]
  742.  virtual void GenerateStaticVariables(io::Printer* printer,
  743.               ^
  744. ./google/protobuf/compiler/java/java_message.h:71:16: note: overridden virtual function is here
  745.  virtual void GenerateStaticVariables(io::Printer* printer,
  746.               ^
  747. In file included from google/protobuf/compiler/java/java_generator_factory.cc:42:
  748. ./google/protobuf/compiler/java/java_message_lite.h:58:15: warning: 'GenerateStaticVariableInitializers'
  749.      overrides a member function but is not marked 'override' [-Winconsistent-missing-override]
  750.  virtual int GenerateStaticVariableInitializers(io::Printer* printer);
  751.              ^
  752. ./google/protobuf/compiler/java/java_message.h:76:15: note: overridden virtual function is here
  753.  virtual int GenerateStaticVariableInitializers(io::Printer* printer) = 0;
  754.              ^
  755. 5 warnings generated.
  756.  CXX      google/protobuf/compiler/java/java_map_field.lo
  757.  CXX      google/protobuf/compiler/java/java_map_field_lite.lo
  758.  CXX      google/protobuf/compiler/java/java_message.lo
  759. In file included from google/protobuf/compiler/java/java_map_field.cc:31:
  760. ./google/protobuf/compiler/java/java_map_field.h:68:15: warning: 'GetBoxedType' overrides a member
  761.      function but is not marked 'override' [-Winconsistent-missing-override]
  762.  std::string GetBoxedType() const;
  763.              ^
  764. ./google/protobuf/compiler/java/java_field.h:92:23: note: overridden virtual function is here
  765.  virtual std::string GetBoxedType() const = 0;
  766.                      ^
  767.  CXX      google/protobuf/compiler/java/java_message_lite.lo
  768.  CXX      google/protobuf/compiler/java/java_message_builder.lo
  769. 1 warning generated.
  770.  CXX      google/protobuf/compiler/java/java_message_builder_lite.lo
  771. In file included from google/protobuf/compiler/java/java_message_lite.cc:35:
  772. ./google/protobuf/compiler/java/java_message_lite.h:53:16: warning: 'Generate' overrides a member
  773.      function but is not marked 'override' [-Winconsistent-missing-override]
  774.  virtual void Generate(io::Printer* printer);
  775.               ^
  776. ./google/protobuf/compiler/java/java_message.h:79:16: note: overridden virtual function is here
  777.  virtual void Generate(io::Printer* printer) = 0;
  778.               ^
  779. In file included from google/protobuf/compiler/java/java_message_lite.cc:35:
  780. ./google/protobuf/compiler/java/java_message_lite.h:54:16: warning: 'GenerateInterface' overrides a
  781.      member function but is not marked 'override' [-Winconsistent-missing-override]
  782.  virtual void GenerateInterface(io::Printer* printer);
  783.               ^
  784. ./google/protobuf/compiler/java/java_message.h:83:16: note: overridden virtual function is here
  785.  virtual void GenerateInterface(io::Printer* printer) = 0;
  786.               ^
  787. In file included from google/protobuf/compiler/java/java_message_lite.cc:35:
  788. ./google/protobuf/compiler/java/java_message_lite.h:55:16: warning: 'GenerateExtensionRegistrationCode'
  789.      overrides a member function but is not marked 'override' [-Winconsistent-missing-override]
  790.  virtual void GenerateExtensionRegistrationCode(io::Printer* printer);
  791.               ^
  792. ./google/protobuf/compiler/java/java_message.h:87:16: note: overridden virtual function is here
  793.  virtual void GenerateExtensionRegistrationCode(io::Printer* printer) = 0;
  794.               ^
  795. In file included from google/protobuf/compiler/java/java_message_lite.cc:35:
  796. ./google/protobuf/compiler/java/java_message_lite.h:56:16: warning: 'GenerateStaticVariables' overrides a
  797.      member function but is not marked 'override' [-Winconsistent-missing-override]
  798.  virtual void GenerateStaticVariables(io::Printer* printer,
  799.               ^
  800. ./google/protobuf/compiler/java/java_message.h:71:16: note: overridden virtual function is here
  801.  virtual void GenerateStaticVariables(io::Printer* printer,
  802.               ^
  803. In file included from google/protobuf/compiler/java/java_message_lite.cc:35:
  804. ./google/protobuf/compiler/java/java_message_lite.h:58:15: warning: 'GenerateStaticVariableInitializers'
  805.      overrides a member function but is not marked 'override' [-Winconsistent-missing-override]
  806.  virtual int GenerateStaticVariableInitializers(io::Printer* printer);
  807.              ^
  808. ./google/protobuf/compiler/java/java_message.h:76:15: note: overridden virtual function is here
  809.  virtual int GenerateStaticVariableInitializers(io::Printer* printer) = 0;
  810.              ^
  811.  CXX      google/protobuf/compiler/java/java_message_field.lo
  812. 5 warnings generated.
  813.  CXX      google/protobuf/compiler/java/java_message_field_lite.lo
  814.  CXX      google/protobuf/compiler/java/java_name_resolver.lo
  815.  CXX      google/protobuf/compiler/java/java_primitive_field.lo
  816.  CXX      google/protobuf/compiler/java/java_primitive_field_lite.lo
  817.  CXX      google/protobuf/compiler/java/java_shared_code_generator.lo
  818.  CXX      google/protobuf/compiler/java/java_service.lo
  819.  CXX      google/protobuf/compiler/java/java_string_field.lo
  820.  CXX      google/protobuf/compiler/java/java_string_field_lite.lo
  821.  CXX      google/protobuf/compiler/java/java_doc_comment.lo
  822.  CXX      google/protobuf/compiler/js/js_generator.lo
  823.  CXX      google/protobuf/compiler/js/well_known_types_embed.lo
  824.  CXX      google/protobuf/compiler/objectivec/objectivec_enum.lo
  825.  CXX      google/protobuf/compiler/objectivec/objectivec_enum_field.lo
  826.  CXX      google/protobuf/compiler/objectivec/objectivec_extension.lo
  827.  CXX      google/protobuf/compiler/objectivec/objectivec_field.lo
  828. google/protobuf/compiler/js/js_generator.cc:97:6: warning: unused function 'StrEndsWith'
  829.      [-Wunused-function]
  830. bool StrEndsWith(StringPiece sp, StringPiece x) {
  831.     ^
  832.  CXX      google/protobuf/compiler/objectivec/objectivec_file.lo
  833.  CXX      google/protobuf/compiler/objectivec/objectivec_generator.lo
  834. 1 warning generated.
  835.  CXX      google/protobuf/compiler/objectivec/objectivec_helpers.lo
  836.  CXX      google/protobuf/compiler/objectivec/objectivec_map_field.lo
  837.  CXX      google/protobuf/compiler/objectivec/objectivec_message.lo
  838.  CXX      google/protobuf/compiler/objectivec/objectivec_message_field.lo
  839.  CXX      google/protobuf/compiler/objectivec/objectivec_oneof.lo
  840.  CXX      google/protobuf/compiler/objectivec/objectivec_primitive_field.lo
  841.  CXX      google/protobuf/compiler/php/php_generator.lo
  842.  CXX      google/protobuf/compiler/python/python_generator.lo
  843.  CXX      google/protobuf/compiler/ruby/ruby_generator.lo
  844.  CXX      google/protobuf/compiler/csharp/csharp_doc_comment.lo
  845.  CXX      google/protobuf/compiler/csharp/csharp_enum.lo
  846.  CXX      google/protobuf/compiler/csharp/csharp_enum_field.lo
  847.  CXX      google/protobuf/compiler/csharp/csharp_field_base.lo
  848.  CXX      google/protobuf/compiler/csharp/csharp_generator.lo
  849.  CXX      google/protobuf/compiler/csharp/csharp_helpers.lo
  850.  CXX      google/protobuf/compiler/csharp/csharp_map_field.lo
  851.  CXX      google/protobuf/compiler/csharp/csharp_message.lo
  852.  CXX      google/protobuf/compiler/csharp/csharp_message_field.lo
  853.  CXX      google/protobuf/compiler/csharp/csharp_primitive_field.lo
  854.  CXX      google/protobuf/compiler/csharp/csharp_reflection_class.lo
  855.  CXX      google/protobuf/compiler/csharp/csharp_repeated_enum_field.lo
  856.  CXX      google/protobuf/compiler/csharp/csharp_repeated_message_field.lo
  857.  CXX      google/protobuf/compiler/csharp/csharp_repeated_primitive_field.lo
  858.  CXX      google/protobuf/compiler/csharp/csharp_source_generator_base.lo
  859.  CXX      google/protobuf/compiler/csharp/csharp_wrapper_field.lo
  860.  CXXLD    libprotobuf-lite.la
  861. /Applications/Xcode.app/Contents/Developer/Toolchains/XcodeDefault.xctoolchain/usr/bin/ranlib: file: .libs/libprotobuf-lite.a(io_win32.o) has no symbols
  862. /Applications/Xcode.app/Contents/Developer/Toolchains/XcodeDefault.xctoolchain/usr/bin/ranlib: file: .libs/libprotobuf-lite.a(io_win32.o) has no symbols
  863.  CXXLD    libprotobuf.la
  864. /Applications/Xcode.app/Contents/Developer/Toolchains/XcodeDefault.xctoolchain/usr/bin/ranlib: file: .libs/libprotobuf.a(io_win32.o) has no symbols
  865. /Applications/Xcode.app/Contents/Developer/Toolchains/XcodeDefault.xctoolchain/usr/bin/ranlib: file: .libs/libprotobuf.a(gzip_stream.o) has no symbols
  866. /Applications/Xcode.app/Contents/Developer/Toolchains/XcodeDefault.xctoolchain/usr/bin/ranlib: file: .libs/libprotobuf.a(error_listener.o) has no symbols
  867. /Applications/Xcode.app/Contents/Developer/Toolchains/XcodeDefault.xctoolchain/usr/bin/ranlib: file: .libs/libprotobuf.a(io_win32.o) has no symbols
  868. /Applications/Xcode.app/Contents/Developer/Toolchains/XcodeDefault.xctoolchain/usr/bin/ranlib: file: .libs/libprotobuf.a(gzip_stream.o) has no symbols
  869. /Applications/Xcode.app/Contents/Developer/Toolchains/XcodeDefault.xctoolchain/usr/bin/ranlib: file: .libs/libprotobuf.a(error_listener.o) has no symbols
  870. In file included from google/protobuf/compiler/csharp/csharp_source_generator_base.cc:39:
  871. ./google/protobuf/compiler/csharp/csharp_source_generator_base.h:62:25: warning: private field
  872.      'descriptor_' is not used [-Wunused-private-field]
  873.  const FileDescriptor* descriptor_;
  874.                        ^
  875. 1 warning generated.
  876.  CXXLD    libprotoc.la
  877.  CXXLD    protoc
  878. OK  
  879.  
  880. [/private/var/folders/tm/bh_rhtyj47x8b5nl3dh3cm400000gn/T/netdata-kickstart-XXXXXXXXXX.zzC0dahv/netdata-v1.33.0-9-g162f2b62b]# mkdir -p /private/var/folders/tm/bh_rhtyj47x8b5nl3dh3cm400000gn/T/netdata-kickstart-XXXXXXXXXX.zzC0dahv/netdata-v1.33.0-9-g162f2b62b/externaldeps/protobuf
  881. OK  
  882.  
  883. [/private/var/folders/tm/bh_rhtyj47x8b5nl3dh3cm400000gn/T/netdata-kickstart-XXXXXXXXXX.zzC0dahv/netdata-v1.33.0-9-g162f2b62b]# cp -a /var/folders/zz/zyxvpxvq6csfxvn_n0000000000000/T/netdata-protobuf-XXXXXX.p5uppL5d/protobuf-3.17.3/src /private/var/folders/tm/bh_rhtyj47x8b5nl3dh3cm400000gn/T/netdata-kickstart-XXXXXXXXXX.zzC0dahv/netdata-v1.33.0-9-g162f2b62b/externaldeps/protobuf
  884. OK  
  885.  
  886. OK  protobuf built and prepared.
  887.  
  888. --- /usr/include/Judy.h does not exist, but we need libJudy, building our own copy ---
  889. --- Prepare libJudy ---
  890. [/private/var/folders/tm/bh_rhtyj47x8b5nl3dh3cm400000gn/T/netdata-kickstart-XXXXXXXXXX.zzC0dahv/netdata-v1.33.0-9-g162f2b62b]# curl -q -sSL --connect-timeout 10 --retry 3 --output /var/folders/zz/zyxvpxvq6csfxvn_n0000000000000/T/netdata-judy-XXXXXX.SRAYb2Ny/v1.0.5-netdata2.tar.gz https://github.com/netdata/libjudy/archive/v1.0.5-netdata2.tar.gz
  891. OK  
  892.  
  893. v1.0.5-netdata2.tar.gz: OK
  894. [/private/var/folders/tm/bh_rhtyj47x8b5nl3dh3cm400000gn/T/netdata-kickstart-XXXXXXXXXX.zzC0dahv/netdata-v1.33.0-9-g162f2b62b]# tar -xf /var/folders/zz/zyxvpxvq6csfxvn_n0000000000000/T/netdata-judy-XXXXXX.SRAYb2Ny/v1.0.5-netdata2.tar.gz -C /var/folders/zz/zyxvpxvq6csfxvn_n0000000000000/T/netdata-judy-XXXXXX.SRAYb2Ny
  895. OK  
  896.  
  897. [/var/folders/zz/zyxvpxvq6csfxvn_n0000000000000/T/netdata-judy-XXXXXX.SRAYb2Ny/libjudy-1.0.5-netdata2]# env CFLAGS=-fPIC CXXFLAGS= LDFLAGS= glibtoolize --force --copy
  898. glibtoolize: putting auxiliary files in '.'.
  899. glibtoolize: copying file './ltmain.sh'
  900. glibtoolize: You should add the contents of the following files to 'aclocal.m4':
  901. glibtoolize:   '/usr/local/Cellar/libtool/2.4.6_4/share/aclocal/libtool.m4'
  902. glibtoolize:   '/usr/local/Cellar/libtool/2.4.6_4/share/aclocal/ltoptions.m4'
  903. glibtoolize:   '/usr/local/Cellar/libtool/2.4.6_4/share/aclocal/ltsugar.m4'
  904. glibtoolize:   '/usr/local/Cellar/libtool/2.4.6_4/share/aclocal/ltversion.m4'
  905. glibtoolize:   '/usr/local/Cellar/libtool/2.4.6_4/share/aclocal/lt~obsolete.m4'
  906. glibtoolize: Consider adding 'AC_CONFIG_MACRO_DIRS([m4])' to configure.ac,
  907. glibtoolize: and rerunning glibtoolize and aclocal.
  908. glibtoolize: Consider adding '-I m4' to ACLOCAL_AMFLAGS in Makefile.am.
  909. OK  
  910.  
  911. [/var/folders/zz/zyxvpxvq6csfxvn_n0000000000000/T/netdata-judy-XXXXXX.SRAYb2Ny/libjudy-1.0.5-netdata2]# env CFLAGS=-fPIC CXXFLAGS= LDFLAGS= aclocal
  912. OK  
  913.  
  914. [/var/folders/zz/zyxvpxvq6csfxvn_n0000000000000/T/netdata-judy-XXXXXX.SRAYb2Ny/libjudy-1.0.5-netdata2]# env CFLAGS=-fPIC CXXFLAGS= LDFLAGS= autoheader
  915. OK  
  916.  
  917. [/var/folders/zz/zyxvpxvq6csfxvn_n0000000000000/T/netdata-judy-XXXXXX.SRAYb2Ny/libjudy-1.0.5-netdata2]# env CFLAGS=-fPIC CXXFLAGS= LDFLAGS= automake --add-missing --force --copy --include-deps
  918. configure.ac:7: warning: AM_INIT_AUTOMAKE: two- and three-arguments forms are deprecated.  For more info, see:
  919. configure.ac:7: https://www.gnu.org/software/automake/manual/automake.html#Modernize-AM_005fINIT_005fAUTOMAKE-invocation
  920. configure.ac:147: installing './compile'
  921. configure.ac:223: installing './config.guess'
  922. configure.ac:223: installing './config.sub'
  923. configure.ac:7: installing './install-sh'
  924. configure.ac:7: installing './missing'
  925. src/Judy1/Makefile.am:1: warning: 'INCLUDES' is the old name for 'AM_CPPFLAGS' (or '*_CPPFLAGS')
  926. src/Judy1/Makefile.am: installing './depcomp'
  927. src/JudyCommon/Makefile.am:1: warning: 'INCLUDES' is the old name for 'AM_CPPFLAGS' (or '*_CPPFLAGS')
  928. src/JudyHS/Makefile.am:1: warning: 'INCLUDES' is the old name for 'AM_CPPFLAGS' (or '*_CPPFLAGS')
  929. src/JudyL/Makefile.am:1: warning: 'INCLUDES' is the old name for 'AM_CPPFLAGS' (or '*_CPPFLAGS')
  930. src/JudySL/Makefile.am:1: warning: 'INCLUDES' is the old name for 'AM_CPPFLAGS' (or '*_CPPFLAGS')
  931. src/Makefile.am:1: warning: naming a subdirectory 'obj' causes troubles with BSD make
  932. parallel-tests: installing './test-driver'
  933. tool/Makefile.am:1: warning: 'INCLUDES' is the old name for 'AM_CPPFLAGS' (or '*_CPPFLAGS')
  934. OK  
  935.  
  936. [/var/folders/zz/zyxvpxvq6csfxvn_n0000000000000/T/netdata-judy-XXXXXX.SRAYb2Ny/libjudy-1.0.5-netdata2]# env CFLAGS=-fPIC CXXFLAGS= LDFLAGS= autoconf
  937. configure.ac:7: warning: AM_INIT_AUTOMAKE: two- and three-arguments forms are deprecated.
  938. ./lib/autoconf/general.m4:2434: AC_DIAGNOSE is expanded from...
  939. aclocal.m4:9453: AM_INIT_AUTOMAKE is expanded from...
  940. configure.ac:7: the top level
  941. configure.ac:12: warning: 'AM_CONFIG_HEADER': this macro is obsolete.
  942. configure.ac:12: You should use the 'AC_CONFIG_HEADERS' macro instead.
  943. ./lib/autoconf/general.m4:2434: AC_DIAGNOSE is expanded from...
  944. aclocal.m4:9805: AM_CONFIG_HEADER is expanded from...
  945. configure.ac:12: the top level
  946. configure.ac:110: warning: The macro `AC_HELP_STRING' is obsolete.
  947. configure.ac:110: You should run autoupdate.
  948. ./lib/autoconf/general.m4:204: AC_HELP_STRING is expanded from...
  949. configure.ac:110: the top level
  950. configure.ac:119: warning: The macro `AC_HELP_STRING' is obsolete.
  951. configure.ac:119: You should run autoupdate.
  952. ./lib/autoconf/general.m4:204: AC_HELP_STRING is expanded from...
  953. configure.ac:119: the top level
  954. configure.ac:156: warning: The macro `AC_HEADER_STDC' is obsolete.
  955. configure.ac:156: You should run autoupdate.
  956. ./lib/autoconf/headers.m4:704: AC_HEADER_STDC is expanded from...
  957. configure.ac:156: the top level
  958. configure.ac:168: warning: The macro `AC_HEADER_TIME' is obsolete.
  959. configure.ac:168: You should run autoupdate.
  960. ./lib/autoconf/headers.m4:743: AC_HEADER_TIME is expanded from...
  961. configure.ac:168: the top level
  962. configure.ac:238: warning: The macro `AM_PROG_LIBTOOL' is obsolete.
  963. configure.ac:238: You should run autoupdate.
  964. aclocal.m4:122: AM_PROG_LIBTOOL is expanded from...
  965. configure.ac:238: the top level
  966.  OK  
  967.  
  968. [/var/folders/zz/zyxvpxvq6csfxvn_n0000000000000/T/netdata-judy-XXXXXX.SRAYb2Ny/libjudy-1.0.5-netdata2]# env CFLAGS=-fPIC CXXFLAGS= LDFLAGS= ./configure
  969. checking whether to enable maintainer-specific portions of Makefiles... no
  970. checking for a BSD-compatible install... /usr/bin/install -c
  971. checking whether build environment is sane... yes
  972. checking for a race-free mkdir -p... ./install-sh -c -d
  973. checking for gawk... no
  974. checking for mawk... no
  975. checking for nawk... no
  976. checking for awk... awk
  977. checking whether make sets $(MAKE)... yes
  978. checking whether make supports nested variables... yes
  979. checking which flavor to build... product
  980. checking for gcc... gcc
  981. checking whether the C compiler works... yes
  982. checking for C compiler default output file name... a.out
  983. checking for suffix of executables...
  984. checking whether we are cross compiling... no
  985. checking for suffix of object files... o
  986. checking whether the compiler supports GNU C... yes
  987. checking whether gcc accepts -g... yes
  988. checking for gcc option to enable C11 features... none needed
  989. checking whether gcc understands -c and -o together... yes
  990. checking whether make supports the include directive... yes (GNU style)
  991. checking dependency style of gcc... gcc3
  992. checking how to run the C preprocessor... gcc -E
  993. checking whether ln -s works... yes
  994. checking whether make sets $(MAKE)... (cached) yes
  995. checking for stdio.h... yes
  996. checking for stdlib.h... yes
  997. checking for string.h... yes
  998. checking for inttypes.h... yes
  999. checking for stdint.h... yes
  1000. checking for strings.h... yes
  1001. checking for sys/stat.h... yes
  1002. checking for sys/types.h... yes
  1003. checking for unistd.h... yes
  1004. checking for sys/time.h... yes
  1005. checking for sys/param.h... yes
  1006. checking for grep that handles long lines and -e... /usr/bin/grep
  1007. checking for egrep... /usr/bin/grep -E
  1008. checking for fcntl.h... yes
  1009. checking for inttypes.h... (cached) yes
  1010. checking for limits.h... yes
  1011. checking for malloc.h... no
  1012. checking for stddef.h... yes
  1013. checking for stdint.h... (cached) yes
  1014. checking for stdlib.h... (cached) yes
  1015. checking for string.h... (cached) yes
  1016. checking for strings.h... (cached) yes
  1017. checking for sys/param.h... (cached) yes
  1018. checking for sys/time.h... (cached) yes
  1019. checking for unistd.h... (cached) yes
  1020. checking for _Bool... yes
  1021. checking for stdbool.h that conforms to C99... yes
  1022. checking for an ANSI C-conforming const... yes
  1023. checking for inline... inline
  1024. checking for size_t... yes
  1025. checking whether struct tm is in sys/time.h or time.h... time.h
  1026. checking for working volatile... yes
  1027. checking for ptrdiff_t... yes
  1028. checking whether byte ordering is bigendian... no
  1029. checking size of void *... 8
  1030. Detected 64-bit Build Environment
  1031. checking for error_at_line... no
  1032. checking build system type... x86_64-apple-darwin19.6.0
  1033. checking host system type... x86_64-apple-darwin19.6.0
  1034. checking for GNU libc compatible malloc... yes
  1035. checking for working memcmp... yes
  1036. checking for getpagesize... yes
  1037. checking for vprintf... yes
  1038. checking for working mmap... yes
  1039. checking whether lstat correctly handles trailing slash... no
  1040. checking whether stat accepts an empty string... no
  1041. checking for getpagesize... (cached) yes
  1042. checking for gettimeofday... yes
  1043. checking for memset... yes
  1044. checking for munmap... yes
  1045. checking for pow... yes
  1046. checking for strchr... yes
  1047. checking for strcspn... yes
  1048. checking for strerror... yes
  1049. checking for strstr... yes
  1050. checking for strtoul... yes
  1051. checking for uname... yes
  1052. checking for ar... ar
  1053. checking for ld... ld
  1054. checking for ranlib... ranlib
  1055. checking how to print strings... printf
  1056. checking for a sed that does not truncate output... /usr/bin/sed
  1057. checking for fgrep... /usr/bin/grep -F
  1058. checking for ld used by gcc... ld
  1059. checking if the linker (ld) is GNU ld... no
  1060. checking for BSD- or MS-compatible name lister (nm)... /usr/bin/nm -B
  1061. checking the name lister (/usr/bin/nm -B) interface... BSD nm
  1062. checking the maximum length of command line arguments... 196608
  1063. checking how to convert x86_64-apple-darwin19.6.0 file names to x86_64-apple-darwin19.6.0 format... func_convert_file_noop
  1064. checking how to convert x86_64-apple-darwin19.6.0 file names to toolchain format... func_convert_file_noop
  1065. checking for ld option to reload object files... -r
  1066. checking for objdump... objdump
  1067. checking how to recognize dependent libraries... pass_all
  1068. checking for dlltool... no
  1069. checking how to associate runtime and link libraries... printf %s\n
  1070. checking for archiver @FILE support... no
  1071. checking for strip... strip
  1072. checking for ranlib... (cached) ranlib
  1073. checking command to parse /usr/bin/nm -B output from gcc object... ok
  1074. checking for sysroot... no
  1075. checking for a working dd... /bin/dd
  1076. checking how to truncate binary pipes... /bin/dd bs=4096 count=1
  1077. checking for mt... no
  1078. checking if : is a manifest tool... no
  1079. checking for dsymutil... dsymutil
  1080. checking for nmedit... nmedit
  1081. checking for lipo... lipo
  1082. checking for otool... otool
  1083. checking for otool64... no
  1084. checking for -single_module linker flag... yes
  1085. checking for -exported_symbols_list linker flag... yes
  1086. checking for -force_load linker flag... yes
  1087. checking for dlfcn.h... yes
  1088. checking for objdir... .libs
  1089. checking if gcc supports -fno-rtti -fno-exceptions... yes
  1090. checking for gcc option to produce PIC... -fno-common -DPIC
  1091. checking if gcc PIC flag -fno-common -DPIC works... yes
  1092. checking if gcc static flag -static works... no
  1093. checking if gcc supports -c -o file.o... yes
  1094. checking if gcc supports -c -o file.o... (cached) yes
  1095. checking whether the gcc linker (ld) supports shared libraries... yes
  1096. checking dynamic linker characteristics... darwin19.6.0 dyld
  1097. checking how to hardcode library paths into programs... immediate
  1098. checking whether stripping libraries is possible... yes
  1099. checking if libtool supports shared libraries... yes
  1100. checking whether to build shared libraries... yes
  1101. checking whether to build static libraries... yes
  1102. checking that generated files are newer than configure... done
  1103. configure: creating ./config.status
  1104. config.status: creating Makefile
  1105. config.status: creating src/Judy1/Makefile
  1106. config.status: creating src/JudyCommon/Makefile
  1107. config.status: creating src/JudyHS/Makefile
  1108. config.status: creating src/JudyL/Makefile
  1109. config.status: creating src/JudySL/Makefile
  1110. config.status: creating src/Makefile
  1111. config.status: creating src/obj/Makefile
  1112. config.status: creating tool/Makefile
  1113. config.status: creating doc/Makefile
  1114. config.status: creating test/Makefile
  1115. config.status: creating config.h
  1116. config.status: executing depfiles commands
  1117. config.status: executing libtool commands
  1118.  OK  
  1119.  
  1120. [/var/folders/zz/zyxvpxvq6csfxvn_n0000000000000/T/netdata-judy-XXXXXX.SRAYb2Ny/libjudy-1.0.5-netdata2]# env CFLAGS=-fPIC CXXFLAGS= LDFLAGS= make -j4 -C src
  1121. Making all in .
  1122. make[1]: Nothing to be done for `all-am'.
  1123. Making all in JudyCommon
  1124. /bin/sh ../../libtool  --tag=CC   --mode=compile gcc -DHAVE_CONFIG_H -I. -I../.. -I. -I..   -fPIC -DJU_64BIT   -fPIC -DJU_64BIT -MT JudyMalloc.lo -MD -MP -MF .deps/JudyMalloc.Tpo -c -o JudyMalloc.lo JudyMalloc.c
  1125. libtool: compile:  gcc -DHAVE_CONFIG_H -I. -I../.. -I. -I.. -fPIC -DJU_64BIT -fPIC -DJU_64BIT -MT JudyMalloc.lo -MD -MP -MF .deps/JudyMalloc.Tpo -c JudyMalloc.c  -fno-common -DPIC -o .libs/JudyMalloc.o
  1126. libtool: compile:  gcc -DHAVE_CONFIG_H -I. -I../.. -I. -I.. -fPIC -DJU_64BIT -fPIC -DJU_64BIT -MT JudyMalloc.lo -MD -MP -MF .deps/JudyMalloc.Tpo -c JudyMalloc.c -o JudyMalloc.o >/dev/null 2>&1
  1127. mv -f .deps/JudyMalloc.Tpo .deps/JudyMalloc.Plo
  1128. /bin/sh ../../libtool  --tag=CC   --mode=link gcc -fPIC -DJU_64BIT   -fPIC -DJU_64BIT   -o libJudyMalloc.la  JudyMalloc.lo  
  1129. libtool: link: ar cru .libs/libJudyMalloc.a .libs/JudyMalloc.o
  1130. libtool: link: ranlib .libs/libJudyMalloc.a
  1131. libtool: link: ( cd ".libs" && rm -f "libJudyMalloc.la" && ln -s "../libJudyMalloc.la" "libJudyMalloc.la" )
  1132. Making all in JudyL
  1133. cp -f ../JudyCommon/JudyCascade.c           JudyLCascade.c
  1134. cp -f ../JudyCommon/JudyTables.c            JudyLTablesGen.c
  1135. cp -f ../JudyCommon/JudyCount.c             JudyLCount.c
  1136. cp -f ../JudyCommon/JudyCreateBranch.c      JudyLCreateBranch.c
  1137. cp -f ../JudyCommon/JudyDecascade.c         JudyLDecascade.c
  1138. cp -f ../JudyCommon/JudyDel.c               JudyLDel.c
  1139. cp -f ../JudyCommon/JudyFirst.c             JudyLFirst.c
  1140. cp -f ../JudyCommon/JudyFreeArray.c         JudyLFreeArray.c
  1141. cp -f ../JudyCommon/JudyGet.c               JudyLGet.c
  1142. cp -f ../JudyCommon/JudyInsArray.c          JudyLInsArray.c
  1143. cp -f ../JudyCommon/JudyIns.c               JudyLIns.c
  1144. cp -f ../JudyCommon/JudyInsertBranch.c      JudyLInsertBranch.c
  1145. cp -f ../JudyCommon/JudyMallocIF.c          JudyLMallocIF.c
  1146. cp -f ../JudyCommon/JudyMemActive.c         JudyLMemActive.c
  1147. cp -f ../JudyCommon/JudyMemUsed.c           JudyLMemUsed.c
  1148. cp -f ../JudyCommon/JudyPrevNext.c          JudyLNext.c
  1149. cp -f ../JudyCommon/JudyPrevNextEmpty.c     JudyLNextEmpty.c
  1150. cp -f ../JudyCommon/JudyPrevNext.c          JudyLPrev.c
  1151. cp -f ../JudyCommon/JudyPrevNextEmpty.c     JudyLPrevEmpty.c
  1152. cp -f ../JudyCommon/JudyByCount.c           JudyLByCount.c  
  1153. cp -f ../JudyCommon/JudyGet.c               j__udyLGet.c
  1154. /bin/sh ../../libtool  --tag=CC   --mode=compile gcc -DHAVE_CONFIG_H -I. -I../.. -I. -I.. -I../JudyCommon/    -DJUDYL   -fPIC -DJU_64BIT -MT JudyLCascade.lo -MD -MP -MF .deps/JudyLCascade.Tpo -c -o JudyLCascade.lo JudyLCascade.c
  1155. gcc -I. -I.. -I../JudyCommon/  -DJUDYL   -fPIC -DJU_64BIT -o JudyLTablesGen JudyLTablesGen.c; ./JudyLTablesGen
  1156. /bin/sh ../../libtool  --tag=CC   --mode=compile gcc -DHAVE_CONFIG_H -I. -I../.. -I. -I.. -I../JudyCommon/    -DJUDYL   -fPIC -DJU_64BIT -MT JudyLCount.lo -MD -MP -MF .deps/JudyLCount.Tpo -c -o JudyLCount.lo JudyLCount.c
  1157. /bin/sh ../../libtool  --tag=CC   --mode=compile gcc -DHAVE_CONFIG_H -I. -I../.. -I. -I.. -I../JudyCommon/    -DJUDYL   -fPIC -DJU_64BIT -MT JudyLCreateBranch.lo -MD -MP -MF .deps/JudyLCreateBranch.Tpo -c -o JudyLCreateBranch.lo JudyLCreateBranch.c
  1158. libtool: compile:  gcc -DHAVE_CONFIG_H -I. -I../.. -I. -I.. -I../JudyCommon/ -DJUDYL -fPIC -DJU_64BIT -MT JudyLCount.lo -MD -MP -MF .deps/JudyLCount.Tpo -c JudyLCount.c  -fno-common -DPIC -o .libs/JudyLCount.o
  1159. libtool: compile:  gcc -DHAVE_CONFIG_H -I. -I../.. -I. -I.. -I../JudyCommon/ -DJUDYL -fPIC -DJU_64BIT -MT JudyLCreateBranch.lo -MD -MP -MF .deps/JudyLCreateBranch.Tpo -c JudyLCreateBranch.c  -fno-common -DPIC -o .libs/JudyLCreateBranch.o
  1160. libtool: compile:  gcc -DHAVE_CONFIG_H -I. -I../.. -I. -I.. -I../JudyCommon/ -DJUDYL -fPIC -DJU_64BIT -MT JudyLCascade.lo -MD -MP -MF .deps/JudyLCascade.Tpo -c JudyLCascade.c  -fno-common -DPIC -o .libs/JudyLCascade.o
  1161. libtool: compile:  gcc -DHAVE_CONFIG_H -I. -I../.. -I. -I.. -I../JudyCommon/ -DJUDYL -fPIC -DJU_64BIT -MT JudyLCreateBranch.lo -MD -MP -MF .deps/JudyLCreateBranch.Tpo -c JudyLCreateBranch.c -o JudyLCreateBranch.o >/dev/null 2>&1
  1162. libtool: compile:  gcc -DHAVE_CONFIG_H -I. -I../.. -I. -I.. -I../JudyCommon/ -DJUDYL -fPIC -DJU_64BIT -MT JudyLCount.lo -MD -MP -MF .deps/JudyLCount.Tpo -c JudyLCount.c -o JudyLCount.o >/dev/null 2>&1
  1163. /bin/sh ../../libtool  --tag=CC   --mode=compile gcc -DHAVE_CONFIG_H -I. -I../.. -I. -I.. -I../JudyCommon/    -DJUDYL   -fPIC -DJU_64BIT -MT JudyLDecascade.lo -MD -MP -MF .deps/JudyLDecascade.Tpo -c -o JudyLDecascade.lo JudyLDecascade.c
  1164. libtool: compile:  gcc -DHAVE_CONFIG_H -I. -I../.. -I. -I.. -I../JudyCommon/ -DJUDYL -fPIC -DJU_64BIT -MT JudyLCascade.lo -MD -MP -MF .deps/JudyLCascade.Tpo -c JudyLCascade.c -o JudyLCascade.o >/dev/null 2>&1
  1165. mv -f .deps/JudyLCreateBranch.Tpo .deps/JudyLCreateBranch.Plo
  1166. /bin/sh ../../libtool  --tag=CC   --mode=compile gcc -DHAVE_CONFIG_H -I. -I../.. -I. -I.. -I../JudyCommon/    -DJUDYL   -fPIC -DJU_64BIT -MT JudyLDel.lo -MD -MP -MF .deps/JudyLDel.Tpo -c -o JudyLDel.lo JudyLDel.c
  1167. mv -f .deps/JudyLCount.Tpo .deps/JudyLCount.Plo
  1168. /bin/sh ../../libtool  --tag=CC   --mode=compile gcc -DHAVE_CONFIG_H -I. -I../.. -I. -I.. -I../JudyCommon/    -DJUDYL   -fPIC -DJU_64BIT -MT JudyLFirst.lo -MD -MP -MF .deps/JudyLFirst.Tpo -c -o JudyLFirst.lo JudyLFirst.c
  1169. libtool: compile:  gcc -DHAVE_CONFIG_H -I. -I../.. -I. -I.. -I../JudyCommon/ -DJUDYL -fPIC -DJU_64BIT -MT JudyLDecascade.lo -MD -MP -MF .deps/JudyLDecascade.Tpo -c JudyLDecascade.c  -fno-common -DPIC -o .libs/JudyLDecascade.o
  1170. libtool: compile:  gcc -DHAVE_CONFIG_H -I. -I../.. -I. -I.. -I../JudyCommon/ -DJUDYL -fPIC -DJU_64BIT -MT JudyLDel.lo -MD -MP -MF .deps/JudyLDel.Tpo -c JudyLDel.c  -fno-common -DPIC -o .libs/JudyLDel.o
  1171. mv -f .deps/JudyLCascade.Tpo .deps/JudyLCascade.Plo
  1172. /bin/sh ../../libtool  --tag=CC   --mode=compile gcc -DHAVE_CONFIG_H -I. -I../.. -I. -I.. -I../JudyCommon/    -DJUDYL   -fPIC -DJU_64BIT -MT JudyLFreeArray.lo -MD -MP -MF .deps/JudyLFreeArray.Tpo -c -o JudyLFreeArray.lo JudyLFreeArray.c
  1173. libtool: compile:  gcc -DHAVE_CONFIG_H -I. -I../.. -I. -I.. -I../JudyCommon/ -DJUDYL -fPIC -DJU_64BIT -MT JudyLFirst.lo -MD -MP -MF .deps/JudyLFirst.Tpo -c JudyLFirst.c  -fno-common -DPIC -o .libs/JudyLFirst.o
  1174. libtool: compile:  gcc -DHAVE_CONFIG_H -I. -I../.. -I. -I.. -I../JudyCommon/ -DJUDYL -fPIC -DJU_64BIT -MT JudyLDecascade.lo -MD -MP -MF .deps/JudyLDecascade.Tpo -c JudyLDecascade.c -o JudyLDecascade.o >/dev/null 2>&1
  1175. libtool: compile:  gcc -DHAVE_CONFIG_H -I. -I../.. -I. -I.. -I../JudyCommon/ -DJUDYL -fPIC -DJU_64BIT -MT JudyLFirst.lo -MD -MP -MF .deps/JudyLFirst.Tpo -c JudyLFirst.c -o JudyLFirst.o >/dev/null 2>&1
  1176. libtool: compile:  gcc -DHAVE_CONFIG_H -I. -I../.. -I. -I.. -I../JudyCommon/ -DJUDYL -fPIC -DJU_64BIT -MT JudyLFreeArray.lo -MD -MP -MF .deps/JudyLFreeArray.Tpo -c JudyLFreeArray.c  -fno-common -DPIC -o .libs/JudyLFreeArray.o
  1177. mv -f .deps/JudyLDecascade.Tpo .deps/JudyLDecascade.Plo
  1178. /bin/sh ../../libtool  --tag=CC   --mode=compile gcc -DHAVE_CONFIG_H -I. -I../.. -I. -I.. -I../JudyCommon/    -DJUDYL   -fPIC -DJU_64BIT -MT JudyLGet.lo -MD -MP -MF .deps/JudyLGet.Tpo -c -o JudyLGet.lo JudyLGet.c
  1179. mv -f .deps/JudyLFirst.Tpo .deps/JudyLFirst.Plo
  1180. /bin/sh ../../libtool  --tag=CC   --mode=compile gcc -DHAVE_CONFIG_H -I. -I../.. -I. -I.. -I../JudyCommon/    -DJUDYL   -fPIC -DJU_64BIT -MT JudyLInsArray.lo -MD -MP -MF .deps/JudyLInsArray.Tpo -c -o JudyLInsArray.lo JudyLInsArray.c
  1181. libtool: compile:  gcc -DHAVE_CONFIG_H -I. -I../.. -I. -I.. -I../JudyCommon/ -DJUDYL -fPIC -DJU_64BIT -MT JudyLFreeArray.lo -MD -MP -MF .deps/JudyLFreeArray.Tpo -c JudyLFreeArray.c -o JudyLFreeArray.o >/dev/null 2>&1
  1182. libtool: compile:  gcc -DHAVE_CONFIG_H -I. -I../.. -I. -I.. -I../JudyCommon/ -DJUDYL -fPIC -DJU_64BIT -MT JudyLDel.lo -MD -MP -MF .deps/JudyLDel.Tpo -c JudyLDel.c -o JudyLDel.o >/dev/null 2>&1
  1183. mv -f .deps/JudyLFreeArray.Tpo .deps/JudyLFreeArray.Plo
  1184. libtool: compile:  gcc -DHAVE_CONFIG_H -I. -I../.. -I. -I.. -I../JudyCommon/ -DJUDYL -fPIC -DJU_64BIT -MT JudyLGet.lo -MD -MP -MF .deps/JudyLGet.Tpo -c JudyLGet.c  -fno-common -DPIC -o .libs/JudyLGet.o
  1185. /bin/sh ../../libtool  --tag=CC   --mode=compile gcc -DHAVE_CONFIG_H -I. -I../.. -I. -I.. -I../JudyCommon/    -DJUDYL   -fPIC -DJU_64BIT -MT JudyLIns.lo -MD -MP -MF .deps/JudyLIns.Tpo -c -o JudyLIns.lo JudyLIns.c
  1186. libtool: compile:  gcc -DHAVE_CONFIG_H -I. -I../.. -I. -I.. -I../JudyCommon/ -DJUDYL -fPIC -DJU_64BIT -MT JudyLInsArray.lo -MD -MP -MF .deps/JudyLInsArray.Tpo -c JudyLInsArray.c  -fno-common -DPIC -o .libs/JudyLInsArray.o
  1187. libtool: compile:  gcc -DHAVE_CONFIG_H -I. -I../.. -I. -I.. -I../JudyCommon/ -DJUDYL -fPIC -DJU_64BIT -MT JudyLGet.lo -MD -MP -MF .deps/JudyLGet.Tpo -c JudyLGet.c -o JudyLGet.o >/dev/null 2>&1
  1188. libtool: compile:  gcc -DHAVE_CONFIG_H -I. -I../.. -I. -I.. -I../JudyCommon/ -DJUDYL -fPIC -DJU_64BIT -MT JudyLIns.lo -MD -MP -MF .deps/JudyLIns.Tpo -c JudyLIns.c  -fno-common -DPIC -o .libs/JudyLIns.o
  1189. libtool: compile:  gcc -DHAVE_CONFIG_H -I. -I../.. -I. -I.. -I../JudyCommon/ -DJUDYL -fPIC -DJU_64BIT -MT JudyLInsArray.lo -MD -MP -MF .deps/JudyLInsArray.Tpo -c JudyLInsArray.c -o JudyLInsArray.o >/dev/null 2>&1
  1190. mv -f .deps/JudyLGet.Tpo .deps/JudyLGet.Plo
  1191. /bin/sh ../../libtool  --tag=CC   --mode=compile gcc -DHAVE_CONFIG_H -I. -I../.. -I. -I.. -I../JudyCommon/    -DJUDYL   -fPIC -DJU_64BIT -MT JudyLInsertBranch.lo -MD -MP -MF .deps/JudyLInsertBranch.Tpo -c -o JudyLInsertBranch.lo JudyLInsertBranch.c
  1192. mv -f .deps/JudyLDel.Tpo .deps/JudyLDel.Plo
  1193. /bin/sh ../../libtool  --tag=CC   --mode=compile gcc -DHAVE_CONFIG_H -I. -I../.. -I. -I.. -I../JudyCommon/    -DJUDYL   -fPIC -DJU_64BIT -MT JudyLMallocIF.lo -MD -MP -MF .deps/JudyLMallocIF.Tpo -c -o JudyLMallocIF.lo JudyLMallocIF.c
  1194. mv -f .deps/JudyLInsArray.Tpo .deps/JudyLInsArray.Plo
  1195. /bin/sh ../../libtool  --tag=CC   --mode=compile gcc -DHAVE_CONFIG_H -I. -I../.. -I. -I.. -I../JudyCommon/    -DJUDYL   -fPIC -DJU_64BIT -MT JudyLMemActive.lo -MD -MP -MF .deps/JudyLMemActive.Tpo -c -o JudyLMemActive.lo JudyLMemActive.c
  1196. libtool: compile:  gcc -DHAVE_CONFIG_H -I. -I../.. -I. -I.. -I../JudyCommon/ -DJUDYL -fPIC -DJU_64BIT -MT JudyLIns.lo -MD -MP -MF .deps/JudyLIns.Tpo -c JudyLIns.c -o JudyLIns.o >/dev/null 2>&1
  1197. libtool: compile:  gcc -DHAVE_CONFIG_H -I. -I../.. -I. -I.. -I../JudyCommon/ -DJUDYL -fPIC -DJU_64BIT -MT JudyLInsertBranch.lo -MD -MP -MF .deps/JudyLInsertBranch.Tpo -c JudyLInsertBranch.c  -fno-common -DPIC -o .libs/JudyLInsertBranch.o
  1198. libtool: compile:  gcc -DHAVE_CONFIG_H -I. -I../.. -I. -I.. -I../JudyCommon/ -DJUDYL -fPIC -DJU_64BIT -MT JudyLMallocIF.lo -MD -MP -MF .deps/JudyLMallocIF.Tpo -c JudyLMallocIF.c  -fno-common -DPIC -o .libs/JudyLMallocIF.o
  1199. libtool: compile:  gcc -DHAVE_CONFIG_H -I. -I../.. -I. -I.. -I../JudyCommon/ -DJUDYL -fPIC -DJU_64BIT -MT JudyLMemActive.lo -MD -MP -MF .deps/JudyLMemActive.Tpo -c JudyLMemActive.c  -fno-common -DPIC -o .libs/JudyLMemActive.o
  1200. libtool: compile:  gcc -DHAVE_CONFIG_H -I. -I../.. -I. -I.. -I../JudyCommon/ -DJUDYL -fPIC -DJU_64BIT -MT JudyLInsertBranch.lo -MD -MP -MF .deps/JudyLInsertBranch.Tpo -c JudyLInsertBranch.c -o JudyLInsertBranch.o >/dev/null 2>&1
  1201. libtool: compile:  gcc -DHAVE_CONFIG_H -I. -I../.. -I. -I.. -I../JudyCommon/ -DJUDYL -fPIC -DJU_64BIT -MT JudyLMallocIF.lo -MD -MP -MF .deps/JudyLMallocIF.Tpo -c JudyLMallocIF.c -o JudyLMallocIF.o >/dev/null 2>&1
  1202. libtool: compile:  gcc -DHAVE_CONFIG_H -I. -I../.. -I. -I.. -I../JudyCommon/ -DJUDYL -fPIC -DJU_64BIT -MT JudyLMemActive.lo -MD -MP -MF .deps/JudyLMemActive.Tpo -c JudyLMemActive.c -o JudyLMemActive.o >/dev/null 2>&1
  1203. mv -f .deps/JudyLInsertBranch.Tpo .deps/JudyLInsertBranch.Plo
  1204. /bin/sh ../../libtool  --tag=CC   --mode=compile gcc -DHAVE_CONFIG_H -I. -I../.. -I. -I.. -I../JudyCommon/    -DJUDYL   -fPIC -DJU_64BIT -MT JudyLMemUsed.lo -MD -MP -MF .deps/JudyLMemUsed.Tpo -c -o JudyLMemUsed.lo JudyLMemUsed.c
  1205. mv -f .deps/JudyLIns.Tpo .deps/JudyLIns.Plo
  1206. /bin/sh ../../libtool  --tag=CC   --mode=compile gcc -DHAVE_CONFIG_H -I. -I../.. -I. -I.. -I../JudyCommon/    -DJUDYL   -DJUDYNEXT -fPIC -DJU_64BIT -MT libnext_la-JudyLNext.lo -MD -MP -MF .deps/libnext_la-JudyLNext.Tpo -c -o libnext_la-JudyLNext.lo `test -f 'JudyLNext.c' || echo './'`JudyLNext.c
  1207. mv -f .deps/JudyLMemActive.Tpo .deps/JudyLMemActive.Plo
  1208. /bin/sh ../../libtool  --tag=CC   --mode=compile gcc -DHAVE_CONFIG_H -I. -I../.. -I. -I.. -I../JudyCommon/    -DJUDYL   -DJUDYNEXT -fPIC -DJU_64BIT -MT libnext_la-JudyLNextEmpty.lo -MD -MP -MF .deps/libnext_la-JudyLNextEmpty.Tpo -c -o libnext_la-JudyLNextEmpty.lo `test -f 'JudyLNextEmpty.c' || echo './'`JudyLNextEmpty.c
  1209. mv -f .deps/JudyLMallocIF.Tpo .deps/JudyLMallocIF.Plo
  1210. /bin/sh ../../libtool  --tag=CC   --mode=compile gcc -DHAVE_CONFIG_H -I. -I../.. -I. -I.. -I../JudyCommon/    -DJUDYL   -DJUDYPREV -fPIC -DJU_64BIT -MT libprev_la-JudyLPrev.lo -MD -MP -MF .deps/libprev_la-JudyLPrev.Tpo -c -o libprev_la-JudyLPrev.lo `test -f 'JudyLPrev.c' || echo './'`JudyLPrev.c
  1211. libtool: compile:  gcc -DHAVE_CONFIG_H -I. -I../.. -I. -I.. -I../JudyCommon/ -DJUDYL -fPIC -DJU_64BIT -MT JudyLMemUsed.lo -MD -MP -MF .deps/JudyLMemUsed.Tpo -c JudyLMemUsed.c  -fno-common -DPIC -o .libs/JudyLMemUsed.o
  1212. libtool: compile:  gcc -DHAVE_CONFIG_H -I. -I../.. -I. -I.. -I../JudyCommon/ -DJUDYL -DJUDYNEXT -fPIC -DJU_64BIT -MT libnext_la-JudyLNext.lo -MD -MP -MF .deps/libnext_la-JudyLNext.Tpo -c JudyLNext.c  -fno-common -DPIC -o .libs/libnext_la-JudyLNext.o
  1213. libtool: compile:  gcc -DHAVE_CONFIG_H -I. -I../.. -I. -I.. -I../JudyCommon/ -DJUDYL -DJUDYNEXT -fPIC -DJU_64BIT -MT libnext_la-JudyLNextEmpty.lo -MD -MP -MF .deps/libnext_la-JudyLNextEmpty.Tpo -c JudyLNextEmpty.c  -fno-common -DPIC -o .libs/libnext_la-JudyLNextEmpty.o
  1214. libtool: compile:  gcc -DHAVE_CONFIG_H -I. -I../.. -I. -I.. -I../JudyCommon/ -DJUDYL -DJUDYPREV -fPIC -DJU_64BIT -MT libprev_la-JudyLPrev.lo -MD -MP -MF .deps/libprev_la-JudyLPrev.Tpo -c JudyLPrev.c  -fno-common -DPIC -o .libs/libprev_la-JudyLPrev.o
  1215. libtool: compile:  gcc -DHAVE_CONFIG_H -I. -I../.. -I. -I.. -I../JudyCommon/ -DJUDYL -fPIC -DJU_64BIT -MT JudyLMemUsed.lo -MD -MP -MF .deps/JudyLMemUsed.Tpo -c JudyLMemUsed.c -o JudyLMemUsed.o >/dev/null 2>&1
  1216. libtool: compile:  gcc -DHAVE_CONFIG_H -I. -I../.. -I. -I.. -I../JudyCommon/ -DJUDYL -DJUDYNEXT -fPIC -DJU_64BIT -MT libnext_la-JudyLNext.lo -MD -MP -MF .deps/libnext_la-JudyLNext.Tpo -c JudyLNext.c -o libnext_la-JudyLNext.o >/dev/null 2>&1
  1217. mv -f .deps/JudyLMemUsed.Tpo .deps/JudyLMemUsed.Plo
  1218. /bin/sh ../../libtool  --tag=CC   --mode=compile gcc -DHAVE_CONFIG_H -I. -I../.. -I. -I.. -I../JudyCommon/    -DJUDYL   -DJUDYPREV -fPIC -DJU_64BIT -MT libprev_la-JudyLPrevEmpty.lo -MD -MP -MF .deps/libprev_la-JudyLPrevEmpty.Tpo -c -o libprev_la-JudyLPrevEmpty.lo `test -f 'JudyLPrevEmpty.c' || echo './'`JudyLPrevEmpty.c
  1219. libtool: compile:  gcc -DHAVE_CONFIG_H -I. -I../.. -I. -I.. -I../JudyCommon/ -DJUDYL -DJUDYNEXT -fPIC -DJU_64BIT -MT libnext_la-JudyLNextEmpty.lo -MD -MP -MF .deps/libnext_la-JudyLNextEmpty.Tpo -c JudyLNextEmpty.c -o libnext_la-JudyLNextEmpty.o >/dev/null 2>&1
  1220. libtool: compile:  gcc -DHAVE_CONFIG_H -I. -I../.. -I. -I.. -I../JudyCommon/ -DJUDYL -DJUDYPREV -fPIC -DJU_64BIT -MT libprev_la-JudyLPrev.lo -MD -MP -MF .deps/libprev_la-JudyLPrev.Tpo -c JudyLPrev.c -o libprev_la-JudyLPrev.o >/dev/null 2>&1
  1221. libtool: compile:  gcc -DHAVE_CONFIG_H -I. -I../.. -I. -I.. -I../JudyCommon/ -DJUDYL -DJUDYPREV -fPIC -DJU_64BIT -MT libprev_la-JudyLPrevEmpty.lo -MD -MP -MF .deps/libprev_la-JudyLPrevEmpty.Tpo -c JudyLPrevEmpty.c  -fno-common -DPIC -o .libs/libprev_la-JudyLPrevEmpty.o
  1222. mv -f .deps/libnext_la-JudyLNextEmpty.Tpo .deps/libnext_la-JudyLNextEmpty.Plo
  1223. /bin/sh ../../libtool  --tag=CC   --mode=compile gcc -DHAVE_CONFIG_H -I. -I../.. -I. -I.. -I../JudyCommon/    -DJUDYL   -DNOSMARTJBB -DNOSMARTJBU -DNOSMARTJLB -fPIC -DJU_64BIT -MT libcount_la-JudyLByCount.lo -MD -MP -MF .deps/libcount_la-JudyLByCount.Tpo -c -o libcount_la-JudyLByCount.lo `test -f 'JudyLByCount.c' || echo './'`JudyLByCount.c
  1224. mv -f .deps/libnext_la-JudyLNext.Tpo .deps/libnext_la-JudyLNext.Plo
  1225. /bin/sh ../../libtool  --tag=CC   --mode=compile gcc -DHAVE_CONFIG_H -I. -I../.. -I. -I.. -I../JudyCommon/    -DJUDYL   -DJUDYGETINLINE -fPIC -DJU_64BIT -MT libinline_la-j__udyLGet.lo -MD -MP -MF .deps/libinline_la-j__udyLGet.Tpo -c -o libinline_la-j__udyLGet.lo `test -f 'j__udyLGet.c' || echo './'`j__udyLGet.c
  1226. mv -f .deps/libprev_la-JudyLPrev.Tpo .deps/libprev_la-JudyLPrev.Plo
  1227. /bin/sh ../../libtool  --tag=CC   --mode=compile gcc -DHAVE_CONFIG_H -I. -I../.. -I. -I.. -I../JudyCommon/    -DJUDYL   -fPIC -DJU_64BIT -MT JudyLTables.lo -MD -MP -MF .deps/JudyLTables.Tpo -c -o JudyLTables.lo JudyLTables.c
  1228. libtool: compile:  gcc -DHAVE_CONFIG_H -I. -I../.. -I. -I.. -I../JudyCommon/ -DJUDYL -DJUDYPREV -fPIC -DJU_64BIT -MT libprev_la-JudyLPrevEmpty.lo -MD -MP -MF .deps/libprev_la-JudyLPrevEmpty.Tpo -c JudyLPrevEmpty.c -o libprev_la-JudyLPrevEmpty.o >/dev/null 2>&1
  1229. libtool: compile:  gcc -DHAVE_CONFIG_H -I. -I../.. -I. -I.. -I../JudyCommon/ -DJUDYL -DJUDYGETINLINE -fPIC -DJU_64BIT -MT libinline_la-j__udyLGet.lo -MD -MP -MF .deps/libinline_la-j__udyLGet.Tpo -c j__udyLGet.c  -fno-common -DPIC -o .libs/libinline_la-j__udyLGet.o
  1230. libtool: compile:  gcc -DHAVE_CONFIG_H -I. -I../.. -I. -I.. -I../JudyCommon/ -DJUDYL -DNOSMARTJBB -DNOSMARTJBU -DNOSMARTJLB -fPIC -DJU_64BIT -MT libcount_la-JudyLByCount.lo -MD -MP -MF .deps/libcount_la-JudyLByCount.Tpo -c JudyLByCount.c  -fno-common -DPIC -o .libs/libcount_la-JudyLByCount.o
  1231. libtool: compile:  gcc -DHAVE_CONFIG_H -I. -I../.. -I. -I.. -I../JudyCommon/ -DJUDYL -fPIC -DJU_64BIT -MT JudyLTables.lo -MD -MP -MF .deps/JudyLTables.Tpo -c JudyLTables.c  -fno-common -DPIC -o .libs/JudyLTables.o
  1232. libtool: compile:  gcc -DHAVE_CONFIG_H -I. -I../.. -I. -I.. -I../JudyCommon/ -DJUDYL -DJUDYGETINLINE -fPIC -DJU_64BIT -MT libinline_la-j__udyLGet.lo -MD -MP -MF .deps/libinline_la-j__udyLGet.Tpo -c j__udyLGet.c -o libinline_la-j__udyLGet.o >/dev/null 2>&1
  1233. mv -f .deps/libprev_la-JudyLPrevEmpty.Tpo .deps/libprev_la-JudyLPrevEmpty.Plo
  1234. libtool: compile:  gcc -DHAVE_CONFIG_H -I. -I../.. -I. -I.. -I../JudyCommon/ -DJUDYL -DNOSMARTJBB -DNOSMARTJBU -DNOSMARTJLB -fPIC -DJU_64BIT -MT libcount_la-JudyLByCount.lo -MD -MP -MF .deps/libcount_la-JudyLByCount.Tpo -c JudyLByCount.c -o libcount_la-JudyLByCount.o >/dev/null 2>&1
  1235. /bin/sh ../../libtool  --tag=CC   --mode=link gcc -DJUDYL   -DJUDYNEXT -fPIC -DJU_64BIT   -o libnext.la  libnext_la-JudyLNext.lo libnext_la-JudyLNextEmpty.lo  
  1236. libtool: compile:  gcc -DHAVE_CONFIG_H -I. -I../.. -I. -I.. -I../JudyCommon/ -DJUDYL -fPIC -DJU_64BIT -MT JudyLTables.lo -MD -MP -MF .deps/JudyLTables.Tpo -c JudyLTables.c -o JudyLTables.o >/dev/null 2>&1
  1237. mv -f .deps/libinline_la-j__udyLGet.Tpo .deps/libinline_la-j__udyLGet.Plo
  1238. /bin/sh ../../libtool  --tag=CC   --mode=link gcc -DJUDYL   -DJUDYPREV -fPIC -DJU_64BIT   -o libprev.la  libprev_la-JudyLPrev.lo libprev_la-JudyLPrevEmpty.lo  
  1239. mv -f .deps/libcount_la-JudyLByCount.Tpo .deps/libcount_la-JudyLByCount.Plo
  1240. /bin/sh ../../libtool  --tag=CC   --mode=link gcc -DJUDYL   -DJUDYGETINLINE -fPIC -DJU_64BIT   -o libinline.la  libinline_la-j__udyLGet.lo  
  1241. mv -f .deps/JudyLTables.Tpo .deps/JudyLTables.Plo
  1242. /bin/sh ../../libtool  --tag=CC   --mode=link gcc -DJUDYL   -fPIC -DJU_64BIT   -o libJudyL.la  JudyLCascade.lo JudyLTables.lo JudyLCount.lo JudyLCreateBranch.lo JudyLDecascade.lo JudyLDel.lo JudyLFirst.lo JudyLFreeArray.lo JudyLGet.lo JudyLInsArray.lo JudyLIns.lo JudyLInsertBranch.lo JudyLMallocIF.lo JudyLMemActive.lo JudyLMemUsed.lo  
  1243. libtool: link: ar cru .libs/libnext.a .libs/libnext_la-JudyLNext.o .libs/libnext_la-JudyLNextEmpty.o
  1244. libtool: link: ranlib .libs/libnext.a
  1245. libtool: link: ( cd ".libs" && rm -f "libnext.la" && ln -s "../libnext.la" "libnext.la" )
  1246. /bin/sh ../../libtool  --tag=CC   --mode=link gcc -DJUDYL   -DNOSMARTJBB -DNOSMARTJBU -DNOSMARTJLB -fPIC -DJU_64BIT   -o libcount.la  libcount_la-JudyLByCount.lo  
  1247. libtool: link: ar cru .libs/libprev.a .libs/libprev_la-JudyLPrev.o .libs/libprev_la-JudyLPrevEmpty.o
  1248. libtool: link: ar cru .libs/libinline.a .libs/libinline_la-j__udyLGet.o
  1249. libtool: link: ranlib .libs/libprev.a
  1250. libtool: link: ranlib .libs/libinline.a
  1251. libtool: link: ( cd ".libs" && rm -f "libprev.la" && ln -s "../libprev.la" "libprev.la" )
  1252. libtool: link: ( cd ".libs" && rm -f "libinline.la" && ln -s "../libinline.la" "libinline.la" )
  1253. libtool: link: ar cru .libs/libJudyL.a .libs/JudyLCascade.o .libs/JudyLTables.o .libs/JudyLCount.o .libs/JudyLCreateBranch.o .libs/JudyLDecascade.o .libs/JudyLDel.o .libs/JudyLFirst.o .libs/JudyLFreeArray.o .libs/JudyLGet.o .libs/JudyLInsArray.o .libs/JudyLIns.o .libs/JudyLInsertBranch.o .libs/JudyLMallocIF.o .libs/JudyLMemActive.o .libs/JudyLMemUsed.o
  1254. libtool: link: ranlib .libs/libJudyL.a
  1255. libtool: link: ar cru .libs/libcount.a .libs/libcount_la-JudyLByCount.o
  1256. libtool: link: ranlib .libs/libcount.a
  1257. libtool: link: ( cd ".libs" && rm -f "libJudyL.la" && ln -s "../libJudyL.la" "libJudyL.la" )
  1258. libtool: link: ( cd ".libs" && rm -f "libcount.la" && ln -s "../libcount.la" "libcount.la" )
  1259. Making all in Judy1
  1260. cp -f ../JudyCommon/JudyGet.c               Judy1Test.c
  1261. cp -f ../JudyCommon/JudyTables.c            Judy1TablesGen.c
  1262. cp -f ../JudyCommon/JudyIns.c               Judy1Set.c
  1263. cp -f ../JudyCommon/JudyInsArray.c          Judy1SetArray.c
  1264. cp -f ../JudyCommon/JudyDel.c               Judy1Unset.c
  1265. cp -f ../JudyCommon/JudyCascade.c           Judy1Cascade.c
  1266. cp -f ../JudyCommon/JudyCount.c             Judy1Count.c
  1267. cp -f ../JudyCommon/JudyCreateBranch.c      Judy1CreateBranch.c
  1268. cp -f ../JudyCommon/JudyDecascade.c         Judy1Decascade.c
  1269. cp -f ../JudyCommon/JudyFirst.c             Judy1First.c
  1270. cp -f ../JudyCommon/JudyFreeArray.c         Judy1FreeArray.c
  1271. cp -f ../JudyCommon/JudyInsertBranch.c      Judy1InsertBranch.c
  1272. cp -f ../JudyCommon/JudyMallocIF.c          Judy1MallocIF.c
  1273. cp -f ../JudyCommon/JudyMemActive.c         Judy1MemActive.c
  1274. cp -f ../JudyCommon/JudyMemUsed.c           Judy1MemUsed.c
  1275. cp -f ../JudyCommon/JudyPrevNext.c          Judy1Next.c
  1276. cp -f ../JudyCommon/JudyPrevNextEmpty.c     Judy1NextEmpty.c
  1277. cp -f ../JudyCommon/JudyPrevNext.c          Judy1Prev.c
  1278. cp -f ../JudyCommon/JudyPrevNextEmpty.c     Judy1PrevEmpty.c
  1279. cp -f ../JudyCommon/JudyByCount.c           Judy1ByCount.c  
  1280. cp -f ../JudyCommon/JudyGet.c               j__udy1Test.c
  1281. /bin/sh ../../libtool  --tag=CC   --mode=compile gcc -DHAVE_CONFIG_H -I. -I../.. -I. -I.. -I../JudyCommon/    -DJUDY1   -fPIC -DJU_64BIT -MT Judy1Test.lo -MD -MP -MF .deps/Judy1Test.Tpo -c -o Judy1Test.lo Judy1Test.c
  1282. gcc -I. -I.. -I../JudyCommon/  -DJUDY1   -fPIC -DJU_64BIT -o Judy1TablesGen Judy1TablesGen.c; ./Judy1TablesGen
  1283. /bin/sh ../../libtool  --tag=CC   --mode=compile gcc -DHAVE_CONFIG_H -I. -I../.. -I. -I.. -I../JudyCommon/    -DJUDY1   -fPIC -DJU_64BIT -MT Judy1Set.lo -MD -MP -MF .deps/Judy1Set.Tpo -c -o Judy1Set.lo Judy1Set.c
  1284. /bin/sh ../../libtool  --tag=CC   --mode=compile gcc -DHAVE_CONFIG_H -I. -I../.. -I. -I.. -I../JudyCommon/    -DJUDY1   -fPIC -DJU_64BIT -MT Judy1SetArray.lo -MD -MP -MF .deps/Judy1SetArray.Tpo -c -o Judy1SetArray.lo Judy1SetArray.c
  1285. libtool: compile:  gcc -DHAVE_CONFIG_H -I. -I../.. -I. -I.. -I../JudyCommon/ -DJUDY1 -fPIC -DJU_64BIT -MT Judy1Test.lo -MD -MP -MF .deps/Judy1Test.Tpo -c Judy1Test.c  -fno-common -DPIC -o .libs/Judy1Test.o
  1286. libtool: compile:  gcc -DHAVE_CONFIG_H -I. -I../.. -I. -I.. -I../JudyCommon/ -DJUDY1 -fPIC -DJU_64BIT -MT Judy1Set.lo -MD -MP -MF .deps/Judy1Set.Tpo -c Judy1Set.c  -fno-common -DPIC -o .libs/Judy1Set.o
  1287. libtool: compile:  gcc -DHAVE_CONFIG_H -I. -I../.. -I. -I.. -I../JudyCommon/ -DJUDY1 -fPIC -DJU_64BIT -MT Judy1SetArray.lo -MD -MP -MF .deps/Judy1SetArray.Tpo -c Judy1SetArray.c  -fno-common -DPIC -o .libs/Judy1SetArray.o
  1288. libtool: compile:  gcc -DHAVE_CONFIG_H -I. -I../.. -I. -I.. -I../JudyCommon/ -DJUDY1 -fPIC -DJU_64BIT -MT Judy1SetArray.lo -MD -MP -MF .deps/Judy1SetArray.Tpo -c Judy1SetArray.c -o Judy1SetArray.o >/dev/null 2>&1
  1289. libtool: compile:  gcc -DHAVE_CONFIG_H -I. -I../.. -I. -I.. -I../JudyCommon/ -DJUDY1 -fPIC -DJU_64BIT -MT Judy1Test.lo -MD -MP -MF .deps/Judy1Test.Tpo -c Judy1Test.c -o Judy1Test.o >/dev/null 2>&1
  1290. /bin/sh ../../libtool  --tag=CC   --mode=compile gcc -DHAVE_CONFIG_H -I. -I../.. -I. -I.. -I../JudyCommon/    -DJUDY1   -fPIC -DJU_64BIT -MT Judy1Unset.lo -MD -MP -MF .deps/Judy1Unset.Tpo -c -o Judy1Unset.lo Judy1Unset.c
  1291. libtool: compile:  gcc -DHAVE_CONFIG_H -I. -I../.. -I. -I.. -I../JudyCommon/ -DJUDY1 -fPIC -DJU_64BIT -MT Judy1Set.lo -MD -MP -MF .deps/Judy1Set.Tpo -c Judy1Set.c -o Judy1Set.o >/dev/null 2>&1
  1292. mv -f .deps/Judy1Test.Tpo .deps/Judy1Test.Plo
  1293. /bin/sh ../../libtool  --tag=CC   --mode=compile gcc -DHAVE_CONFIG_H -I. -I../.. -I. -I.. -I../JudyCommon/    -DJUDY1   -fPIC -DJU_64BIT -MT Judy1Cascade.lo -MD -MP -MF .deps/Judy1Cascade.Tpo -c -o Judy1Cascade.lo Judy1Cascade.c
  1294. mv -f .deps/Judy1SetArray.Tpo .deps/Judy1SetArray.Plo
  1295. /bin/sh ../../libtool  --tag=CC   --mode=compile gcc -DHAVE_CONFIG_H -I. -I../.. -I. -I.. -I../JudyCommon/    -DJUDY1   -fPIC -DJU_64BIT -MT Judy1Count.lo -MD -MP -MF .deps/Judy1Count.Tpo -c -o Judy1Count.lo Judy1Count.c
  1296. libtool: compile:  gcc -DHAVE_CONFIG_H -I. -I../.. -I. -I.. -I../JudyCommon/ -DJUDY1 -fPIC -DJU_64BIT -MT Judy1Unset.lo -MD -MP -MF .deps/Judy1Unset.Tpo -c Judy1Unset.c  -fno-common -DPIC -o .libs/Judy1Unset.o
  1297. libtool: compile:  gcc -DHAVE_CONFIG_H -I. -I../.. -I. -I.. -I../JudyCommon/ -DJUDY1 -fPIC -DJU_64BIT -MT Judy1Cascade.lo -MD -MP -MF .deps/Judy1Cascade.Tpo -c Judy1Cascade.c  -fno-common -DPIC -o .libs/Judy1Cascade.o
  1298. libtool: compile:  gcc -DHAVE_CONFIG_H -I. -I../.. -I. -I.. -I../JudyCommon/ -DJUDY1 -fPIC -DJU_64BIT -MT Judy1Count.lo -MD -MP -MF .deps/Judy1Count.Tpo -c Judy1Count.c  -fno-common -DPIC -o .libs/Judy1Count.o
  1299. mv -f .deps/Judy1Set.Tpo .deps/Judy1Set.Plo
  1300. /bin/sh ../../libtool  --tag=CC   --mode=compile gcc -DHAVE_CONFIG_H -I. -I../.. -I. -I.. -I../JudyCommon/    -DJUDY1   -fPIC -DJU_64BIT -MT Judy1CreateBranch.lo -MD -MP -MF .deps/Judy1CreateBranch.Tpo -c -o Judy1CreateBranch.lo Judy1CreateBranch.c
  1301. libtool: compile:  gcc -DHAVE_CONFIG_H -I. -I../.. -I. -I.. -I../JudyCommon/ -DJUDY1 -fPIC -DJU_64BIT -MT Judy1Unset.lo -MD -MP -MF .deps/Judy1Unset.Tpo -c Judy1Unset.c -o Judy1Unset.o >/dev/null 2>&1
  1302. libtool: compile:  gcc -DHAVE_CONFIG_H -I. -I../.. -I. -I.. -I../JudyCommon/ -DJUDY1 -fPIC -DJU_64BIT -MT Judy1Count.lo -MD -MP -MF .deps/Judy1Count.Tpo -c Judy1Count.c -o Judy1Count.o >/dev/null 2>&1
  1303. libtool: compile:  gcc -DHAVE_CONFIG_H -I. -I../.. -I. -I.. -I../JudyCommon/ -DJUDY1 -fPIC -DJU_64BIT -MT Judy1Cascade.lo -MD -MP -MF .deps/Judy1Cascade.Tpo -c Judy1Cascade.c -o Judy1Cascade.o >/dev/null 2>&1
  1304. libtool: compile:  gcc -DHAVE_CONFIG_H -I. -I../.. -I. -I.. -I../JudyCommon/ -DJUDY1 -fPIC -DJU_64BIT -MT Judy1CreateBranch.lo -MD -MP -MF .deps/Judy1CreateBranch.Tpo -c Judy1CreateBranch.c  -fno-common -DPIC -o .libs/Judy1CreateBranch.o
  1305. mv -f .deps/Judy1Count.Tpo .deps/Judy1Count.Plo
  1306. libtool: compile:  gcc -DHAVE_CONFIG_H -I. -I../.. -I. -I.. -I../JudyCommon/ -DJUDY1 -fPIC -DJU_64BIT -MT Judy1CreateBranch.lo -MD -MP -MF .deps/Judy1CreateBranch.Tpo -c Judy1CreateBranch.c -o Judy1CreateBranch.o >/dev/null 2>&1
  1307. /bin/sh ../../libtool  --tag=CC   --mode=compile gcc -DHAVE_CONFIG_H -I. -I../.. -I. -I.. -I../JudyCommon/    -DJUDY1   -fPIC -DJU_64BIT -MT Judy1Decascade.lo -MD -MP -MF .deps/Judy1Decascade.Tpo -c -o Judy1Decascade.lo Judy1Decascade.c
  1308. mv -f .deps/Judy1Cascade.Tpo .deps/Judy1Cascade.Plo
  1309. /bin/sh ../../libtool  --tag=CC   --mode=compile gcc -DHAVE_CONFIG_H -I. -I../.. -I. -I.. -I../JudyCommon/    -DJUDY1   -fPIC -DJU_64BIT -MT Judy1First.lo -MD -MP -MF .deps/Judy1First.Tpo -c -o Judy1First.lo Judy1First.c
  1310. mv -f .deps/Judy1Unset.Tpo .deps/Judy1Unset.Plo
  1311. /bin/sh ../../libtool  --tag=CC   --mode=compile gcc -DHAVE_CONFIG_H -I. -I../.. -I. -I.. -I../JudyCommon/    -DJUDY1   -fPIC -DJU_64BIT -MT Judy1FreeArray.lo -MD -MP -MF .deps/Judy1FreeArray.Tpo -c -o Judy1FreeArray.lo Judy1FreeArray.c
  1312. mv -f .deps/Judy1CreateBranch.Tpo .deps/Judy1CreateBranch.Plo
  1313. /bin/sh ../../libtool  --tag=CC   --mode=compile gcc -DHAVE_CONFIG_H -I. -I../.. -I. -I.. -I../JudyCommon/    -DJUDY1   -fPIC -DJU_64BIT -MT Judy1InsertBranch.lo -MD -MP -MF .deps/Judy1InsertBranch.Tpo -c -o Judy1InsertBranch.lo Judy1InsertBranch.c
  1314. libtool: compile:  gcc -DHAVE_CONFIG_H -I. -I../.. -I. -I.. -I../JudyCommon/ -DJUDY1 -fPIC -DJU_64BIT -MT Judy1Decascade.lo -MD -MP -MF .deps/Judy1Decascade.Tpo -c Judy1Decascade.c  -fno-common -DPIC -o .libs/Judy1Decascade.o
  1315. libtool: compile:  gcc -DHAVE_CONFIG_H -I. -I../.. -I. -I.. -I../JudyCommon/ -DJUDY1 -fPIC -DJU_64BIT -MT Judy1First.lo -MD -MP -MF .deps/Judy1First.Tpo -c Judy1First.c  -fno-common -DPIC -o .libs/Judy1First.o
  1316. libtool: compile:  gcc -DHAVE_CONFIG_H -I. -I../.. -I. -I.. -I../JudyCommon/ -DJUDY1 -fPIC -DJU_64BIT -MT Judy1FreeArray.lo -MD -MP -MF .deps/Judy1FreeArray.Tpo -c Judy1FreeArray.c  -fno-common -DPIC -o .libs/Judy1FreeArray.o
  1317. libtool: compile:  gcc -DHAVE_CONFIG_H -I. -I../.. -I. -I.. -I../JudyCommon/ -DJUDY1 -fPIC -DJU_64BIT -MT Judy1InsertBranch.lo -MD -MP -MF .deps/Judy1InsertBranch.Tpo -c Judy1InsertBranch.c  -fno-common -DPIC -o .libs/Judy1InsertBranch.o
  1318. libtool: compile:  gcc -DHAVE_CONFIG_H -I. -I../.. -I. -I.. -I../JudyCommon/ -DJUDY1 -fPIC -DJU_64BIT -MT Judy1Decascade.lo -MD -MP -MF .deps/Judy1Decascade.Tpo -c Judy1Decascade.c -o Judy1Decascade.o >/dev/null 2>&1
  1319. libtool: compile:  gcc -DHAVE_CONFIG_H -I. -I../.. -I. -I.. -I../JudyCommon/ -DJUDY1 -fPIC -DJU_64BIT -MT Judy1First.lo -MD -MP -MF .deps/Judy1First.Tpo -c Judy1First.c -o Judy1First.o >/dev/null 2>&1
  1320. libtool: compile:  gcc -DHAVE_CONFIG_H -I. -I../.. -I. -I.. -I../JudyCommon/ -DJUDY1 -fPIC -DJU_64BIT -MT Judy1FreeArray.lo -MD -MP -MF .deps/Judy1FreeArray.Tpo -c Judy1FreeArray.c -o Judy1FreeArray.o >/dev/null 2>&1
  1321. libtool: compile:  gcc -DHAVE_CONFIG_H -I. -I../.. -I. -I.. -I../JudyCommon/ -DJUDY1 -fPIC -DJU_64BIT -MT Judy1InsertBranch.lo -MD -MP -MF .deps/Judy1InsertBranch.Tpo -c Judy1InsertBranch.c -o Judy1InsertBranch.o >/dev/null 2>&1
  1322. mv -f .deps/Judy1First.Tpo .deps/Judy1First.Plo
  1323. /bin/sh ../../libtool  --tag=CC   --mode=compile gcc -DHAVE_CONFIG_H -I. -I../.. -I. -I.. -I../JudyCommon/    -DJUDY1   -fPIC -DJU_64BIT -MT Judy1MallocIF.lo -MD -MP -MF .deps/Judy1MallocIF.Tpo -c -o Judy1MallocIF.lo Judy1MallocIF.c
  1324. mv -f .deps/Judy1Decascade.Tpo .deps/Judy1Decascade.Plo
  1325. /bin/sh ../../libtool  --tag=CC   --mode=compile gcc -DHAVE_CONFIG_H -I. -I../.. -I. -I.. -I../JudyCommon/    -DJUDY1   -fPIC -DJU_64BIT -MT Judy1MemActive.lo -MD -MP -MF .deps/Judy1MemActive.Tpo -c -o Judy1MemActive.lo Judy1MemActive.c
  1326. mv -f .deps/Judy1InsertBranch.Tpo .deps/Judy1InsertBranch.Plo
  1327. mv -f .deps/Judy1FreeArray.Tpo .deps/Judy1FreeArray.Plo
  1328. /bin/sh ../../libtool  --tag=CC   --mode=compile gcc -DHAVE_CONFIG_H -I. -I../.. -I. -I.. -I../JudyCommon/    -DJUDY1   -fPIC -DJU_64BIT -MT Judy1MemUsed.lo -MD -MP -MF .deps/Judy1MemUsed.Tpo -c -o Judy1MemUsed.lo Judy1MemUsed.c
  1329. /bin/sh ../../libtool  --tag=CC   --mode=compile gcc -DHAVE_CONFIG_H -I. -I../.. -I. -I.. -I../JudyCommon/    -DJUDY1   -DJUDYNEXT -fPIC -DJU_64BIT -MT libnext_la-Judy1Next.lo -MD -MP -MF .deps/libnext_la-Judy1Next.Tpo -c -o libnext_la-Judy1Next.lo `test -f 'Judy1Next.c' || echo './'`Judy1Next.c
  1330. libtool: compile:  gcc -DHAVE_CONFIG_H -I. -I../.. -I. -I.. -I../JudyCommon/ -DJUDY1 -fPIC -DJU_64BIT -MT Judy1MallocIF.lo -MD -MP -MF .deps/Judy1MallocIF.Tpo -c Judy1MallocIF.c  -fno-common -DPIC -o .libs/Judy1MallocIF.o
  1331. libtool: compile:  gcc -DHAVE_CONFIG_H -I. -I../.. -I. -I.. -I../JudyCommon/ -DJUDY1 -fPIC -DJU_64BIT -MT Judy1MemActive.lo -MD -MP -MF .deps/Judy1MemActive.Tpo -c Judy1MemActive.c  -fno-common -DPIC -o .libs/Judy1MemActive.o
  1332. libtool: compile:  gcc -DHAVE_CONFIG_H -I. -I../.. -I. -I.. -I../JudyCommon/ -DJUDY1 -fPIC -DJU_64BIT -MT Judy1MemUsed.lo -MD -MP -MF .deps/Judy1MemUsed.Tpo -c Judy1MemUsed.c  -fno-common -DPIC -o .libs/Judy1MemUsed.o
  1333. libtool: compile:  gcc -DHAVE_CONFIG_H -I. -I../.. -I. -I.. -I../JudyCommon/ -DJUDY1 -DJUDYNEXT -fPIC -DJU_64BIT -MT libnext_la-Judy1Next.lo -MD -MP -MF .deps/libnext_la-Judy1Next.Tpo -c Judy1Next.c  -fno-common -DPIC -o .libs/libnext_la-Judy1Next.o
  1334. libtool: compile:  gcc -DHAVE_CONFIG_H -I. -I../.. -I. -I.. -I../JudyCommon/ -DJUDY1 -fPIC -DJU_64BIT -MT Judy1MemActive.lo -MD -MP -MF .deps/Judy1MemActive.Tpo -c Judy1MemActive.c -o Judy1MemActive.o >/dev/null 2>&1
  1335. libtool: compile:  gcc -DHAVE_CONFIG_H -I. -I../.. -I. -I.. -I../JudyCommon/ -DJUDY1 -fPIC -DJU_64BIT -MT Judy1MallocIF.lo -MD -MP -MF .deps/Judy1MallocIF.Tpo -c Judy1MallocIF.c -o Judy1MallocIF.o >/dev/null 2>&1
  1336. libtool: compile:  gcc -DHAVE_CONFIG_H -I. -I../.. -I. -I.. -I../JudyCommon/ -DJUDY1 -fPIC -DJU_64BIT -MT Judy1MemUsed.lo -MD -MP -MF .deps/Judy1MemUsed.Tpo -c Judy1MemUsed.c -o Judy1MemUsed.o >/dev/null 2>&1
  1337. mv -f .deps/Judy1MemActive.Tpo .deps/Judy1MemActive.Plo
  1338. /bin/sh ../../libtool  --tag=CC   --mode=compile gcc -DHAVE_CONFIG_H -I. -I../.. -I. -I.. -I../JudyCommon/    -DJUDY1   -DJUDYNEXT -fPIC -DJU_64BIT -MT libnext_la-Judy1NextEmpty.lo -MD -MP -MF .deps/libnext_la-Judy1NextEmpty.Tpo -c -o libnext_la-Judy1NextEmpty.lo `test -f 'Judy1NextEmpty.c' || echo './'`Judy1NextEmpty.c
  1339. mv -f .deps/Judy1MallocIF.Tpo .deps/Judy1MallocIF.Plo
  1340. /bin/sh ../../libtool  --tag=CC   --mode=compile gcc -DHAVE_CONFIG_H -I. -I../.. -I. -I.. -I../JudyCommon/    -DJUDY1   -DJUDYPREV -fPIC -DJU_64BIT -MT libprev_la-Judy1Prev.lo -MD -MP -MF .deps/libprev_la-Judy1Prev.Tpo -c -o libprev_la-Judy1Prev.lo `test -f 'Judy1Prev.c' || echo './'`Judy1Prev.c
  1341. mv -f .deps/Judy1MemUsed.Tpo .deps/Judy1MemUsed.Plo
  1342. /bin/sh ../../libtool  --tag=CC   --mode=compile gcc -DHAVE_CONFIG_H -I. -I../.. -I. -I.. -I../JudyCommon/    -DJUDY1   -DJUDYPREV -fPIC -DJU_64BIT -MT libprev_la-Judy1PrevEmpty.lo -MD -MP -MF .deps/libprev_la-Judy1PrevEmpty.Tpo -c -o libprev_la-Judy1PrevEmpty.lo `test -f 'Judy1PrevEmpty.c' || echo './'`Judy1PrevEmpty.c
  1343. libtool: compile:  gcc -DHAVE_CONFIG_H -I. -I../.. -I. -I.. -I../JudyCommon/ -DJUDY1 -DJUDYNEXT -fPIC -DJU_64BIT -MT libnext_la-Judy1Next.lo -MD -MP -MF .deps/libnext_la-Judy1Next.Tpo -c Judy1Next.c -o libnext_la-Judy1Next.o >/dev/null 2>&1
  1344. libtool: compile:  gcc -DHAVE_CONFIG_H -I. -I../.. -I. -I.. -I../JudyCommon/ -DJUDY1 -DJUDYNEXT -fPIC -DJU_64BIT -MT libnext_la-Judy1NextEmpty.lo -MD -MP -MF .deps/libnext_la-Judy1NextEmpty.Tpo -c Judy1NextEmpty.c  -fno-common -DPIC -o .libs/libnext_la-Judy1NextEmpty.o
  1345. libtool: compile:  gcc -DHAVE_CONFIG_H -I. -I../.. -I. -I.. -I../JudyCommon/ -DJUDY1 -DJUDYPREV -fPIC -DJU_64BIT -MT libprev_la-Judy1Prev.lo -MD -MP -MF .deps/libprev_la-Judy1Prev.Tpo -c Judy1Prev.c  -fno-common -DPIC -o .libs/libprev_la-Judy1Prev.o
  1346. libtool: compile:  gcc -DHAVE_CONFIG_H -I. -I../.. -I. -I.. -I../JudyCommon/ -DJUDY1 -DJUDYPREV -fPIC -DJU_64BIT -MT libprev_la-Judy1PrevEmpty.lo -MD -MP -MF .deps/libprev_la-Judy1PrevEmpty.Tpo -c Judy1PrevEmpty.c  -fno-common -DPIC -o .libs/libprev_la-Judy1PrevEmpty.o
  1347. mv -f .deps/libnext_la-Judy1Next.Tpo .deps/libnext_la-Judy1Next.Plo
  1348. /bin/sh ../../libtool  --tag=CC   --mode=compile gcc -DHAVE_CONFIG_H -I. -I../.. -I. -I.. -I../JudyCommon/    -DJUDY1   -DNOSMARTJBB -DNOSMARTJBU -DNOSMARTJLB -fPIC -DJU_64BIT -MT libcount_la-Judy1ByCount.lo -MD -MP -MF .deps/libcount_la-Judy1ByCount.Tpo -c -o libcount_la-Judy1ByCount.lo `test -f 'Judy1ByCount.c' || echo './'`Judy1ByCount.c
  1349. libtool: compile:  gcc -DHAVE_CONFIG_H -I. -I../.. -I. -I.. -I../JudyCommon/ -DJUDY1 -DJUDYNEXT -fPIC -DJU_64BIT -MT libnext_la-Judy1NextEmpty.lo -MD -MP -MF .deps/libnext_la-Judy1NextEmpty.Tpo -c Judy1NextEmpty.c -o libnext_la-Judy1NextEmpty.o >/dev/null 2>&1
  1350. libtool: compile:  gcc -DHAVE_CONFIG_H -I. -I../.. -I. -I.. -I../JudyCommon/ -DJUDY1 -DJUDYPREV -fPIC -DJU_64BIT -MT libprev_la-Judy1PrevEmpty.lo -MD -MP -MF .deps/libprev_la-Judy1PrevEmpty.Tpo -c Judy1PrevEmpty.c -o libprev_la-Judy1PrevEmpty.o >/dev/null 2>&1
  1351. libtool: compile:  gcc -DHAVE_CONFIG_H -I. -I../.. -I. -I.. -I../JudyCommon/ -DJUDY1 -DJUDYPREV -fPIC -DJU_64BIT -MT libprev_la-Judy1Prev.lo -MD -MP -MF .deps/libprev_la-Judy1Prev.Tpo -c Judy1Prev.c -o libprev_la-Judy1Prev.o >/dev/null 2>&1
  1352. libtool: compile:  gcc -DHAVE_CONFIG_H -I. -I../.. -I. -I.. -I../JudyCommon/ -DJUDY1 -DNOSMARTJBB -DNOSMARTJBU -DNOSMARTJLB -fPIC -DJU_64BIT -MT libcount_la-Judy1ByCount.lo -MD -MP -MF .deps/libcount_la-Judy1ByCount.Tpo -c Judy1ByCount.c  -fno-common -DPIC -o .libs/libcount_la-Judy1ByCount.o
  1353. mv -f .deps/libnext_la-Judy1NextEmpty.Tpo .deps/libnext_la-Judy1NextEmpty.Plo
  1354. /bin/sh ../../libtool  --tag=CC   --mode=compile gcc -DHAVE_CONFIG_H -I. -I../.. -I. -I.. -I../JudyCommon/    -DJUDY1   -DJUDYGETINLINE -fPIC -DJU_64BIT -MT libinline_la-j__udy1Test.lo -MD -MP -MF .deps/libinline_la-j__udy1Test.Tpo -c -o libinline_la-j__udy1Test.lo `test -f 'j__udy1Test.c' || echo './'`j__udy1Test.c
  1355. mv -f .deps/libprev_la-Judy1PrevEmpty.Tpo .deps/libprev_la-Judy1PrevEmpty.Plo
  1356. /bin/sh ../../libtool  --tag=CC   --mode=compile gcc -DHAVE_CONFIG_H -I. -I../.. -I. -I.. -I../JudyCommon/    -DJUDY1   -fPIC -DJU_64BIT -MT Judy1Tables.lo -MD -MP -MF .deps/Judy1Tables.Tpo -c -o Judy1Tables.lo Judy1Tables.c
  1357. mv -f .deps/libprev_la-Judy1Prev.Tpo .deps/libprev_la-Judy1Prev.Plo
  1358. /bin/sh ../../libtool  --tag=CC   --mode=link gcc -DJUDY1   -DJUDYNEXT -fPIC -DJU_64BIT   -o libnext.la  libnext_la-Judy1Next.lo libnext_la-Judy1NextEmpty.lo  
  1359. libtool: compile:  gcc -DHAVE_CONFIG_H -I. -I../.. -I. -I.. -I../JudyCommon/ -DJUDY1 -DNOSMARTJBB -DNOSMARTJBU -DNOSMARTJLB -fPIC -DJU_64BIT -MT libcount_la-Judy1ByCount.lo -MD -MP -MF .deps/libcount_la-Judy1ByCount.Tpo -c Judy1ByCount.c -o libcount_la-Judy1ByCount.o >/dev/null 2>&1
  1360. libtool: compile:  gcc -DHAVE_CONFIG_H -I. -I../.. -I. -I.. -I../JudyCommon/ -DJUDY1 -DJUDYGETINLINE -fPIC -DJU_64BIT -MT libinline_la-j__udy1Test.lo -MD -MP -MF .deps/libinline_la-j__udy1Test.Tpo -c j__udy1Test.c  -fno-common -DPIC -o .libs/libinline_la-j__udy1Test.o
  1361. libtool: compile:  gcc -DHAVE_CONFIG_H -I. -I../.. -I. -I.. -I../JudyCommon/ -DJUDY1 -fPIC -DJU_64BIT -MT Judy1Tables.lo -MD -MP -MF .deps/Judy1Tables.Tpo -c Judy1Tables.c  -fno-common -DPIC -o .libs/Judy1Tables.o
  1362. mv -f .deps/libcount_la-Judy1ByCount.Tpo .deps/libcount_la-Judy1ByCount.Plo
  1363. /bin/sh ../../libtool  --tag=CC   --mode=link gcc -DJUDY1   -DJUDYPREV -fPIC -DJU_64BIT   -o libprev.la  libprev_la-Judy1Prev.lo libprev_la-Judy1PrevEmpty.lo  
  1364. libtool: compile:  gcc -DHAVE_CONFIG_H -I. -I../.. -I. -I.. -I../JudyCommon/ -DJUDY1 -fPIC -DJU_64BIT -MT Judy1Tables.lo -MD -MP -MF .deps/Judy1Tables.Tpo -c Judy1Tables.c -o Judy1Tables.o >/dev/null 2>&1
  1365. libtool: compile:  gcc -DHAVE_CONFIG_H -I. -I../.. -I. -I.. -I../JudyCommon/ -DJUDY1 -DJUDYGETINLINE -fPIC -DJU_64BIT -MT libinline_la-j__udy1Test.lo -MD -MP -MF .deps/libinline_la-j__udy1Test.Tpo -c j__udy1Test.c -o libinline_la-j__udy1Test.o >/dev/null 2>&1
  1366. libtool: link: ar cru .libs/libnext.a .libs/libnext_la-Judy1Next.o .libs/libnext_la-Judy1NextEmpty.o
  1367. mv -f .deps/Judy1Tables.Tpo .deps/Judy1Tables.Plo
  1368. libtool: link: ranlib .libs/libnext.a
  1369. /bin/sh ../../libtool  --tag=CC   --mode=link gcc -DJUDY1   -DNOSMARTJBB -DNOSMARTJBU -DNOSMARTJLB -fPIC -DJU_64BIT   -o libcount.la  libcount_la-Judy1ByCount.lo  
  1370. libtool: link: ( cd ".libs" && rm -f "libnext.la" && ln -s "../libnext.la" "libnext.la" )
  1371. /bin/sh ../../libtool  --tag=CC   --mode=link gcc -DJUDY1   -fPIC -DJU_64BIT   -o libJudy1.la  Judy1Test.lo Judy1Tables.lo Judy1Set.lo Judy1SetArray.lo Judy1Unset.lo Judy1Cascade.lo Judy1Count.lo Judy1CreateBranch.lo Judy1Decascade.lo Judy1First.lo Judy1FreeArray.lo Judy1InsertBranch.lo Judy1MallocIF.lo Judy1MemActive.lo Judy1MemUsed.lo  
  1372. mv -f .deps/libinline_la-j__udy1Test.Tpo .deps/libinline_la-j__udy1Test.Plo
  1373. /bin/sh ../../libtool  --tag=CC   --mode=link gcc -DJUDY1   -DJUDYGETINLINE -fPIC -DJU_64BIT   -o libinline.la  libinline_la-j__udy1Test.lo  
  1374. libtool: link: ar cru .libs/libprev.a .libs/libprev_la-Judy1Prev.o .libs/libprev_la-Judy1PrevEmpty.o
  1375. libtool: link: ranlib .libs/libprev.a
  1376. libtool: link: ( cd ".libs" && rm -f "libprev.la" && ln -s "../libprev.la" "libprev.la" )
  1377. libtool: link: ar cru .libs/libcount.a .libs/libcount_la-Judy1ByCount.o
  1378. libtool: link: ar cru .libs/libinline.a .libs/libinline_la-j__udy1Test.o
  1379. libtool: link: ranlib .libs/libcount.a
  1380. libtool: link: ranlib .libs/libinline.a
  1381. libtool: link: ( cd ".libs" && rm -f "libcount.la" && ln -s "../libcount.la" "libcount.la" )
  1382. libtool: link: ( cd ".libs" && rm -f "libinline.la" && ln -s "../libinline.la" "libinline.la" )
  1383. libtool: link: ar cru .libs/libJudy1.a .libs/Judy1Test.o .libs/Judy1Tables.o .libs/Judy1Set.o .libs/Judy1SetArray.o .libs/Judy1Unset.o .libs/Judy1Cascade.o .libs/Judy1Count.o .libs/Judy1CreateBranch.o .libs/Judy1Decascade.o .libs/Judy1First.o .libs/Judy1FreeArray.o .libs/Judy1InsertBranch.o .libs/Judy1MallocIF.o .libs/Judy1MemActive.o .libs/Judy1MemUsed.o
  1384. libtool: link: ranlib .libs/libJudy1.a
  1385. libtool: link: ( cd ".libs" && rm -f "libJudy1.la" && ln -s "../libJudy1.la" "libJudy1.la" )
  1386. Making all in JudySL
  1387. /bin/sh ../../libtool  --tag=CC   --mode=compile gcc -DHAVE_CONFIG_H -I. -I../.. -I. -I.. -I../JudyCommon/    -fPIC -DJU_64BIT   -fPIC -DJU_64BIT -MT JudySL.lo -MD -MP -MF .deps/JudySL.Tpo -c -o JudySL.lo JudySL.c
  1388. libtool: compile:  gcc -DHAVE_CONFIG_H -I. -I../.. -I. -I.. -I../JudyCommon/ -fPIC -DJU_64BIT -fPIC -DJU_64BIT -MT JudySL.lo -MD -MP -MF .deps/JudySL.Tpo -c JudySL.c  -fno-common -DPIC -o .libs/JudySL.o
  1389. libtool: compile:  gcc -DHAVE_CONFIG_H -I. -I../.. -I. -I.. -I../JudyCommon/ -fPIC -DJU_64BIT -fPIC -DJU_64BIT -MT JudySL.lo -MD -MP -MF .deps/JudySL.Tpo -c JudySL.c -o JudySL.o >/dev/null 2>&1
  1390. mv -f .deps/JudySL.Tpo .deps/JudySL.Plo
  1391. /bin/sh ../../libtool  --tag=CC   --mode=link gcc -fPIC -DJU_64BIT   -fPIC -DJU_64BIT   -o libJudySL.la  JudySL.lo  
  1392. libtool: link: ar cru .libs/libJudySL.a .libs/JudySL.o
  1393. libtool: link: ranlib .libs/libJudySL.a
  1394. libtool: link: ( cd ".libs" && rm -f "libJudySL.la" && ln -s "../libJudySL.la" "libJudySL.la" )
  1395. Making all in JudyHS
  1396. /bin/sh ../../libtool  --tag=CC   --mode=compile gcc -DHAVE_CONFIG_H -I. -I../.. -I. -I.. -I../JudyCommon/    -fPIC -DJU_64BIT   -fPIC -DJU_64BIT -MT JudyHS.lo -MD -MP -MF .deps/JudyHS.Tpo -c -o JudyHS.lo JudyHS.c
  1397. libtool: compile:  gcc -DHAVE_CONFIG_H -I. -I../.. -I. -I.. -I../JudyCommon/ -fPIC -DJU_64BIT -fPIC -DJU_64BIT -MT JudyHS.lo -MD -MP -MF .deps/JudyHS.Tpo -c JudyHS.c  -fno-common -DPIC -o .libs/JudyHS.o
  1398. libtool: compile:  gcc -DHAVE_CONFIG_H -I. -I../.. -I. -I.. -I../JudyCommon/ -fPIC -DJU_64BIT -fPIC -DJU_64BIT -MT JudyHS.lo -MD -MP -MF .deps/JudyHS.Tpo -c JudyHS.c -o JudyHS.o >/dev/null 2>&1
  1399. mv -f .deps/JudyHS.Tpo .deps/JudyHS.Plo
  1400. /bin/sh ../../libtool  --tag=CC   --mode=link gcc -fPIC -DJU_64BIT   -fPIC -DJU_64BIT   -o libJudyHS.la  JudyHS.lo  
  1401. libtool: link: ar cru .libs/libJudyHS.a .libs/JudyHS.o
  1402. libtool: link: ranlib .libs/libJudyHS.a
  1403. libtool: link: ( cd ".libs" && rm -f "libJudyHS.la" && ln -s "../libJudyHS.la" "libJudyHS.la" )
  1404. Making all in obj
  1405. /bin/sh ../../libtool  --tag=CC   --mode=link gcc  -fPIC -DJU_64BIT -version-info 1:3:0  -o libJudy.la -rpath /usr/local/lib  ../JudyCommon/*.lo ../JudyL/*.lo ../Judy1/*.lo ../JudyHS/*.lo ../JudySL/*.lo  
  1406. libtool: link: gcc -dynamiclib -Wl,-undefined -Wl,dynamic_lookup -o .libs/libJudy.1.dylib  ../JudyCommon/.libs/JudyMalloc.o ../JudyL/.libs/JudyLCascade.o ../JudyL/.libs/JudyLCount.o ../JudyL/.libs/JudyLCreateBranch.o ../JudyL/.libs/JudyLDecascade.o ../JudyL/.libs/JudyLDel.o ../JudyL/.libs/JudyLFirst.o ../JudyL/.libs/JudyLFreeArray.o ../JudyL/.libs/JudyLGet.o ../JudyL/.libs/JudyLIns.o ../JudyL/.libs/JudyLInsArray.o ../JudyL/.libs/JudyLInsertBranch.o ../JudyL/.libs/JudyLMallocIF.o ../JudyL/.libs/JudyLMemActive.o ../JudyL/.libs/JudyLMemUsed.o ../JudyL/.libs/JudyLTables.o ../JudyL/.libs/libcount_la-JudyLByCount.o ../JudyL/.libs/libinline_la-j__udyLGet.o ../JudyL/.libs/libnext_la-JudyLNext.o ../JudyL/.libs/libnext_la-JudyLNextEmpty.o ../JudyL/.libs/libprev_la-JudyLPrev.o ../JudyL/.libs/libprev_la-JudyLPrevEmpty.o ../Judy1/.libs/Judy1Cascade.o ../Judy1/.libs/Judy1Count.o ../Judy1/.libs/Judy1CreateBranch.o ../Judy1/.libs/Judy1Decascade.o ../Judy1/.libs/Judy1First.o ../Judy1/.libs/Judy1FreeArray.o ../Judy1/.libs/Judy1InsertBranch.o ../Judy1/.libs/Judy1MallocIF.o ../Judy1/.libs/Judy1MemActive.o ../Judy1/.libs/Judy1MemUsed.o ../Judy1/.libs/Judy1Set.o ../Judy1/.libs/Judy1SetArray.o ../Judy1/.libs/Judy1Tables.o ../Judy1/.libs/Judy1Test.o ../Judy1/.libs/Judy1Unset.o ../Judy1/.libs/libcount_la-Judy1ByCount.o ../Judy1/.libs/libinline_la-j__udy1Test.o ../Judy1/.libs/libnext_la-Judy1Next.o ../Judy1/.libs/libnext_la-Judy1NextEmpty.o ../Judy1/.libs/libprev_la-Judy1Prev.o ../Judy1/.libs/libprev_la-Judy1PrevEmpty.o ../JudyHS/.libs/JudyHS.o ../JudySL/.libs/JudySL.o      -install_name  /usr/local/lib/libJudy.1.dylib -compatibility_version 2 -current_version 2.3 -Wl,-single_module
  1407. libtool: link: (cd ".libs" && rm -f "libJudy.dylib" && ln -s "libJudy.1.dylib" "libJudy.dylib")
  1408. libtool: link: ar cru .libs/libJudy.a  ../JudyCommon/JudyMalloc.o ../JudyL/JudyLCascade.o ../JudyL/JudyLCount.o ../JudyL/JudyLCreateBranch.o ../JudyL/JudyLDecascade.o ../JudyL/JudyLDel.o ../JudyL/JudyLFirst.o ../JudyL/JudyLFreeArray.o ../JudyL/JudyLGet.o ../JudyL/JudyLIns.o ../JudyL/JudyLInsArray.o ../JudyL/JudyLInsertBranch.o ../JudyL/JudyLMallocIF.o ../JudyL/JudyLMemActive.o ../JudyL/JudyLMemUsed.o ../JudyL/JudyLTables.o ../JudyL/libcount_la-JudyLByCount.o ../JudyL/libinline_la-j__udyLGet.o ../JudyL/libnext_la-JudyLNext.o ../JudyL/libnext_la-JudyLNextEmpty.o ../JudyL/libprev_la-JudyLPrev.o ../JudyL/libprev_la-JudyLPrevEmpty.o ../Judy1/Judy1Cascade.o ../Judy1/Judy1Count.o ../Judy1/Judy1CreateBranch.o ../Judy1/Judy1Decascade.o ../Judy1/Judy1First.o ../Judy1/Judy1FreeArray.o ../Judy1/Judy1InsertBranch.o ../Judy1/Judy1MallocIF.o ../Judy1/Judy1MemActive.o ../Judy1/Judy1MemUsed.o ../Judy1/Judy1Set.o ../Judy1/Judy1SetArray.o ../Judy1/Judy1Tables.o ../Judy1/Judy1Test.o ../Judy1/Judy1Unset.o ../Judy1/libcount_la-Judy1ByCount.o ../Judy1/libinline_la-j__udy1Test.o ../Judy1/libnext_la-Judy1Next.o ../Judy1/libnext_la-Judy1NextEmpty.o ../Judy1/libprev_la-Judy1Prev.o ../Judy1/libprev_la-Judy1PrevEmpty.o ../JudyHS/JudyHS.o ../JudySL/JudySL.o
  1409. libtool: link: ranlib .libs/libJudy.a
  1410. libtool: link: ( cd ".libs" && rm -f "libJudy.la" && ln -s "../libJudy.la" "libJudy.la" )
  1411. OK  
  1412.  
  1413. [/var/folders/zz/zyxvpxvq6csfxvn_n0000000000000/T/netdata-judy-XXXXXX.SRAYb2Ny/libjudy-1.0.5-netdata2]# env CFLAGS=-fPIC CXXFLAGS= LDFLAGS= ar -r src/libJudy.a src/Judy1/Judy1Cascade.o src/Judy1/Judy1Count.o src/Judy1/Judy1CreateBranch.o src/Judy1/Judy1Decascade.o src/Judy1/Judy1First.o src/Judy1/Judy1FreeArray.o src/Judy1/Judy1InsertBranch.o src/Judy1/Judy1MallocIF.o src/Judy1/Judy1MemActive.o src/Judy1/Judy1MemUsed.o src/Judy1/Judy1Set.o src/Judy1/Judy1SetArray.o src/Judy1/Judy1Tables.o src/Judy1/Judy1Test.o src/Judy1/Judy1Unset.o src/Judy1/libcount_la-Judy1ByCount.o src/Judy1/libinline_la-j__udy1Test.o src/Judy1/libnext_la-Judy1Next.o src/Judy1/libnext_la-Judy1NextEmpty.o src/Judy1/libprev_la-Judy1Prev.o src/Judy1/libprev_la-Judy1PrevEmpty.o src/JudyCommon/JudyMalloc.o src/JudyHS/JudyHS.o src/JudyL/JudyLCascade.o src/JudyL/JudyLCount.o src/JudyL/JudyLCreateBranch.o src/JudyL/JudyLDecascade.o src/JudyL/JudyLDel.o src/JudyL/JudyLFirst.o src/JudyL/JudyLFreeArray.o src/JudyL/JudyLGet.o src/JudyL/JudyLIns.o src/JudyL/JudyLInsArray.o src/JudyL/JudyLInsertBranch.o src/JudyL/JudyLMallocIF.o src/JudyL/JudyLMemActive.o src/JudyL/JudyLMemUsed.o src/JudyL/JudyLTables.o src/JudyL/libcount_la-JudyLByCount.o src/JudyL/libinline_la-j__udyLGet.o src/JudyL/libnext_la-JudyLNext.o src/JudyL/libnext_la-JudyLNextEmpty.o src/JudyL/libprev_la-JudyLPrev.o src/JudyL/libprev_la-JudyLPrevEmpty.o src/JudySL/JudySL.o
  1414. ar: creating archive src/libJudy.a
  1415. OK  
  1416.  
  1417. [/private/var/folders/tm/bh_rhtyj47x8b5nl3dh3cm400000gn/T/netdata-kickstart-XXXXXXXXXX.zzC0dahv/netdata-v1.33.0-9-g162f2b62b]# mkdir -p /private/var/folders/tm/bh_rhtyj47x8b5nl3dh3cm400000gn/T/netdata-kickstart-XXXXXXXXXX.zzC0dahv/netdata-v1.33.0-9-g162f2b62b/externaldeps/libJudy
  1418. OK  
  1419.  
  1420. [/private/var/folders/tm/bh_rhtyj47x8b5nl3dh3cm400000gn/T/netdata-kickstart-XXXXXXXXXX.zzC0dahv/netdata-v1.33.0-9-g162f2b62b]# cp /var/folders/zz/zyxvpxvq6csfxvn_n0000000000000/T/netdata-judy-XXXXXX.SRAYb2Ny/libjudy-1.0.5-netdata2/src/libJudy.a /private/var/folders/tm/bh_rhtyj47x8b5nl3dh3cm400000gn/T/netdata-kickstart-XXXXXXXXXX.zzC0dahv/netdata-v1.33.0-9-g162f2b62b/externaldeps/libJudy/libJudy.a
  1421. OK  
  1422.  
  1423. [/private/var/folders/tm/bh_rhtyj47x8b5nl3dh3cm400000gn/T/netdata-kickstart-XXXXXXXXXX.zzC0dahv/netdata-v1.33.0-9-g162f2b62b]# cp /var/folders/zz/zyxvpxvq6csfxvn_n0000000000000/T/netdata-judy-XXXXXX.SRAYb2Ny/libjudy-1.0.5-netdata2/src/Judy.h /private/var/folders/tm/bh_rhtyj47x8b5nl3dh3cm400000gn/T/netdata-kickstart-XXXXXXXXXX.zzC0dahv/netdata-v1.33.0-9-g162f2b62b/externaldeps/libJudy/Judy.h
  1424. OK  
  1425.  
  1426. OK  libJudy built and prepared.
  1427.  
  1428.  
  1429. --- Run autotools to configure the build environment ---
  1430. [/private/var/folders/tm/bh_rhtyj47x8b5nl3dh3cm400000gn/T/netdata-kickstart-XXXXXXXXXX.zzC0dahv/netdata-v1.33.0-9-g162f2b62b]# autoreconf -ivf
  1431. autoreconf: export WARNINGS=
  1432. autoreconf: Entering directory '.'
  1433. autoreconf: configure.ac: not using Gettext
  1434. autoreconf: running: aclocal --force -I build/m4
  1435. autoreconf: configure.ac: tracing
  1436. autoreconf: configure.ac: not using Libtool
  1437. autoreconf: configure.ac: not using Intltool
  1438. autoreconf: configure.ac: not using Gtkdoc
  1439. autoreconf: running: /usr/local/Cellar/autoconf/2.71/bin/autoconf --force
  1440. configure.ac:39: warning: The macro `AC_PROG_CC_C99' is obsolete.
  1441. configure.ac:39: You should run autoupdate.
  1442. ./lib/autoconf/c.m4:1659: AC_PROG_CC_C99 is expanded from...
  1443. configure.ac:39: the top level
  1444. configure.ac:308: warning: The macro `ACX_PTHREAD' is obsolete.
  1445. configure.ac:308: You should run autoupdate.
  1446. build/m4/ax_pthread.m4:63: ACX_PTHREAD is expanded from...
  1447. configure.ac:308: the top level
  1448. configure.ac:536: warning: The macro `AC_TRY_LINK' is obsolete.
  1449. configure.ac:536: You should run autoupdate.
  1450. ./lib/autoconf/general.m4:2920: AC_TRY_LINK is expanded from...
  1451. configure.ac:536: the top level
  1452. configure.ac:1072: warning: The macro `AC_TRY_LINK' is obsolete.
  1453. configure.ac:1072: You should run autoupdate.
  1454. ./lib/autoconf/general.m4:2920: AC_TRY_LINK is expanded from...
  1455. configure.ac:1072: the top level
  1456. configure.ac:1394: warning: The macro `AC_LANG_CPLUSPLUS' is obsolete.
  1457. configure.ac:1394: You should run autoupdate.
  1458. ./lib/autoconf/c.m4:262: AC_LANG_CPLUSPLUS is expanded from...
  1459. configure.ac:1394: the top level
  1460. configure.ac:1400: warning: The macro `AC_TRY_LINK' is obsolete.
  1461. configure.ac:1400: You should run autoupdate.
  1462. ./lib/autoconf/general.m4:2920: AC_TRY_LINK is expanded from...
  1463. configure.ac:1400: the top level
  1464. autoreconf: running: /usr/local/Cellar/autoconf/2.71/bin/autoheader --force
  1465. autoreconf: running: automake --add-missing --copy --force-missing
  1466. autoreconf: Leaving directory '.'
  1467. OK  
  1468.  
  1469. [/private/var/folders/tm/bh_rhtyj47x8b5nl3dh3cm400000gn/T/netdata-kickstart-XXXXXXXXXX.zzC0dahv/netdata-v1.33.0-9-g162f2b62b]# ./configure --prefix=/usr/local/netdata/usr --sysconfdir=/usr/local/netdata/etc --localstatedir=/usr/local/netdata/var --libexecdir=/usr/local/netdata/usr/libexec --libdir=/usr/local/netdata/usr/lib --with-zlib --with-math --with-user=netdata --enable-cloud --with-bundled-protobuf --with-bundled-libJudy CFLAGS=-O2 LDFLAGS=
  1470. checking whether to enable maintainer-specific portions of Makefiles... no
  1471. checking for a BSD-compatible install... /usr/bin/install -c
  1472. checking whether build environment is sane... yes
  1473. checking for a race-free mkdir -p... ././install-sh -c -d
  1474. checking for gawk... no
  1475. checking for mawk... no
  1476. checking for nawk... no
  1477. checking for awk... awk
  1478. checking whether make sets $(MAKE)... yes
  1479. checking whether make supports nested variables... yes
  1480. checking how to create a pax tar archive... gnutar
  1481. checking whether make supports nested variables... (cached) yes
  1482. checking build system type... x86_64-apple-darwin19.6.0
  1483. checking host system type... x86_64-apple-darwin19.6.0
  1484. checking for gcc... gcc
  1485. checking whether the C compiler works... yes
  1486. checking for C compiler default output file name... a.out
  1487. checking for suffix of executables...
  1488. checking whether we are cross compiling... no
  1489. checking for suffix of object files... o
  1490. checking whether the compiler supports GNU C... yes
  1491. checking whether gcc accepts -g... yes
  1492. checking for gcc option to enable C11 features... none needed
  1493. checking whether gcc understands -c and -o together... yes
  1494. checking whether make supports the include directive... yes (GNU style)
  1495. checking dependency style of gcc... gcc3
  1496. checking for g++... g++
  1497. checking whether the compiler supports GNU C++... yes
  1498. checking whether g++ accepts -g... yes
  1499. checking for g++ option to enable C++11 features... none needed
  1500. checking dependency style of g++... gcc3
  1501. checking for pkg-config... /usr/local/bin/pkg-config
  1502. checking pkg-config is at least version 0.9.0... yes
  1503. checking for stdio.h... yes
  1504. checking for stdlib.h... yes
  1505. checking for string.h... yes
  1506. checking for inttypes.h... yes
  1507. checking for stdint.h... yes
  1508. checking for strings.h... yes
  1509. checking for sys/stat.h... yes
  1510. checking for sys/types.h... yes
  1511. checking for unistd.h... yes
  1512. checking for wchar.h... yes
  1513. checking for minix/config.h... no
  1514. checking for sys/prctl.h... no
  1515. checking for sys/vfs.h... no
  1516. checking for sys/statfs.h... no
  1517. checking for linux/magic.h... no
  1518. checking for sys/statvfs.h... yes
  1519. checking for sys/mount.h... yes
  1520. checking whether it is safe to define __EXTENSIONS__... yes
  1521. checking whether _XOPEN_SOURCE should be defined... no
  1522. checking for __attribute__((returns_nonnull))... yes
  1523. checking for __attribute__((malloc))... yes
  1524. checking for __attribute__((noreturn))... yes
  1525. checking for __attribute__((noinline))... yes
  1526. checking for __attribute__((format))... yes
  1527. checking for __attribute__((warn_unused_result))... yes
  1528. checking for struct timespec... yes
  1529. checking for clockid_t... yes
  1530. checking for library containing clock_gettime... none required
  1531. checking for clock_gettime... yes
  1532. checking for sched_setscheduler... no
  1533. checking for sched_getscheduler... no
  1534. checking for sched_getparam... no
  1535. checking for sched_get_priority_min... yes
  1536. checking for sched_get_priority_max... yes
  1537. checking for getpriority... yes
  1538. checking for setpriority... yes
  1539. checking for nice... yes
  1540. checking for recvmmsg... no
  1541. checking for int8_t... yes
  1542. checking for int16_t... yes
  1543. checking for int32_t... yes
  1544. checking for int64_t... yes
  1545. checking for uint8_t... yes
  1546. checking for uint16_t... yes
  1547. checking for uint32_t... yes
  1548. checking for uint64_t... yes
  1549. checking for inline... inline
  1550. checking for gcc options needed to detect all undeclared functions... none needed
  1551. checking whether strerror_r is declared... yes
  1552. checking whether strerror_r returns char *... no
  1553. checking for _Generic... yes
  1554. checking for __atomic... yes
  1555. checking size of void *... 8
  1556. checking for sys/mkdev.h... no
  1557. checking for sys/sysmacros.h... no
  1558. checking for sys/types.h... (cached) yes
  1559. checking for netinet/in.h... yes
  1560. checking for arpa/nameser.h... yes
  1561. checking for netdb.h... yes
  1562. checking for resolv.h... yes
  1563. checking for accept4... no
  1564. checking operating system... Host OS: macos
  1565. checking if compiler needs -Werror to reject unknown flags... yes
  1566. checking whether pthreads work with -pthread... yes
  1567. checking for joinable pthread attribute... PTHREAD_CREATE_JOINABLE
  1568. checking if more special flags are required for pthreads... -D_THREAD_SAFE
  1569. checking for PTHREAD_PRIO_INHERIT... yes
  1570. checking for pthread_getname_np in -lpthread... yes
  1571. checking for sin in -lm... yes
  1572. checking if libm should be used... yes
  1573. checking for uv_fs_scandir_next in -luv... yes
  1574. checking for LZ4_initStream in -llz4... yes
  1575. checking for LZ4_compress_default in -llz4... yes
  1576. checking for zlib... yes
  1577. checking if zlib should be used... yes
  1578. checking for uuid... yes
  1579. checking for SHA256_Init in -lcrypto... no
  1580. checking for X509_VERIFY_PARAM_set1_host in -lcrypto... no
  1581. configure: WARNING: DISABLING SSL HOSTNAME VALIDATION BECAUSE IT IS NOT AVAILABLE ON THIS SYSTEM.
  1582. checking for json-c... yes
  1583. checking for json_object_get_type in -ljson-c... yes
  1584. checking for libJudy in yes... yes
  1585. checking if netdata dbengine should be used... no
  1586. checking if netdata https should be used... no
  1587. checking if netdata compression should be used... yes
  1588. checking if json-c should be used... yes
  1589. checking for memory allocator... system
  1590. checking for mallopt... no
  1591. checking for mallinfo... no
  1592. checking for libcap... no
  1593. checking if libcap should be used... no
  1594. checking is bundled protobuf available... yes
  1595. configure: using bundled protobuf
  1596. checking for g++... /usr/bin/g++
  1597. checking if Cloud functionality should be enabled... yes
  1598. configure: Checking if ACLK Next Generation can be built
  1599. checking if git submodules present for ACLK Next Generation... yes
  1600. checking if SSL available for ACLK Next Generation... no
  1601. checking if JSON-C available for ACLK Next Generation... yes
  1602. checking ACLK Next Generation can be built... yes
  1603. checking if protobuf available for New Cloud Protocol... yes
  1604. checking if protoc available for New Cloud Protocol... yes
  1605. checking if C++ compiler available for New Cloud Protocol... yes
  1606. checking ACLK Next Generation can support New Cloud protocol... yes
  1607. checking if apps.plugin should be enabled... no
  1608. checking for libipmimonitoring... no
  1609. checking if freeipmi.plugin should be enabled... no
  1610. checking for httpConnect2 in -lcups... yes
  1611. checking for cups/cups.h... yes
  1612. checking for cups-config... /usr/bin/cups-config
  1613. checking if cups.plugin should be enabled... yes
  1614. checking for linux/netfilter/nfnetlink_conntrack.h... no
  1615. checking for libnetfilter_acct... no
  1616. checking for libmnl... no
  1617. checking if nfacct.plugin should be enabled... no
  1618. checking for yajl... no
  1619. checking for xenstat_init in -lxenstat... no
  1620. checking for xenlight... no
  1621. checking if xenstat.plugin should be enabled... no
  1622. checking for linux/perf_event.h... no
  1623. checking if perf.plugin should be enabled... no
  1624. checking if gtest and gmock can be found... checking for gtest... no
  1625. checking for gmock... no
  1626. checking if git submodules are present for machine learning functionality... yes
  1627. checking whether C++ compiler accepts -std=c++11... yes
  1628. no
  1629. checking if slabinfo.plugin should be enabled... no
  1630. checking for libcrypto... no
  1631. checking for libssl... no
  1632. checking for libcurl... yes
  1633. checking for curl_easy_init in -lcurl... yes
  1634. checking for aws-cpp-sdk-core... no
  1635. checking for aws-cpp-sdk-kinesis... no
  1636. checking if kinesis backend should be enabled... no
  1637. checking for grpc... no
  1638. checking for google_cloud_cpp_pubsub_protos... no
  1639. checking for g++... (cached) /usr/bin/g++
  1640. checking if pubsub exporting connector should be enabled... detect
  1641. checking for snappy::RawCompress in -lsnappy... no
  1642. checking if prometheus remote write backend should be enabled... no
  1643. checking for libmongoc-1.0 >= 1.7... no
  1644. checking if mongodb backend should be enabled... no
  1645. checking for setns... no
  1646. checking if cgroup-network can be enabled... no
  1647. checking if LTO should be enabled... no
  1648. checking whether we can use -latomic... no
  1649. checking for cmocka... no
  1650. configure: CMocka not found on the system. Unit tests disabled
  1651. checking that generated files are newer than configure... done
  1652. configure: creating ./config.status
  1653. config.status: creating Makefile
  1654. config.status: creating netdata.spec
  1655. config.status: creating backends/graphite/Makefile
  1656. config.status: creating backends/json/Makefile
  1657. config.status: creating backends/Makefile
  1658. config.status: creating backends/opentsdb/Makefile
  1659. config.status: creating backends/prometheus/Makefile
  1660. config.status: creating backends/prometheus/remote_write/Makefile
  1661. config.status: creating backends/aws_kinesis/Makefile
  1662. config.status: creating backends/mongodb/Makefile
  1663. config.status: creating collectors/Makefile
  1664. config.status: creating collectors/apps.plugin/Makefile
  1665. config.status: creating collectors/cgroups.plugin/Makefile
  1666. config.status: creating collectors/charts.d.plugin/Makefile
  1667. config.status: creating collectors/checks.plugin/Makefile
  1668. config.status: creating collectors/diskspace.plugin/Makefile
  1669. config.status: creating collectors/timex.plugin/Makefile
  1670. config.status: creating collectors/fping.plugin/Makefile
  1671. config.status: creating collectors/ioping.plugin/Makefile
  1672. config.status: creating collectors/freebsd.plugin/Makefile
  1673. config.status: creating collectors/freeipmi.plugin/Makefile
  1674. config.status: creating collectors/cups.plugin/Makefile
  1675. config.status: creating collectors/idlejitter.plugin/Makefile
  1676. config.status: creating collectors/macos.plugin/Makefile
  1677. config.status: creating collectors/nfacct.plugin/Makefile
  1678. config.status: creating collectors/node.d.plugin/Makefile
  1679. config.status: creating collectors/plugins.d/Makefile
  1680. config.status: creating collectors/proc.plugin/Makefile
  1681. config.status: creating collectors/python.d.plugin/Makefile
  1682. config.status: creating collectors/slabinfo.plugin/Makefile
  1683. config.status: creating collectors/statsd.plugin/Makefile
  1684. config.status: creating collectors/ebpf.plugin/Makefile
  1685. config.status: creating collectors/tc.plugin/Makefile
  1686. config.status: creating collectors/xenstat.plugin/Makefile
  1687. config.status: creating collectors/perf.plugin/Makefile
  1688. config.status: creating daemon/Makefile
  1689. config.status: creating database/Makefile
  1690. config.status: creating database/engine/Makefile
  1691. config.status: creating database/engine/metadata_log/Makefile
  1692. config.status: creating diagrams/Makefile
  1693. config.status: creating exporting/Makefile
  1694. config.status: creating exporting/graphite/Makefile
  1695. config.status: creating exporting/json/Makefile
  1696. config.status: creating exporting/opentsdb/Makefile
  1697. config.status: creating exporting/prometheus/Makefile
  1698. config.status: creating exporting/prometheus/remote_write/Makefile
  1699. config.status: creating exporting/aws_kinesis/Makefile
  1700. config.status: creating exporting/pubsub/Makefile
  1701. config.status: creating exporting/mongodb/Makefile
  1702. config.status: creating exporting/tests/Makefile
  1703. config.status: creating health/Makefile
  1704. config.status: creating health/notifications/Makefile
  1705. config.status: creating ml/Makefile
  1706. config.status: creating ml/kmeans/Makefile
  1707. config.status: creating libnetdata/Makefile
  1708. config.status: creating libnetdata/tests/Makefile
  1709. config.status: creating libnetdata/adaptive_resortable_list/Makefile
  1710. config.status: creating libnetdata/avl/Makefile
  1711. config.status: creating libnetdata/buffer/Makefile
  1712. config.status: creating libnetdata/clocks/Makefile
  1713. config.status: creating libnetdata/completion/Makefile
  1714. config.status: creating libnetdata/config/Makefile
  1715. config.status: creating libnetdata/dictionary/Makefile
  1716. config.status: creating libnetdata/ebpf/Makefile
  1717. config.status: creating libnetdata/eval/Makefile
  1718. config.status: creating libnetdata/locks/Makefile
  1719. config.status: creating libnetdata/log/Makefile
  1720. config.status: creating libnetdata/popen/Makefile
  1721. config.status: creating libnetdata/procfile/Makefile
  1722. config.status: creating libnetdata/simple_pattern/Makefile
  1723. config.status: creating libnetdata/socket/Makefile
  1724. config.status: creating libnetdata/statistical/Makefile
  1725. config.status: creating libnetdata/storage_number/Makefile
  1726. config.status: creating libnetdata/storage_number/tests/Makefile
  1727. config.status: creating libnetdata/threads/Makefile
  1728. config.status: creating libnetdata/url/Makefile
  1729. config.status: creating libnetdata/json/Makefile
  1730. config.status: creating libnetdata/health/Makefile
  1731. config.status: creating registry/Makefile
  1732. config.status: creating streaming/Makefile
  1733. config.status: creating system/Makefile
  1734. config.status: creating tests/Makefile
  1735. config.status: creating web/Makefile
  1736. config.status: creating web/api/Makefile
  1737. config.status: creating web/api/badges/Makefile
  1738. config.status: creating web/api/exporters/Makefile
  1739. config.status: creating web/api/exporters/shell/Makefile
  1740. config.status: creating web/api/exporters/prometheus/Makefile
  1741. config.status: creating web/api/formatters/Makefile
  1742. config.status: creating web/api/formatters/csv/Makefile
  1743. config.status: creating web/api/formatters/json/Makefile
  1744. config.status: creating web/api/formatters/ssv/Makefile
  1745. config.status: creating web/api/formatters/value/Makefile
  1746. config.status: creating web/api/queries/Makefile
  1747. config.status: creating web/api/queries/average/Makefile
  1748. config.status: creating web/api/queries/des/Makefile
  1749. config.status: creating web/api/queries/incremental_sum/Makefile
  1750. config.status: creating web/api/queries/max/Makefile
  1751. config.status: creating web/api/queries/median/Makefile
  1752. config.status: creating web/api/queries/min/Makefile
  1753. config.status: creating web/api/queries/ses/Makefile
  1754. config.status: creating web/api/queries/stddev/Makefile
  1755. config.status: creating web/api/queries/sum/Makefile
  1756. config.status: creating web/api/health/Makefile
  1757. config.status: creating web/gui/Makefile
  1758. config.status: creating web/gui/dashboard/Makefile
  1759. config.status: creating web/server/Makefile
  1760. config.status: creating web/server/static/Makefile
  1761. config.status: creating claim/Makefile
  1762. config.status: creating spawn/Makefile
  1763. config.status: creating parser/Makefile
  1764. config.status: creating config.h
  1765. config.status: executing depfiles commands
  1766. OK  
  1767.  
  1768. --- Cleanup compilation directory ---
  1769. [/private/var/folders/tm/bh_rhtyj47x8b5nl3dh3cm400000gn/T/netdata-kickstart-XXXXXXXXXX.zzC0dahv/netdata-v1.33.0-9-g162f2b62b]# make clean
  1770. Making clean in diagrams
  1771. make[1]: Nothing to be done for `clean'.
  1772. Making clean in system
  1773. test -z "edit-config netdata-openrc netdata.logrotate netdata.service netdata.service.v235 netdata-init-d netdata-lsb netdata-freebsd netdata.plist netdata.crontab netdata-updater.service " || rm -f edit-config netdata-openrc netdata.logrotate netdata.service netdata.service.v235 netdata-init-d netdata-lsb netdata-freebsd netdata.plist netdata.crontab netdata-updater.service
  1774. Making clean in tests
  1775. test -z "health_mgmtapi/health-cmdapi-test.sh acls/acl.sh urls/request.sh alarm_repetition/alarm.sh template_dimension/template_dim.sh " || rm -f health_mgmtapi/health-cmdapi-test.sh acls/acl.sh urls/request.sh alarm_repetition/alarm.sh template_dimension/template_dim.sh
  1776. Making clean in backends
  1777. Making clean in graphite
  1778. make[2]: Nothing to be done for `clean'.
  1779. Making clean in json
  1780. make[2]: Nothing to be done for `clean'.
  1781. Making clean in opentsdb
  1782. make[2]: Nothing to be done for `clean'.
  1783. Making clean in prometheus
  1784. Making clean in remote_write
  1785. test -z "remote_write.pb.cc remote_write.pb.h " || rm -f remote_write.pb.cc remote_write.pb.h
  1786. make[3]: Nothing to be done for `clean-am'.
  1787. Making clean in aws_kinesis
  1788. make[2]: Nothing to be done for `clean'.
  1789. Making clean in mongodb
  1790. make[2]: Nothing to be done for `clean'.
  1791. make[2]: Nothing to be done for `clean-am'.
  1792. Making clean in collectors
  1793. Making clean in plugins.d
  1794. make[3]: Nothing to be done for `clean-am'.
  1795. Making clean in apps.plugin
  1796. make[2]: Nothing to be done for `clean'.
  1797. Making clean in cgroups.plugin
  1798. test -z "cgroup-name.sh " || rm -f cgroup-name.sh
  1799. Making clean in charts.d.plugin
  1800. test -z "charts.d.plugin " || rm -f charts.d.plugin
  1801. Making clean in checks.plugin
  1802. make[2]: Nothing to be done for `clean'.
  1803. Making clean in cups.plugin
  1804. make[2]: Nothing to be done for `clean'.
  1805. Making clean in diskspace.plugin
  1806. make[2]: Nothing to be done for `clean'.
  1807. Making clean in timex.plugin
  1808. make[2]: Nothing to be done for `clean'.
  1809. Making clean in fping.plugin
  1810. test -z "fping.plugin " || rm -f fping.plugin
  1811. Making clean in ioping.plugin
  1812. test -z "ioping.plugin " || rm -f ioping.plugin
  1813. Making clean in freebsd.plugin
  1814. make[2]: Nothing to be done for `clean'.
  1815. Making clean in freeipmi.plugin
  1816. make[2]: Nothing to be done for `clean'.
  1817. Making clean in idlejitter.plugin
  1818. make[2]: Nothing to be done for `clean'.
  1819. Making clean in macos.plugin
  1820. make[2]: Nothing to be done for `clean'.
  1821. Making clean in nfacct.plugin
  1822. make[2]: Nothing to be done for `clean'.
  1823. Making clean in xenstat.plugin
  1824. make[2]: Nothing to be done for `clean'.
  1825. Making clean in perf.plugin
  1826. make[2]: Nothing to be done for `clean'.
  1827. Making clean in node.d.plugin
  1828. test -z "node.d.plugin " || rm -f node.d.plugin
  1829. Making clean in proc.plugin
  1830. make[2]: Nothing to be done for `clean'.
  1831. Making clean in python.d.plugin
  1832. test -z "python.d.plugin " || rm -f python.d.plugin
  1833. Making clean in slabinfo.plugin
  1834. test -z "slabinfo.plugin " || rm -f slabinfo.plugin
  1835. Making clean in statsd.plugin
  1836. make[2]: Nothing to be done for `clean'.
  1837. Making clean in ebpf.plugin
  1838. make[2]: Nothing to be done for `clean'.
  1839. Making clean in tc.plugin
  1840. test -z "tc-qos-helper.sh " || rm -f tc-qos-helper.sh
  1841. make[2]: Nothing to be done for `clean-am'.
  1842. Making clean in daemon
  1843. test -z "anonymous-statistics.sh " || rm -f anonymous-statistics.sh
  1844. Making clean in database
  1845. Making clean in engine
  1846. Making clean in metadata_log
  1847. make[3]: Nothing to be done for `clean'.
  1848. make[3]: Nothing to be done for `clean-am'.
  1849. make[2]: Nothing to be done for `clean-am'.
  1850. Making clean in exporting
  1851. Making clean in tests
  1852. make[2]: Nothing to be done for `clean'.
  1853. Making clean in graphite
  1854. make[2]: Nothing to be done for `clean'.
  1855. Making clean in json
  1856. make[2]: Nothing to be done for `clean'.
  1857. Making clean in opentsdb
  1858. make[2]: Nothing to be done for `clean'.
  1859. Making clean in prometheus
  1860. Making clean in remote_write
  1861. test -z "remote_write.pb.cc remote_write.pb.h " || rm -f remote_write.pb.cc remote_write.pb.h
  1862. make[3]: Nothing to be done for `clean-am'.
  1863. Making clean in aws_kinesis
  1864. make[2]: Nothing to be done for `clean'.
  1865. Making clean in pubsub
  1866. make[2]: Nothing to be done for `clean'.
  1867. Making clean in mongodb
  1868. make[2]: Nothing to be done for `clean'.
  1869. make[2]: Nothing to be done for `clean-am'.
  1870. Making clean in health
  1871. Making clean in notifications
  1872. test -z "alarm-notify.sh " || rm -f alarm-notify.sh
  1873. test -z "" || rm -f
  1874. Making clean in libnetdata
  1875. Making clean in adaptive_resortable_list
  1876. make[2]: Nothing to be done for `clean'.
  1877. Making clean in avl
  1878. make[2]: Nothing to be done for `clean'.
  1879. Making clean in buffer
  1880. make[2]: Nothing to be done for `clean'.
  1881. Making clean in clocks
  1882. make[2]: Nothing to be done for `clean'.
  1883. Making clean in completion
  1884. make[2]: Nothing to be done for `clean'.
  1885. Making clean in config
  1886. make[2]: Nothing to be done for `clean'.
  1887. Making clean in dictionary
  1888. make[2]: Nothing to be done for `clean'.
  1889. Making clean in ebpf
  1890. make[2]: Nothing to be done for `clean'.
  1891. Making clean in eval
  1892. make[2]: Nothing to be done for `clean'.
  1893. Making clean in json
  1894. make[2]: Nothing to be done for `clean'.
  1895. Making clean in health
  1896. make[2]: Nothing to be done for `clean'.
  1897. Making clean in locks
  1898. make[2]: Nothing to be done for `clean'.
  1899. Making clean in log
  1900. make[2]: Nothing to be done for `clean'.
  1901. Making clean in popen
  1902. make[2]: Nothing to be done for `clean'.
  1903. Making clean in procfile
  1904. make[2]: Nothing to be done for `clean'.
  1905. Making clean in simple_pattern
  1906. make[2]: Nothing to be done for `clean'.
  1907. Making clean in socket
  1908. make[2]: Nothing to be done for `clean'.
  1909. Making clean in statistical
  1910. make[2]: Nothing to be done for `clean'.
  1911. Making clean in storage_number
  1912. Making clean in tests
  1913. make[3]: Nothing to be done for `clean'.
  1914. make[3]: Nothing to be done for `clean-am'.
  1915. Making clean in threads
  1916. make[2]: Nothing to be done for `clean'.
  1917. Making clean in url
  1918. make[2]: Nothing to be done for `clean'.
  1919. Making clean in tests
  1920. make[2]: Nothing to be done for `clean'.
  1921. make[2]: Nothing to be done for `clean-am'.
  1922. Making clean in registry
  1923. make[1]: Nothing to be done for `clean'.
  1924. Making clean in streaming
  1925. make[1]: Nothing to be done for `clean'.
  1926. Making clean in web
  1927. Making clean in api
  1928. Making clean in badges
  1929. make[3]: Nothing to be done for `clean'.
  1930. Making clean in queries
  1931. Making clean in average
  1932. make[4]: Nothing to be done for `clean'.
  1933. Making clean in des
  1934. make[4]: Nothing to be done for `clean'.
  1935. Making clean in incremental_sum
  1936. make[4]: Nothing to be done for `clean'.
  1937. Making clean in max
  1938. make[4]: Nothing to be done for `clean'.
  1939. Making clean in min
  1940. make[4]: Nothing to be done for `clean'.
  1941. Making clean in sum
  1942. make[4]: Nothing to be done for `clean'.
  1943. Making clean in median
  1944. make[4]: Nothing to be done for `clean'.
  1945. Making clean in ses
  1946. make[4]: Nothing to be done for `clean'.
  1947. Making clean in stddev
  1948. make[4]: Nothing to be done for `clean'.
  1949. make[4]: Nothing to be done for `clean-am'.
  1950. Making clean in exporters
  1951. Making clean in shell
  1952. make[4]: Nothing to be done for `clean'.
  1953. Making clean in prometheus
  1954. make[4]: Nothing to be done for `clean'.
  1955. make[4]: Nothing to be done for `clean-am'.
  1956. Making clean in formatters
  1957. Making clean in csv
  1958. make[4]: Nothing to be done for `clean'.
  1959. Making clean in json
  1960. make[4]: Nothing to be done for `clean'.
  1961. Making clean in ssv
  1962. make[4]: Nothing to be done for `clean'.
  1963. Making clean in value
  1964. make[4]: Nothing to be done for `clean'.
  1965. make[4]: Nothing to be done for `clean-am'.
  1966. Making clean in health
  1967. make[3]: Nothing to be done for `clean'.
  1968. make[3]: Nothing to be done for `clean-am'.
  1969. Making clean in gui
  1970. Making clean in dashboard
  1971. make[3]: Nothing to be done for `clean'.
  1972. test -z "version.txt " || rm -f version.txt
  1973. Making clean in server
  1974. Making clean in static
  1975. make[4]: Nothing to be done for `clean-am'.
  1976. make[3]: Nothing to be done for `clean-am'.
  1977. make[2]: Nothing to be done for `clean-am'.
  1978. Making clean in claim
  1979. test -z "netdata-claim.sh " || rm -f netdata-claim.sh
  1980. Making clean in parser
  1981. make[1]: Nothing to be done for `clean'.
  1982. Making clean in spawn
  1983. make[1]: Nothing to be done for `clean'.
  1984. Making clean in ml
  1985. Making clean in kmeans
  1986. make[2]: Nothing to be done for `clean'.
  1987. make[2]: Nothing to be done for `clean-am'.
  1988. test -z "" || rm -f
  1989. test -z "./netdata-v1.33.0-9-nightly.tar.gz aclk/aclk-schemas/proto/agent/v1/connection.pb.cc aclk/aclk-schemas/proto/agent/v1/connection.pb.h aclk/aclk-schemas/proto/nodeinstance/connection/v1/connection.pb.cc aclk/aclk-schemas/proto/nodeinstance/connection/v1/connection.pb.h aclk/aclk-schemas/proto/nodeinstance/create/v1/creation.pb.cc aclk/aclk-schemas/proto/nodeinstance/create/v1/creation.pb.h aclk/aclk-schemas/proto/chart/v1/stream.pb.cc aclk/aclk-schemas/proto/chart/v1/stream.pb.h aclk/aclk-schemas/proto/chart/v1/instance.pb.cc aclk/aclk-schemas/proto/chart/v1/instance.pb.h aclk/aclk-schemas/proto/chart/v1/dimension.pb.cc aclk/aclk-schemas/proto/chart/v1/dimension.pb.h aclk/aclk-schemas/proto/chart/v1/config.pb.cc aclk/aclk-schemas/proto/chart/v1/config.pb.h aclk/aclk-schemas/proto/aclk/v1/lib.pb.cc aclk/aclk-schemas/proto/aclk/v1/lib.pb.h aclk/aclk-schemas/proto/agent/v1/disconnect.pb.cc aclk/aclk-schemas/proto/agent/v1/disconnect.pb.h aclk/aclk-schemas/proto/alarm/v1/config.pb.cc aclk/aclk-schemas/proto/alarm/v1/config.pb.h aclk/aclk-schemas/proto/alarm/v1/stream.pb.cc aclk/aclk-schemas/proto/alarm/v1/stream.pb.h aclk/aclk-schemas/proto/nodeinstance/info/v1/info.pb.cc aclk/aclk-schemas/proto/nodeinstance/info/v1/info.pb.h " || rm -f ./netdata-v1.33.0-9-nightly.tar.gz aclk/aclk-schemas/proto/agent/v1/connection.pb.cc aclk/aclk-schemas/proto/agent/v1/connection.pb.h aclk/aclk-schemas/proto/nodeinstance/connection/v1/connection.pb.cc aclk/aclk-schemas/proto/nodeinstance/connection/v1/connection.pb.h aclk/aclk-schemas/proto/nodeinstance/create/v1/creation.pb.cc aclk/aclk-schemas/proto/nodeinstance/create/v1/creation.pb.h aclk/aclk-schemas/proto/chart/v1/stream.pb.cc aclk/aclk-schemas/proto/chart/v1/stream.pb.h aclk/aclk-schemas/proto/chart/v1/instance.pb.cc aclk/aclk-schemas/proto/chart/v1/instance.pb.h aclk/aclk-schemas/proto/chart/v1/dimension.pb.cc aclk/aclk-schemas/proto/chart/v1/dimension.pb.h aclk/aclk-schemas/proto/chart/v1/config.pb.cc aclk/aclk-schemas/proto/chart/v1/config.pb.h aclk/aclk-schemas/proto/aclk/v1/lib.pb.cc aclk/aclk-schemas/proto/aclk/v1/lib.pb.h aclk/aclk-schemas/proto/agent/v1/disconnect.pb.cc aclk/aclk-schemas/proto/agent/v1/disconnect.pb.h aclk/aclk-schemas/proto/alarm/v1/config.pb.cc aclk/aclk-schemas/proto/alarm/v1/config.pb.h aclk/aclk-schemas/proto/alarm/v1/stream.pb.cc aclk/aclk-schemas/proto/alarm/v1/stream.pb.h aclk/aclk-schemas/proto/nodeinstance/info/v1/info.pb.cc aclk/aclk-schemas/proto/nodeinstance/info/v1/info.pb.h
  1990. test -z "    cups.plugin    " || rm -f     cups.plugin    
  1991. test -z "netdata netdatacli" || rm -f netdata netdatacli
  1992. rm -f *.o
  1993. rm -f aclk/*.o
  1994. rm -f aclk/aclk-schemas/proto/aclk/v1/*.o
  1995. rm -f aclk/aclk-schemas/proto/agent/v1/*.o
  1996. rm -f aclk/aclk-schemas/proto/alarm/v1/*.o
  1997. rm -f aclk/aclk-schemas/proto/chart/v1/*.o
  1998. rm -f aclk/aclk-schemas/proto/nodeinstance/connection/v1/*.o
  1999. rm -f aclk/aclk-schemas/proto/nodeinstance/create/v1/*.o
  2000. rm -f aclk/aclk-schemas/proto/nodeinstance/info/v1/*.o
  2001. rm -f aclk/schema-wrappers/*.o
  2002. rm -f backends/*.o
  2003. rm -f backends/aws_kinesis/*.o
  2004. rm -f backends/graphite/*.o
  2005. rm -f backends/json/*.o
  2006. rm -f backends/mongodb/*.o
  2007. rm -f backends/opentsdb/*.o
  2008. rm -f backends/prometheus/*.o
  2009. rm -f backends/prometheus/remote_write/*.o
  2010. rm -f claim/*.o
  2011. rm -f cli/*.o
  2012. rm -f collectors/apps.plugin/*.o
  2013. rm -f collectors/cgroups.plugin/*.o
  2014. rm -f collectors/cgroups.plugin/tests/*.o
  2015. rm -f collectors/checks.plugin/*.o
  2016. rm -f collectors/cups.plugin/*.o
  2017. rm -f collectors/diskspace.plugin/*.o
  2018. rm -f collectors/ebpf.plugin/*.o
  2019. rm -f collectors/freebsd.plugin/*.o
  2020. rm -f collectors/freeipmi.plugin/*.o
  2021. rm -f collectors/idlejitter.plugin/*.o
  2022. rm -f collectors/macos.plugin/*.o
  2023. rm -f collectors/nfacct.plugin/*.o
  2024. rm -f collectors/perf.plugin/*.o
  2025. rm -f collectors/plugins.d/*.o
  2026. rm -f collectors/proc.plugin/*.o
  2027. rm -f collectors/slabinfo.plugin/*.o
  2028. rm -f collectors/statsd.plugin/*.o
  2029. rm -f collectors/tc.plugin/*.o
  2030. rm -f collectors/timex.plugin/*.o
  2031. rm -f collectors/xenstat.plugin/*.o
  2032. rm -f daemon/*.o
  2033. rm -f database/*.o
  2034. rm -f database/engine/*.o
  2035. rm -f database/engine/metadata_log/*.o
  2036. rm -f database/sqlite/*.o
  2037. rm -f exporting/*.o
  2038. rm -f exporting/aws_kinesis/*.o
  2039. rm -f exporting/graphite/*.o
  2040. rm -f exporting/json/*.o
  2041. rm -f exporting/mongodb/*.o
  2042. rm -f exporting/opentsdb/*.o
  2043. rm -f exporting/prometheus/*.o
  2044. rm -f exporting/prometheus/remote_write/*.o
  2045. rm -f exporting/pubsub/*.o
  2046. rm -f exporting/tests/*.o
  2047. rm -f health/*.o
  2048. rm -f libnetdata/*.o
  2049. rm -f libnetdata/adaptive_resortable_list/*.o
  2050. rm -f libnetdata/avl/*.o
  2051. rm -f libnetdata/buffer/*.o
  2052. rm -f libnetdata/circular_buffer/*.o
  2053. rm -f libnetdata/clocks/*.o
  2054. rm -f libnetdata/completion/*.o
  2055. rm -f libnetdata/config/*.o
  2056. rm -f libnetdata/dictionary/*.o
  2057. rm -f libnetdata/ebpf/*.o
  2058. rm -f libnetdata/eval/*.o
  2059. rm -f libnetdata/health/*.o
  2060. rm -f libnetdata/json/*.o
  2061. rm -f libnetdata/locks/*.o
  2062. rm -f libnetdata/log/*.o
  2063. rm -f libnetdata/popen/*.o
  2064. rm -f libnetdata/procfile/*.o
  2065. rm -f libnetdata/simple_pattern/*.o
  2066. rm -f libnetdata/socket/*.o
  2067. rm -f libnetdata/statistical/*.o
  2068. rm -f libnetdata/storage_number/*.o
  2069. rm -f libnetdata/storage_number/tests/*.o
  2070. rm -f libnetdata/tests/*.o
  2071. rm -f libnetdata/threads/*.o
  2072. rm -f libnetdata/url/*.o
  2073. rm -f ml/*.o
  2074. rm -f ml/kmeans/*.o
  2075. rm -f ml/kmeans/dlib/dlib/all/*.o
  2076. rm -f mqtt_websockets/MQTT-C/src/*.o
  2077. rm -f mqtt_websockets/c-rbuf/src/*.o
  2078. rm -f mqtt_websockets/src/*.o
  2079. rm -f parser/*.o
  2080. rm -f registry/*.o
  2081. rm -f spawn/*.o
  2082. rm -f streaming/*.o
  2083. rm -f web/api/*.o
  2084. rm -f web/api/badges/*.o
  2085. rm -f web/api/exporters/*.o
  2086. rm -f web/api/exporters/shell/*.o
  2087. rm -f web/api/formatters/*.o
  2088. rm -f web/api/formatters/csv/*.o
  2089. rm -f web/api/formatters/json/*.o
  2090. rm -f web/api/formatters/ssv/*.o
  2091. rm -f web/api/formatters/value/*.o
  2092. rm -f web/api/health/*.o
  2093. rm -f web/api/queries/*.o
  2094. rm -f web/api/queries/average/*.o
  2095. rm -f web/api/queries/des/*.o
  2096. rm -f web/api/queries/incremental_sum/*.o
  2097. rm -f web/api/queries/max/*.o
  2098. rm -f web/api/queries/median/*.o
  2099. rm -f web/api/queries/min/*.o
  2100. rm -f web/api/queries/ses/*.o
  2101. rm -f web/api/queries/stddev/*.o
  2102. rm -f web/api/queries/sum/*.o
  2103. rm -f web/api/tests/*.o
  2104. rm -f web/server/*.o
  2105. rm -f web/server/static/*.o
  2106. test -z "" || rm -f
  2107. test -z "" || rm -f
  2108. test -z "test-suite.log" || rm -f test-suite.log
  2109. OK  
  2110.  
  2111. --- Compile netdata ---
  2112. [/private/var/folders/tm/bh_rhtyj47x8b5nl3dh3cm400000gn/T/netdata-kickstart-XXXXXXXXXX.zzC0dahv/netdata-v1.33.0-9-g162f2b62b]# make -j4
  2113. /private/var/folders/tm/bh_rhtyj47x8b5nl3dh3cm400000gn/T/netdata-kickstart-XXXXXXXXXX.zzC0dahv/netdata-v1.33.0-9-g162f2b62b/externaldeps/protobuf/src/protoc -I=aclk/aclk-schemas --cpp_out=./aclk/aclk-schemas aclk/aclk-schemas/proto/agent/v1/connection.proto
  2114. /private/var/folders/tm/bh_rhtyj47x8b5nl3dh3cm400000gn/T/netdata-kickstart-XXXXXXXXXX.zzC0dahv/netdata-v1.33.0-9-g162f2b62b/externaldeps/protobuf/src/protoc -I=aclk/aclk-schemas --cpp_out=./aclk/aclk-schemas aclk/aclk-schemas/proto/agent/v1/connection.proto
  2115. /private/var/folders/tm/bh_rhtyj47x8b5nl3dh3cm400000gn/T/netdata-kickstart-XXXXXXXXXX.zzC0dahv/netdata-v1.33.0-9-g162f2b62b/externaldeps/protobuf/src/protoc -I=aclk/aclk-schemas --cpp_out=./aclk/aclk-schemas aclk/aclk-schemas/proto/nodeinstance/connection/v1/connection.proto
  2116. /private/var/folders/tm/bh_rhtyj47x8b5nl3dh3cm400000gn/T/netdata-kickstart-XXXXXXXXXX.zzC0dahv/netdata-v1.33.0-9-g162f2b62b/externaldeps/protobuf/src/protoc -I=aclk/aclk-schemas --cpp_out=./aclk/aclk-schemas aclk/aclk-schemas/proto/nodeinstance/connection/v1/connection.proto
  2117. /private/var/folders/tm/bh_rhtyj47x8b5nl3dh3cm400000gn/T/netdata-kickstart-XXXXXXXXXX.zzC0dahv/netdata-v1.33.0-9-g162f2b62b/externaldeps/protobuf/src/protoc -I=aclk/aclk-schemas --cpp_out=./aclk/aclk-schemas aclk/aclk-schemas/proto/nodeinstance/create/v1/creation.proto
  2118. /private/var/folders/tm/bh_rhtyj47x8b5nl3dh3cm400000gn/T/netdata-kickstart-XXXXXXXXXX.zzC0dahv/netdata-v1.33.0-9-g162f2b62b/externaldeps/protobuf/src/protoc -I=aclk/aclk-schemas --cpp_out=./aclk/aclk-schemas aclk/aclk-schemas/proto/nodeinstance/create/v1/creation.proto
  2119. /private/var/folders/tm/bh_rhtyj47x8b5nl3dh3cm400000gn/T/netdata-kickstart-XXXXXXXXXX.zzC0dahv/netdata-v1.33.0-9-g162f2b62b/externaldeps/protobuf/src/protoc -I=aclk/aclk-schemas --cpp_out=./aclk/aclk-schemas aclk/aclk-schemas/proto/chart/v1/stream.proto
  2120. /private/var/folders/tm/bh_rhtyj47x8b5nl3dh3cm400000gn/T/netdata-kickstart-XXXXXXXXXX.zzC0dahv/netdata-v1.33.0-9-g162f2b62b/externaldeps/protobuf/src/protoc -I=aclk/aclk-schemas --cpp_out=./aclk/aclk-schemas aclk/aclk-schemas/proto/chart/v1/stream.proto
  2121. /private/var/folders/tm/bh_rhtyj47x8b5nl3dh3cm400000gn/T/netdata-kickstart-XXXXXXXXXX.zzC0dahv/netdata-v1.33.0-9-g162f2b62b/externaldeps/protobuf/src/protoc -I=aclk/aclk-schemas --cpp_out=./aclk/aclk-schemas aclk/aclk-schemas/proto/chart/v1/instance.proto
  2122. /private/var/folders/tm/bh_rhtyj47x8b5nl3dh3cm400000gn/T/netdata-kickstart-XXXXXXXXXX.zzC0dahv/netdata-v1.33.0-9-g162f2b62b/externaldeps/protobuf/src/protoc -I=aclk/aclk-schemas --cpp_out=./aclk/aclk-schemas aclk/aclk-schemas/proto/chart/v1/instance.proto
  2123. /private/var/folders/tm/bh_rhtyj47x8b5nl3dh3cm400000gn/T/netdata-kickstart-XXXXXXXXXX.zzC0dahv/netdata-v1.33.0-9-g162f2b62b/externaldeps/protobuf/src/protoc -I=aclk/aclk-schemas --cpp_out=./aclk/aclk-schemas aclk/aclk-schemas/proto/chart/v1/dimension.proto
  2124. /private/var/folders/tm/bh_rhtyj47x8b5nl3dh3cm400000gn/T/netdata-kickstart-XXXXXXXXXX.zzC0dahv/netdata-v1.33.0-9-g162f2b62b/externaldeps/protobuf/src/protoc -I=aclk/aclk-schemas --cpp_out=./aclk/aclk-schemas aclk/aclk-schemas/proto/chart/v1/dimension.proto
  2125. /private/var/folders/tm/bh_rhtyj47x8b5nl3dh3cm400000gn/T/netdata-kickstart-XXXXXXXXXX.zzC0dahv/netdata-v1.33.0-9-g162f2b62b/externaldeps/protobuf/src/protoc -I=aclk/aclk-schemas --cpp_out=./aclk/aclk-schemas aclk/aclk-schemas/proto/chart/v1/config.proto
  2126. /private/var/folders/tm/bh_rhtyj47x8b5nl3dh3cm400000gn/T/netdata-kickstart-XXXXXXXXXX.zzC0dahv/netdata-v1.33.0-9-g162f2b62b/externaldeps/protobuf/src/protoc -I=aclk/aclk-schemas --cpp_out=./aclk/aclk-schemas aclk/aclk-schemas/proto/chart/v1/config.proto
  2127. /private/var/folders/tm/bh_rhtyj47x8b5nl3dh3cm400000gn/T/netdata-kickstart-XXXXXXXXXX.zzC0dahv/netdata-v1.33.0-9-g162f2b62b/externaldeps/protobuf/src/protoc -I=aclk/aclk-schemas --cpp_out=./aclk/aclk-schemas aclk/aclk-schemas/proto/aclk/v1/lib.proto
  2128. /private/var/folders/tm/bh_rhtyj47x8b5nl3dh3cm400000gn/T/netdata-kickstart-XXXXXXXXXX.zzC0dahv/netdata-v1.33.0-9-g162f2b62b/externaldeps/protobuf/src/protoc -I=aclk/aclk-schemas --cpp_out=./aclk/aclk-schemas aclk/aclk-schemas/proto/aclk/v1/lib.proto
  2129. /private/var/folders/tm/bh_rhtyj47x8b5nl3dh3cm400000gn/T/netdata-kickstart-XXXXXXXXXX.zzC0dahv/netdata-v1.33.0-9-g162f2b62b/externaldeps/protobuf/src/protoc -I=aclk/aclk-schemas --cpp_out=./aclk/aclk-schemas aclk/aclk-schemas/proto/agent/v1/disconnect.proto
  2130. /private/var/folders/tm/bh_rhtyj47x8b5nl3dh3cm400000gn/T/netdata-kickstart-XXXXXXXXXX.zzC0dahv/netdata-v1.33.0-9-g162f2b62b/externaldeps/protobuf/src/protoc -I=aclk/aclk-schemas --cpp_out=./aclk/aclk-schemas aclk/aclk-schemas/proto/agent/v1/disconnect.proto
  2131. /private/var/folders/tm/bh_rhtyj47x8b5nl3dh3cm400000gn/T/netdata-kickstart-XXXXXXXXXX.zzC0dahv/netdata-v1.33.0-9-g162f2b62b/externaldeps/protobuf/src/protoc -I=aclk/aclk-schemas --cpp_out=./aclk/aclk-schemas aclk/aclk-schemas/proto/alarm/v1/config.proto
  2132. /private/var/folders/tm/bh_rhtyj47x8b5nl3dh3cm400000gn/T/netdata-kickstart-XXXXXXXXXX.zzC0dahv/netdata-v1.33.0-9-g162f2b62b/externaldeps/protobuf/src/protoc -I=aclk/aclk-schemas --cpp_out=./aclk/aclk-schemas aclk/aclk-schemas/proto/alarm/v1/config.proto
  2133. /private/var/folders/tm/bh_rhtyj47x8b5nl3dh3cm400000gn/T/netdata-kickstart-XXXXXXXXXX.zzC0dahv/netdata-v1.33.0-9-g162f2b62b/externaldeps/protobuf/src/protoc -I=aclk/aclk-schemas --cpp_out=./aclk/aclk-schemas aclk/aclk-schemas/proto/alarm/v1/stream.proto
  2134. /private/var/folders/tm/bh_rhtyj47x8b5nl3dh3cm400000gn/T/netdata-kickstart-XXXXXXXXXX.zzC0dahv/netdata-v1.33.0-9-g162f2b62b/externaldeps/protobuf/src/protoc -I=aclk/aclk-schemas --cpp_out=./aclk/aclk-schemas aclk/aclk-schemas/proto/alarm/v1/stream.proto
  2135. /private/var/folders/tm/bh_rhtyj47x8b5nl3dh3cm400000gn/T/netdata-kickstart-XXXXXXXXXX.zzC0dahv/netdata-v1.33.0-9-g162f2b62b/externaldeps/protobuf/src/protoc -I=aclk/aclk-schemas --cpp_out=./aclk/aclk-schemas aclk/aclk-schemas/proto/nodeinstance/info/v1/info.proto
  2136. /private/var/folders/tm/bh_rhtyj47x8b5nl3dh3cm400000gn/T/netdata-kickstart-XXXXXXXXXX.zzC0dahv/netdata-v1.33.0-9-g162f2b62b/externaldeps/protobuf/src/protoc -I=aclk/aclk-schemas --cpp_out=./aclk/aclk-schemas aclk/aclk-schemas/proto/nodeinstance/info/v1/info.proto
  2137. /Applications/Xcode.app/Contents/Developer/usr/bin/make  all-recursive
  2138. Making all in diagrams
  2139. make[2]: Nothing to be done for `all'.
  2140. Making all in system
  2141. if sed \
  2142.         -e 's#[@]localstatedir_POST@#/usr/local/netdata/var#g' \
  2143.         -e 's#[@]sbindir_POST@#/usr/local/netdata/usr/sbin#g' \
  2144.         -e 's#[@]pluginsdir_POST@#/usr/local/netdata/usr/libexec/netdata/plugins.d#g' \
  2145.         -e 's#[@]configdir_POST@#/usr/local/netdata/etc/netdata#g' \
  2146.         -e 's#[@]libconfigdir_POST@#/usr/local/netdata/usr/lib/netdata/conf.d#g' \
  2147.         -e 's#[@]pkglibexecdir_POST@#/usr/local/netdata/usr/libexec/netdata#g' \
  2148.         -e 's#[@]cachedir_POST@#/usr/local/netdata/var/cache/netdata#g' \
  2149.         -e 's#[@]registrydir_POST@#/usr/local/netdata/var/lib/netdata/registry#g' \
  2150.         -e 's#[@]varlibdir_POST@#/usr/local/netdata/var/lib/netdata#g' \
  2151.         -e 's#[@]webdir_POST@#/usr/local/netdata/usr/share/netdata/web#g' \
  2152.         -e 's#[@]enable_aclk_POST@#yes#g' \
  2153.         -e 's#[@]enable_cloud_POST@#yes#g' \
  2154.         edit-config.in > edit-config.tmp; then \
  2155.         mv "edit-config.tmp" "edit-config"; \
  2156.     else \
  2157.         rm -f "edit-config.tmp"; \
  2158.         false; \
  2159.     fi
  2160. if sed \
  2161.         -e 's#[@]localstatedir_POST@#/usr/local/netdata/var#g' \
  2162.         -e 's#[@]sbindir_POST@#/usr/local/netdata/usr/sbin#g' \
  2163.         -e 's#[@]pluginsdir_POST@#/usr/local/netdata/usr/libexec/netdata/plugins.d#g' \
  2164.         -e 's#[@]configdir_POST@#/usr/local/netdata/etc/netdata#g' \
  2165.         -e 's#[@]libconfigdir_POST@#/usr/local/netdata/usr/lib/netdata/conf.d#g' \
  2166.         -e 's#[@]pkglibexecdir_POST@#/usr/local/netdata/usr/libexec/netdata#g' \
  2167.         -e 's#[@]cachedir_POST@#/usr/local/netdata/var/cache/netdata#g' \
  2168.         -e 's#[@]registrydir_POST@#/usr/local/netdata/var/lib/netdata/registry#g' \
  2169.         -e 's#[@]varlibdir_POST@#/usr/local/netdata/var/lib/netdata#g' \
  2170.         -e 's#[@]webdir_POST@#/usr/local/netdata/usr/share/netdata/web#g' \
  2171.         -e 's#[@]enable_aclk_POST@#yes#g' \
  2172.         -e 's#[@]enable_cloud_POST@#yes#g' \
  2173.         netdata-openrc.in > netdata-openrc.tmp; then \
  2174.         mv "netdata-openrc.tmp" "netdata-openrc"; \
  2175.     else \
  2176.         rm -f "netdata-openrc.tmp"; \
  2177.         false; \
  2178.     fi
  2179. if sed \
  2180.         -e 's#[@]localstatedir_POST@#/usr/local/netdata/var#g' \
  2181.         -e 's#[@]sbindir_POST@#/usr/local/netdata/usr/sbin#g' \
  2182.         -e 's#[@]pluginsdir_POST@#/usr/local/netdata/usr/libexec/netdata/plugins.d#g' \
  2183.         -e 's#[@]configdir_POST@#/usr/local/netdata/etc/netdata#g' \
  2184.         -e 's#[@]libconfigdir_POST@#/usr/local/netdata/usr/lib/netdata/conf.d#g' \
  2185.         -e 's#[@]pkglibexecdir_POST@#/usr/local/netdata/usr/libexec/netdata#g' \
  2186.         -e 's#[@]cachedir_POST@#/usr/local/netdata/var/cache/netdata#g' \
  2187.         -e 's#[@]registrydir_POST@#/usr/local/netdata/var/lib/netdata/registry#g' \
  2188.         -e 's#[@]varlibdir_POST@#/usr/local/netdata/var/lib/netdata#g' \
  2189.         -e 's#[@]webdir_POST@#/usr/local/netdata/usr/share/netdata/web#g' \
  2190.         -e 's#[@]enable_aclk_POST@#yes#g' \
  2191.         -e 's#[@]enable_cloud_POST@#yes#g' \
  2192.         netdata.logrotate.in > netdata.logrotate.tmp; then \
  2193.         mv "netdata.logrotate.tmp" "netdata.logrotate"; \
  2194.     else \
  2195.         rm -f "netdata.logrotate.tmp"; \
  2196.         false; \
  2197.     fi
  2198. if sed \
  2199.         -e 's#[@]localstatedir_POST@#/usr/local/netdata/var#g' \
  2200.         -e 's#[@]sbindir_POST@#/usr/local/netdata/usr/sbin#g' \
  2201.         -e 's#[@]pluginsdir_POST@#/usr/local/netdata/usr/libexec/netdata/plugins.d#g' \
  2202.         -e 's#[@]configdir_POST@#/usr/local/netdata/etc/netdata#g' \
  2203.         -e 's#[@]libconfigdir_POST@#/usr/local/netdata/usr/lib/netdata/conf.d#g' \
  2204.         -e 's#[@]pkglibexecdir_POST@#/usr/local/netdata/usr/libexec/netdata#g' \
  2205.         -e 's#[@]cachedir_POST@#/usr/local/netdata/var/cache/netdata#g' \
  2206.         -e 's#[@]registrydir_POST@#/usr/local/netdata/var/lib/netdata/registry#g' \
  2207.         -e 's#[@]varlibdir_POST@#/usr/local/netdata/var/lib/netdata#g' \
  2208.         -e 's#[@]webdir_POST@#/usr/local/netdata/usr/share/netdata/web#g' \
  2209.         -e 's#[@]enable_aclk_POST@#yes#g' \
  2210.         -e 's#[@]enable_cloud_POST@#yes#g' \
  2211.         netdata.service.in > netdata.service.tmp; then \
  2212.         mv "netdata.service.tmp" "netdata.service"; \
  2213.     else \
  2214.         rm -f "netdata.service.tmp"; \
  2215.         false; \
  2216.     fi
  2217. if sed \
  2218.         -e 's#[@]localstatedir_POST@#/usr/local/netdata/var#g' \
  2219.         -e 's#[@]sbindir_POST@#/usr/local/netdata/usr/sbin#g' \
  2220.         -e 's#[@]pluginsdir_POST@#/usr/local/netdata/usr/libexec/netdata/plugins.d#g' \
  2221.         -e 's#[@]configdir_POST@#/usr/local/netdata/etc/netdata#g' \
  2222.         -e 's#[@]libconfigdir_POST@#/usr/local/netdata/usr/lib/netdata/conf.d#g' \
  2223.         -e 's#[@]pkglibexecdir_POST@#/usr/local/netdata/usr/libexec/netdata#g' \
  2224.         -e 's#[@]cachedir_POST@#/usr/local/netdata/var/cache/netdata#g' \
  2225.         -e 's#[@]registrydir_POST@#/usr/local/netdata/var/lib/netdata/registry#g' \
  2226.         -e 's#[@]varlibdir_POST@#/usr/local/netdata/var/lib/netdata#g' \
  2227.         -e 's#[@]webdir_POST@#/usr/local/netdata/usr/share/netdata/web#g' \
  2228.         -e 's#[@]enable_aclk_POST@#yes#g' \
  2229.         -e 's#[@]enable_cloud_POST@#yes#g' \
  2230.         netdata.service.v235.in > netdata.service.v235.tmp; then \
  2231.         mv "netdata.service.v235.tmp" "netdata.service.v235"; \
  2232.     else \
  2233.         rm -f "netdata.service.v235.tmp"; \
  2234.         false; \
  2235.     fi
  2236. if sed \
  2237.         -e 's#[@]localstatedir_POST@#/usr/local/netdata/var#g' \
  2238.         -e 's#[@]sbindir_POST@#/usr/local/netdata/usr/sbin#g' \
  2239.         -e 's#[@]pluginsdir_POST@#/usr/local/netdata/usr/libexec/netdata/plugins.d#g' \
  2240.         -e 's#[@]configdir_POST@#/usr/local/netdata/etc/netdata#g' \
  2241.         -e 's#[@]libconfigdir_POST@#/usr/local/netdata/usr/lib/netdata/conf.d#g' \
  2242.         -e 's#[@]pkglibexecdir_POST@#/usr/local/netdata/usr/libexec/netdata#g' \
  2243.         -e 's#[@]cachedir_POST@#/usr/local/netdata/var/cache/netdata#g' \
  2244.         -e 's#[@]registrydir_POST@#/usr/local/netdata/var/lib/netdata/registry#g' \
  2245.         -e 's#[@]varlibdir_POST@#/usr/local/netdata/var/lib/netdata#g' \
  2246.         -e 's#[@]webdir_POST@#/usr/local/netdata/usr/share/netdata/web#g' \
  2247.         -e 's#[@]enable_aclk_POST@#yes#g' \
  2248.         -e 's#[@]enable_cloud_POST@#yes#g' \
  2249.         netdata-init-d.in > netdata-init-d.tmp; then \
  2250.         mv "netdata-init-d.tmp" "netdata-init-d"; \
  2251.     else \
  2252.         rm -f "netdata-init-d.tmp"; \
  2253.         false; \
  2254.     fi
  2255. if sed \
  2256.         -e 's#[@]localstatedir_POST@#/usr/local/netdata/var#g' \
  2257.         -e 's#[@]sbindir_POST@#/usr/local/netdata/usr/sbin#g' \
  2258.         -e 's#[@]pluginsdir_POST@#/usr/local/netdata/usr/libexec/netdata/plugins.d#g' \
  2259.         -e 's#[@]configdir_POST@#/usr/local/netdata/etc/netdata#g' \
  2260.         -e 's#[@]libconfigdir_POST@#/usr/local/netdata/usr/lib/netdata/conf.d#g' \
  2261.         -e 's#[@]pkglibexecdir_POST@#/usr/local/netdata/usr/libexec/netdata#g' \
  2262.         -e 's#[@]cachedir_POST@#/usr/local/netdata/var/cache/netdata#g' \
  2263.         -e 's#[@]registrydir_POST@#/usr/local/netdata/var/lib/netdata/registry#g' \
  2264.         -e 's#[@]varlibdir_POST@#/usr/local/netdata/var/lib/netdata#g' \
  2265.         -e 's#[@]webdir_POST@#/usr/local/netdata/usr/share/netdata/web#g' \
  2266.         -e 's#[@]enable_aclk_POST@#yes#g' \
  2267.         -e 's#[@]enable_cloud_POST@#yes#g' \
  2268.         netdata-lsb.in > netdata-lsb.tmp; then \
  2269.         mv "netdata-lsb.tmp" "netdata-lsb"; \
  2270.     else \
  2271.         rm -f "netdata-lsb.tmp"; \
  2272.         false; \
  2273.     fi
  2274. if sed \
  2275.         -e 's#[@]localstatedir_POST@#/usr/local/netdata/var#g' \
  2276.         -e 's#[@]sbindir_POST@#/usr/local/netdata/usr/sbin#g' \
  2277.         -e 's#[@]pluginsdir_POST@#/usr/local/netdata/usr/libexec/netdata/plugins.d#g' \
  2278.         -e 's#[@]configdir_POST@#/usr/local/netdata/etc/netdata#g' \
  2279.         -e 's#[@]libconfigdir_POST@#/usr/local/netdata/usr/lib/netdata/conf.d#g' \
  2280.         -e 's#[@]pkglibexecdir_POST@#/usr/local/netdata/usr/libexec/netdata#g' \
  2281.         -e 's#[@]cachedir_POST@#/usr/local/netdata/var/cache/netdata#g' \
  2282.         -e 's#[@]registrydir_POST@#/usr/local/netdata/var/lib/netdata/registry#g' \
  2283.         -e 's#[@]varlibdir_POST@#/usr/local/netdata/var/lib/netdata#g' \
  2284.         -e 's#[@]webdir_POST@#/usr/local/netdata/usr/share/netdata/web#g' \
  2285.         -e 's#[@]enable_aclk_POST@#yes#g' \
  2286.         -e 's#[@]enable_cloud_POST@#yes#g' \
  2287.         netdata-freebsd.in > netdata-freebsd.tmp; then \
  2288.         mv "netdata-freebsd.tmp" "netdata-freebsd"; \
  2289.     else \
  2290.         rm -f "netdata-freebsd.tmp"; \
  2291.         false; \
  2292.     fi
  2293. if sed \
  2294.         -e 's#[@]localstatedir_POST@#/usr/local/netdata/var#g' \
  2295.         -e 's#[@]sbindir_POST@#/usr/local/netdata/usr/sbin#g' \
  2296.         -e 's#[@]pluginsdir_POST@#/usr/local/netdata/usr/libexec/netdata/plugins.d#g' \
  2297.         -e 's#[@]configdir_POST@#/usr/local/netdata/etc/netdata#g' \
  2298.         -e 's#[@]libconfigdir_POST@#/usr/local/netdata/usr/lib/netdata/conf.d#g' \
  2299.         -e 's#[@]pkglibexecdir_POST@#/usr/local/netdata/usr/libexec/netdata#g' \
  2300.         -e 's#[@]cachedir_POST@#/usr/local/netdata/var/cache/netdata#g' \
  2301.         -e 's#[@]registrydir_POST@#/usr/local/netdata/var/lib/netdata/registry#g' \
  2302.         -e 's#[@]varlibdir_POST@#/usr/local/netdata/var/lib/netdata#g' \
  2303.         -e 's#[@]webdir_POST@#/usr/local/netdata/usr/share/netdata/web#g' \
  2304.         -e 's#[@]enable_aclk_POST@#yes#g' \
  2305.         -e 's#[@]enable_cloud_POST@#yes#g' \
  2306.         netdata.plist.in > netdata.plist.tmp; then \
  2307.         mv "netdata.plist.tmp" "netdata.plist"; \
  2308.     else \
  2309.         rm -f "netdata.plist.tmp"; \
  2310.         false; \
  2311.     fi
  2312. if sed \
  2313.         -e 's#[@]localstatedir_POST@#/usr/local/netdata/var#g' \
  2314.         -e 's#[@]sbindir_POST@#/usr/local/netdata/usr/sbin#g' \
  2315.         -e 's#[@]pluginsdir_POST@#/usr/local/netdata/usr/libexec/netdata/plugins.d#g' \
  2316.         -e 's#[@]configdir_POST@#/usr/local/netdata/etc/netdata#g' \
  2317.         -e 's#[@]libconfigdir_POST@#/usr/local/netdata/usr/lib/netdata/conf.d#g' \
  2318.         -e 's#[@]pkglibexecdir_POST@#/usr/local/netdata/usr/libexec/netdata#g' \
  2319.         -e 's#[@]cachedir_POST@#/usr/local/netdata/var/cache/netdata#g' \
  2320.         -e 's#[@]registrydir_POST@#/usr/local/netdata/var/lib/netdata/registry#g' \
  2321.         -e 's#[@]varlibdir_POST@#/usr/local/netdata/var/lib/netdata#g' \
  2322.         -e 's#[@]webdir_POST@#/usr/local/netdata/usr/share/netdata/web#g' \
  2323.         -e 's#[@]enable_aclk_POST@#yes#g' \
  2324.         -e 's#[@]enable_cloud_POST@#yes#g' \
  2325.         netdata.crontab.in > netdata.crontab.tmp; then \
  2326.         mv "netdata.crontab.tmp" "netdata.crontab"; \
  2327.     else \
  2328.         rm -f "netdata.crontab.tmp"; \
  2329.         false; \
  2330.     fi
  2331. if sed \
  2332.         -e 's#[@]localstatedir_POST@#/usr/local/netdata/var#g' \
  2333.         -e 's#[@]sbindir_POST@#/usr/local/netdata/usr/sbin#g' \
  2334.         -e 's#[@]pluginsdir_POST@#/usr/local/netdata/usr/libexec/netdata/plugins.d#g' \
  2335.         -e 's#[@]configdir_POST@#/usr/local/netdata/etc/netdata#g' \
  2336.         -e 's#[@]libconfigdir_POST@#/usr/local/netdata/usr/lib/netdata/conf.d#g' \
  2337.         -e 's#[@]pkglibexecdir_POST@#/usr/local/netdata/usr/libexec/netdata#g' \
  2338.         -e 's#[@]cachedir_POST@#/usr/local/netdata/var/cache/netdata#g' \
  2339.         -e 's#[@]registrydir_POST@#/usr/local/netdata/var/lib/netdata/registry#g' \
  2340.         -e 's#[@]varlibdir_POST@#/usr/local/netdata/var/lib/netdata#g' \
  2341.         -e 's#[@]webdir_POST@#/usr/local/netdata/usr/share/netdata/web#g' \
  2342.         -e 's#[@]enable_aclk_POST@#yes#g' \
  2343.         -e 's#[@]enable_cloud_POST@#yes#g' \
  2344.         netdata-updater.service.in > netdata-updater.service.tmp; then \
  2345.         mv "netdata-updater.service.tmp" "netdata-updater.service"; \
  2346.     else \
  2347.         rm -f "netdata-updater.service.tmp"; \
  2348.         false; \
  2349.     fi
  2350. Making all in tests
  2351. if sed \
  2352.         -e 's#[@]localstatedir_POST@#/usr/local/netdata/var#g' \
  2353.         -e 's#[@]sbindir_POST@#/usr/local/netdata/usr/sbin#g' \
  2354.         -e 's#[@]pluginsdir_POST@#/usr/local/netdata/usr/libexec/netdata/plugins.d#g' \
  2355.         -e 's#[@]configdir_POST@#/usr/local/netdata/etc/netdata#g' \
  2356.         -e 's#[@]libconfigdir_POST@#/usr/local/netdata/usr/lib/netdata/conf.d#g' \
  2357.         -e 's#[@]pkglibexecdir_POST@#/usr/local/netdata/usr/libexec/netdata#g' \
  2358.         -e 's#[@]cachedir_POST@#/usr/local/netdata/var/cache/netdata#g' \
  2359.         -e 's#[@]registrydir_POST@#/usr/local/netdata/var/lib/netdata/registry#g' \
  2360.         -e 's#[@]varlibdir_POST@#/usr/local/netdata/var/lib/netdata#g' \
  2361.         -e 's#[@]webdir_POST@#/usr/local/netdata/usr/share/netdata/web#g' \
  2362.         -e 's#[@]enable_aclk_POST@#yes#g' \
  2363.         -e 's#[@]enable_cloud_POST@#yes#g' \
  2364.         health_mgmtapi/health-cmdapi-test.sh.in > health_mgmtapi/health-cmdapi-test.sh.tmp; then \
  2365.         mv "health_mgmtapi/health-cmdapi-test.sh.tmp" "health_mgmtapi/health-cmdapi-test.sh"; \
  2366.     else \
  2367.         rm -f "health_mgmtapi/health-cmdapi-test.sh.tmp"; \
  2368.         false; \
  2369.     fi
  2370. if sed \
  2371.         -e 's#[@]localstatedir_POST@#/usr/local/netdata/var#g' \
  2372.         -e 's#[@]sbindir_POST@#/usr/local/netdata/usr/sbin#g' \
  2373.         -e 's#[@]pluginsdir_POST@#/usr/local/netdata/usr/libexec/netdata/plugins.d#g' \
  2374.         -e 's#[@]configdir_POST@#/usr/local/netdata/etc/netdata#g' \
  2375.         -e 's#[@]libconfigdir_POST@#/usr/local/netdata/usr/lib/netdata/conf.d#g' \
  2376.         -e 's#[@]pkglibexecdir_POST@#/usr/local/netdata/usr/libexec/netdata#g' \
  2377.         -e 's#[@]cachedir_POST@#/usr/local/netdata/var/cache/netdata#g' \
  2378.         -e 's#[@]registrydir_POST@#/usr/local/netdata/var/lib/netdata/registry#g' \
  2379.         -e 's#[@]varlibdir_POST@#/usr/local/netdata/var/lib/netdata#g' \
  2380.         -e 's#[@]webdir_POST@#/usr/local/netdata/usr/share/netdata/web#g' \
  2381.         -e 's#[@]enable_aclk_POST@#yes#g' \
  2382.         -e 's#[@]enable_cloud_POST@#yes#g' \
  2383.         acls/acl.sh.in > acls/acl.sh.tmp; then \
  2384.         mv "acls/acl.sh.tmp" "acls/acl.sh"; \
  2385.     else \
  2386.         rm -f "acls/acl.sh.tmp"; \
  2387.         false; \
  2388.     fi
  2389. if sed \
  2390.         -e 's#[@]localstatedir_POST@#/usr/local/netdata/var#g' \
  2391.         -e 's#[@]sbindir_POST@#/usr/local/netdata/usr/sbin#g' \
  2392.         -e 's#[@]pluginsdir_POST@#/usr/local/netdata/usr/libexec/netdata/plugins.d#g' \
  2393.         -e 's#[@]configdir_POST@#/usr/local/netdata/etc/netdata#g' \
  2394.         -e 's#[@]libconfigdir_POST@#/usr/local/netdata/usr/lib/netdata/conf.d#g' \
  2395.         -e 's#[@]pkglibexecdir_POST@#/usr/local/netdata/usr/libexec/netdata#g' \
  2396.         -e 's#[@]cachedir_POST@#/usr/local/netdata/var/cache/netdata#g' \
  2397.         -e 's#[@]registrydir_POST@#/usr/local/netdata/var/lib/netdata/registry#g' \
  2398.         -e 's#[@]varlibdir_POST@#/usr/local/netdata/var/lib/netdata#g' \
  2399.         -e 's#[@]webdir_POST@#/usr/local/netdata/usr/share/netdata/web#g' \
  2400.         -e 's#[@]enable_aclk_POST@#yes#g' \
  2401.         -e 's#[@]enable_cloud_POST@#yes#g' \
  2402.         urls/request.sh.in > urls/request.sh.tmp; then \
  2403.         mv "urls/request.sh.tmp" "urls/request.sh"; \
  2404.     else \
  2405.         rm -f "urls/request.sh.tmp"; \
  2406.         false; \
  2407.     fi
  2408. if sed \
  2409.         -e 's#[@]localstatedir_POST@#/usr/local/netdata/var#g' \
  2410.         -e 's#[@]sbindir_POST@#/usr/local/netdata/usr/sbin#g' \
  2411.         -e 's#[@]pluginsdir_POST@#/usr/local/netdata/usr/libexec/netdata/plugins.d#g' \
  2412.         -e 's#[@]configdir_POST@#/usr/local/netdata/etc/netdata#g' \
  2413.         -e 's#[@]libconfigdir_POST@#/usr/local/netdata/usr/lib/netdata/conf.d#g' \
  2414.         -e 's#[@]pkglibexecdir_POST@#/usr/local/netdata/usr/libexec/netdata#g' \
  2415.         -e 's#[@]cachedir_POST@#/usr/local/netdata/var/cache/netdata#g' \
  2416.         -e 's#[@]registrydir_POST@#/usr/local/netdata/var/lib/netdata/registry#g' \
  2417.         -e 's#[@]varlibdir_POST@#/usr/local/netdata/var/lib/netdata#g' \
  2418.         -e 's#[@]webdir_POST@#/usr/local/netdata/usr/share/netdata/web#g' \
  2419.         -e 's#[@]enable_aclk_POST@#yes#g' \
  2420.         -e 's#[@]enable_cloud_POST@#yes#g' \
  2421.         alarm_repetition/alarm.sh.in > alarm_repetition/alarm.sh.tmp; then \
  2422.         mv "alarm_repetition/alarm.sh.tmp" "alarm_repetition/alarm.sh"; \
  2423.     else \
  2424.         rm -f "alarm_repetition/alarm.sh.tmp"; \
  2425.         false; \
  2426.     fi
  2427. if sed \
  2428.         -e 's#[@]localstatedir_POST@#/usr/local/netdata/var#g' \
  2429.         -e 's#[@]sbindir_POST@#/usr/local/netdata/usr/sbin#g' \
  2430.         -e 's#[@]pluginsdir_POST@#/usr/local/netdata/usr/libexec/netdata/plugins.d#g' \
  2431.         -e 's#[@]configdir_POST@#/usr/local/netdata/etc/netdata#g' \
  2432.         -e 's#[@]libconfigdir_POST@#/usr/local/netdata/usr/lib/netdata/conf.d#g' \
  2433.         -e 's#[@]pkglibexecdir_POST@#/usr/local/netdata/usr/libexec/netdata#g' \
  2434.         -e 's#[@]cachedir_POST@#/usr/local/netdata/var/cache/netdata#g' \
  2435.         -e 's#[@]registrydir_POST@#/usr/local/netdata/var/lib/netdata/registry#g' \
  2436.         -e 's#[@]varlibdir_POST@#/usr/local/netdata/var/lib/netdata#g' \
  2437.         -e 's#[@]webdir_POST@#/usr/local/netdata/usr/share/netdata/web#g' \
  2438.         -e 's#[@]enable_aclk_POST@#yes#g' \
  2439.         -e 's#[@]enable_cloud_POST@#yes#g' \
  2440.         template_dimension/template_dim.sh.in > template_dimension/template_dim.sh.tmp; then \
  2441.         mv "template_dimension/template_dim.sh.tmp" "template_dimension/template_dim.sh"; \
  2442.     else \
  2443.         rm -f "template_dimension/template_dim.sh.tmp"; \
  2444.         false; \
  2445.     fi
  2446. Making all in backends
  2447. Making all in graphite
  2448. make[3]: Nothing to be done for `all'.
  2449. Making all in json
  2450. make[3]: Nothing to be done for `all'.
  2451. Making all in opentsdb
  2452. make[3]: Nothing to be done for `all'.
  2453. Making all in prometheus
  2454. Making all in remote_write
  2455. make[4]: Nothing to be done for `all'.
  2456. make[4]: Nothing to be done for `all-am'.
  2457. Making all in aws_kinesis
  2458. make[3]: Nothing to be done for `all'.
  2459. Making all in mongodb
  2460. make[3]: Nothing to be done for `all'.
  2461. make[3]: Nothing to be done for `all-am'.
  2462. Making all in collectors
  2463. Making all in plugins.d
  2464. make[4]: Nothing to be done for `all-am'.
  2465. Making all in apps.plugin
  2466. make[3]: Nothing to be done for `all'.
  2467. Making all in cgroups.plugin
  2468. if sed \
  2469.         -e 's#[@]localstatedir_POST@#/usr/local/netdata/var#g' \
  2470.         -e 's#[@]sbindir_POST@#/usr/local/netdata/usr/sbin#g' \
  2471.         -e 's#[@]pluginsdir_POST@#/usr/local/netdata/usr/libexec/netdata/plugins.d#g' \
  2472.         -e 's#[@]configdir_POST@#/usr/local/netdata/etc/netdata#g' \
  2473.         -e 's#[@]libconfigdir_POST@#/usr/local/netdata/usr/lib/netdata/conf.d#g' \
  2474.         -e 's#[@]pkglibexecdir_POST@#/usr/local/netdata/usr/libexec/netdata#g' \
  2475.         -e 's#[@]cachedir_POST@#/usr/local/netdata/var/cache/netdata#g' \
  2476.         -e 's#[@]registrydir_POST@#/usr/local/netdata/var/lib/netdata/registry#g' \
  2477.         -e 's#[@]varlibdir_POST@#/usr/local/netdata/var/lib/netdata#g' \
  2478.         -e 's#[@]webdir_POST@#/usr/local/netdata/usr/share/netdata/web#g' \
  2479.         -e 's#[@]enable_aclk_POST@#yes#g' \
  2480.         -e 's#[@]enable_cloud_POST@#yes#g' \
  2481.         cgroup-name.sh.in > cgroup-name.sh.tmp; then \
  2482.         mv "cgroup-name.sh.tmp" "cgroup-name.sh"; \
  2483.     else \
  2484.         rm -f "cgroup-name.sh.tmp"; \
  2485.         false; \
  2486.     fi
  2487. Making all in charts.d.plugin
  2488. if sed \
  2489.         -e 's#[@]localstatedir_POST@#/usr/local/netdata/var#g' \
  2490.         -e 's#[@]sbindir_POST@#/usr/local/netdata/usr/sbin#g' \
  2491.         -e 's#[@]pluginsdir_POST@#/usr/local/netdata/usr/libexec/netdata/plugins.d#g' \
  2492.         -e 's#[@]configdir_POST@#/usr/local/netdata/etc/netdata#g' \
  2493.         -e 's#[@]libconfigdir_POST@#/usr/local/netdata/usr/lib/netdata/conf.d#g' \
  2494.         -e 's#[@]pkglibexecdir_POST@#/usr/local/netdata/usr/libexec/netdata#g' \
  2495.         -e 's#[@]cachedir_POST@#/usr/local/netdata/var/cache/netdata#g' \
  2496.         -e 's#[@]registrydir_POST@#/usr/local/netdata/var/lib/netdata/registry#g' \
  2497.         -e 's#[@]varlibdir_POST@#/usr/local/netdata/var/lib/netdata#g' \
  2498.         -e 's#[@]webdir_POST@#/usr/local/netdata/usr/share/netdata/web#g' \
  2499.         -e 's#[@]enable_aclk_POST@#yes#g' \
  2500.         -e 's#[@]enable_cloud_POST@#yes#g' \
  2501.         charts.d.plugin.in > charts.d.plugin.tmp; then \
  2502.         mv "charts.d.plugin.tmp" "charts.d.plugin"; \
  2503.     else \
  2504.         rm -f "charts.d.plugin.tmp"; \
  2505.         false; \
  2506.     fi
  2507. Making all in checks.plugin
  2508. make[3]: Nothing to be done for `all'.
  2509. Making all in cups.plugin
  2510. make[3]: Nothing to be done for `all'.
  2511. Making all in diskspace.plugin
  2512. make[3]: Nothing to be done for `all'.
  2513. Making all in timex.plugin
  2514. make[3]: Nothing to be done for `all'.
  2515. Making all in fping.plugin
  2516. if sed \
  2517.         -e 's#[@]localstatedir_POST@#/usr/local/netdata/var#g' \
  2518.         -e 's#[@]sbindir_POST@#/usr/local/netdata/usr/sbin#g' \
  2519.         -e 's#[@]pluginsdir_POST@#/usr/local/netdata/usr/libexec/netdata/plugins.d#g' \
  2520.         -e 's#[@]configdir_POST@#/usr/local/netdata/etc/netdata#g' \
  2521.         -e 's#[@]libconfigdir_POST@#/usr/local/netdata/usr/lib/netdata/conf.d#g' \
  2522.         -e 's#[@]pkglibexecdir_POST@#/usr/local/netdata/usr/libexec/netdata#g' \
  2523.         -e 's#[@]cachedir_POST@#/usr/local/netdata/var/cache/netdata#g' \
  2524.         -e 's#[@]registrydir_POST@#/usr/local/netdata/var/lib/netdata/registry#g' \
  2525.         -e 's#[@]varlibdir_POST@#/usr/local/netdata/var/lib/netdata#g' \
  2526.         -e 's#[@]webdir_POST@#/usr/local/netdata/usr/share/netdata/web#g' \
  2527.         -e 's#[@]enable_aclk_POST@#yes#g' \
  2528.         -e 's#[@]enable_cloud_POST@#yes#g' \
  2529.         fping.plugin.in > fping.plugin.tmp; then \
  2530.         mv "fping.plugin.tmp" "fping.plugin"; \
  2531.     else \
  2532.         rm -f "fping.plugin.tmp"; \
  2533.         false; \
  2534.     fi
  2535. Making all in ioping.plugin
  2536. if sed \
  2537.         -e 's#[@]localstatedir_POST@#/usr/local/netdata/var#g' \
  2538.         -e 's#[@]sbindir_POST@#/usr/local/netdata/usr/sbin#g' \
  2539.         -e 's#[@]pluginsdir_POST@#/usr/local/netdata/usr/libexec/netdata/plugins.d#g' \
  2540.         -e 's#[@]configdir_POST@#/usr/local/netdata/etc/netdata#g' \
  2541.         -e 's#[@]libconfigdir_POST@#/usr/local/netdata/usr/lib/netdata/conf.d#g' \
  2542.         -e 's#[@]pkglibexecdir_POST@#/usr/local/netdata/usr/libexec/netdata#g' \
  2543.         -e 's#[@]cachedir_POST@#/usr/local/netdata/var/cache/netdata#g' \
  2544.         -e 's#[@]registrydir_POST@#/usr/local/netdata/var/lib/netdata/registry#g' \
  2545.         -e 's#[@]varlibdir_POST@#/usr/local/netdata/var/lib/netdata#g' \
  2546.         -e 's#[@]webdir_POST@#/usr/local/netdata/usr/share/netdata/web#g' \
  2547.         -e 's#[@]enable_aclk_POST@#yes#g' \
  2548.         -e 's#[@]enable_cloud_POST@#yes#g' \
  2549.         ioping.plugin.in > ioping.plugin.tmp; then \
  2550.         mv "ioping.plugin.tmp" "ioping.plugin"; \
  2551.     else \
  2552.         rm -f "ioping.plugin.tmp"; \
  2553.         false; \
  2554.     fi
  2555. Making all in freebsd.plugin
  2556. make[3]: Nothing to be done for `all'.
  2557. Making all in freeipmi.plugin
  2558. make[3]: Nothing to be done for `all'.
  2559. Making all in idlejitter.plugin
  2560. make[3]: Nothing to be done for `all'.
  2561. Making all in macos.plugin
  2562. make[3]: Nothing to be done for `all'.
  2563. Making all in nfacct.plugin
  2564. make[3]: Nothing to be done for `all'.
  2565. Making all in xenstat.plugin
  2566. make[3]: Nothing to be done for `all'.
  2567. Making all in perf.plugin
  2568. make[3]: Nothing to be done for `all'.
  2569. Making all in node.d.plugin
  2570. if sed \
  2571.         -e 's#[@]localstatedir_POST@#/usr/local/netdata/var#g' \
  2572.         -e 's#[@]sbindir_POST@#/usr/local/netdata/usr/sbin#g' \
  2573.         -e 's#[@]pluginsdir_POST@#/usr/local/netdata/usr/libexec/netdata/plugins.d#g' \
  2574.         -e 's#[@]configdir_POST@#/usr/local/netdata/etc/netdata#g' \
  2575.         -e 's#[@]libconfigdir_POST@#/usr/local/netdata/usr/lib/netdata/conf.d#g' \
  2576.         -e 's#[@]pkglibexecdir_POST@#/usr/local/netdata/usr/libexec/netdata#g' \
  2577.         -e 's#[@]cachedir_POST@#/usr/local/netdata/var/cache/netdata#g' \
  2578.         -e 's#[@]registrydir_POST@#/usr/local/netdata/var/lib/netdata/registry#g' \
  2579.         -e 's#[@]varlibdir_POST@#/usr/local/netdata/var/lib/netdata#g' \
  2580.         -e 's#[@]webdir_POST@#/usr/local/netdata/usr/share/netdata/web#g' \
  2581.         -e 's#[@]enable_aclk_POST@#yes#g' \
  2582.         -e 's#[@]enable_cloud_POST@#yes#g' \
  2583.         node.d.plugin.in > node.d.plugin.tmp; then \
  2584.         mv "node.d.plugin.tmp" "node.d.plugin"; \
  2585.     else \
  2586.         rm -f "node.d.plugin.tmp"; \
  2587.         false; \
  2588.     fi
  2589. Making all in proc.plugin
  2590. make[3]: Nothing to be done for `all'.
  2591. Making all in python.d.plugin
  2592. if sed \
  2593.         -e 's#[@]localstatedir_POST@#/usr/local/netdata/var#g' \
  2594.         -e 's#[@]sbindir_POST@#/usr/local/netdata/usr/sbin#g' \
  2595.         -e 's#[@]pluginsdir_POST@#/usr/local/netdata/usr/libexec/netdata/plugins.d#g' \
  2596.         -e 's#[@]configdir_POST@#/usr/local/netdata/etc/netdata#g' \
  2597.         -e 's#[@]libconfigdir_POST@#/usr/local/netdata/usr/lib/netdata/conf.d#g' \
  2598.         -e 's#[@]pkglibexecdir_POST@#/usr/local/netdata/usr/libexec/netdata#g' \
  2599.         -e 's#[@]cachedir_POST@#/usr/local/netdata/var/cache/netdata#g' \
  2600.         -e 's#[@]registrydir_POST@#/usr/local/netdata/var/lib/netdata/registry#g' \
  2601.         -e 's#[@]varlibdir_POST@#/usr/local/netdata/var/lib/netdata#g' \
  2602.         -e 's#[@]webdir_POST@#/usr/local/netdata/usr/share/netdata/web#g' \
  2603.         -e 's#[@]enable_aclk_POST@#yes#g' \
  2604.         -e 's#[@]enable_cloud_POST@#yes#g' \
  2605.         python.d.plugin.in > python.d.plugin.tmp; then \
  2606.         mv "python.d.plugin.tmp" "python.d.plugin"; \
  2607.     else \
  2608.         rm -f "python.d.plugin.tmp"; \
  2609.         false; \
  2610.     fi
  2611. Making all in slabinfo.plugin
  2612. make[3]: Nothing to be done for `all'.
  2613. Making all in statsd.plugin
  2614. make[3]: Nothing to be done for `all'.
  2615. Making all in ebpf.plugin
  2616. make[3]: Nothing to be done for `all'.
  2617. Making all in tc.plugin
  2618. if sed \
  2619.         -e 's#[@]localstatedir_POST@#/usr/local/netdata/var#g' \
  2620.         -e 's#[@]sbindir_POST@#/usr/local/netdata/usr/sbin#g' \
  2621.         -e 's#[@]pluginsdir_POST@#/usr/local/netdata/usr/libexec/netdata/plugins.d#g' \
  2622.         -e 's#[@]configdir_POST@#/usr/local/netdata/etc/netdata#g' \
  2623.         -e 's#[@]libconfigdir_POST@#/usr/local/netdata/usr/lib/netdata/conf.d#g' \
  2624.         -e 's#[@]pkglibexecdir_POST@#/usr/local/netdata/usr/libexec/netdata#g' \
  2625.         -e 's#[@]cachedir_POST@#/usr/local/netdata/var/cache/netdata#g' \
  2626.         -e 's#[@]registrydir_POST@#/usr/local/netdata/var/lib/netdata/registry#g' \
  2627.         -e 's#[@]varlibdir_POST@#/usr/local/netdata/var/lib/netdata#g' \
  2628.         -e 's#[@]webdir_POST@#/usr/local/netdata/usr/share/netdata/web#g' \
  2629.         -e 's#[@]enable_aclk_POST@#yes#g' \
  2630.         -e 's#[@]enable_cloud_POST@#yes#g' \
  2631.         tc-qos-helper.sh.in > tc-qos-helper.sh.tmp; then \
  2632.         mv "tc-qos-helper.sh.tmp" "tc-qos-helper.sh"; \
  2633.     else \
  2634.         rm -f "tc-qos-helper.sh.tmp"; \
  2635.         false; \
  2636.     fi
  2637. make[3]: Nothing to be done for `all-am'.
  2638. Making all in daemon
  2639. if sed \
  2640.         -e 's#[@]localstatedir_POST@#/usr/local/netdata/var#g' \
  2641.         -e 's#[@]sbindir_POST@#/usr/local/netdata/usr/sbin#g' \
  2642.         -e 's#[@]pluginsdir_POST@#/usr/local/netdata/usr/libexec/netdata/plugins.d#g' \
  2643.         -e 's#[@]configdir_POST@#/usr/local/netdata/etc/netdata#g' \
  2644.         -e 's#[@]libconfigdir_POST@#/usr/local/netdata/usr/lib/netdata/conf.d#g' \
  2645.         -e 's#[@]pkglibexecdir_POST@#/usr/local/netdata/usr/libexec/netdata#g' \
  2646.         -e 's#[@]cachedir_POST@#/usr/local/netdata/var/cache/netdata#g' \
  2647.         -e 's#[@]registrydir_POST@#/usr/local/netdata/var/lib/netdata/registry#g' \
  2648.         -e 's#[@]varlibdir_POST@#/usr/local/netdata/var/lib/netdata#g' \
  2649.         -e 's#[@]webdir_POST@#/usr/local/netdata/usr/share/netdata/web#g' \
  2650.         -e 's#[@]enable_aclk_POST@#yes#g' \
  2651.         -e 's#[@]enable_cloud_POST@#yes#g' \
  2652.         anonymous-statistics.sh.in > anonymous-statistics.sh.tmp; then \
  2653.         mv "anonymous-statistics.sh.tmp" "anonymous-statistics.sh"; \
  2654.     else \
  2655.         rm -f "anonymous-statistics.sh.tmp"; \
  2656.         false; \
  2657.     fi
  2658. Making all in database
  2659. Making all in engine
  2660. Making all in metadata_log
  2661. make[4]: Nothing to be done for `all'.
  2662. make[4]: Nothing to be done for `all-am'.
  2663. make[3]: Nothing to be done for `all-am'.
  2664. Making all in exporting
  2665. Making all in tests
  2666. make[3]: Nothing to be done for `all'.
  2667. Making all in graphite
  2668. make[3]: Nothing to be done for `all'.
  2669. Making all in json
  2670. make[3]: Nothing to be done for `all'.
  2671. Making all in opentsdb
  2672. make[3]: Nothing to be done for `all'.
  2673. Making all in prometheus
  2674. Making all in remote_write
  2675. make[4]: Nothing to be done for `all'.
  2676. make[4]: Nothing to be done for `all-am'.
  2677. Making all in aws_kinesis
  2678. make[3]: Nothing to be done for `all'.
  2679. Making all in pubsub
  2680. make[3]: Nothing to be done for `all'.
  2681. Making all in mongodb
  2682. make[3]: Nothing to be done for `all'.
  2683. make[3]: Nothing to be done for `all-am'.
  2684. Making all in health
  2685. Making all in notifications
  2686. if sed \
  2687.         -e 's#[@]localstatedir_POST@#/usr/local/netdata/var#g' \
  2688.         -e 's#[@]sbindir_POST@#/usr/local/netdata/usr/sbin#g' \
  2689.         -e 's#[@]pluginsdir_POST@#/usr/local/netdata/usr/libexec/netdata/plugins.d#g' \
  2690.         -e 's#[@]configdir_POST@#/usr/local/netdata/etc/netdata#g' \
  2691.         -e 's#[@]libconfigdir_POST@#/usr/local/netdata/usr/lib/netdata/conf.d#g' \
  2692.         -e 's#[@]pkglibexecdir_POST@#/usr/local/netdata/usr/libexec/netdata#g' \
  2693.         -e 's#[@]cachedir_POST@#/usr/local/netdata/var/cache/netdata#g' \
  2694.         -e 's#[@]registrydir_POST@#/usr/local/netdata/var/lib/netdata/registry#g' \
  2695.         -e 's#[@]varlibdir_POST@#/usr/local/netdata/var/lib/netdata#g' \
  2696.         -e 's#[@]webdir_POST@#/usr/local/netdata/usr/share/netdata/web#g' \
  2697.         -e 's#[@]enable_aclk_POST@#yes#g' \
  2698.         -e 's#[@]enable_cloud_POST@#yes#g' \
  2699.         alarm-notify.sh.in > alarm-notify.sh.tmp; then \
  2700.         mv "alarm-notify.sh.tmp" "alarm-notify.sh"; \
  2701.     else \
  2702.         rm -f "alarm-notify.sh.tmp"; \
  2703.         false; \
  2704.     fi
  2705. make[3]: Nothing to be done for `all-am'.
  2706. Making all in libnetdata
  2707. Making all in adaptive_resortable_list
  2708. make[3]: Nothing to be done for `all'.
  2709. Making all in avl
  2710. make[3]: Nothing to be done for `all'.
  2711. Making all in buffer
  2712. make[3]: Nothing to be done for `all'.
  2713. Making all in clocks
  2714. make[3]: Nothing to be done for `all'.
  2715. Making all in completion
  2716. make[3]: Nothing to be done for `all'.
  2717. Making all in config
  2718. make[3]: Nothing to be done for `all'.
  2719. Making all in dictionary
  2720. make[3]: Nothing to be done for `all'.
  2721. Making all in ebpf
  2722. make[3]: Nothing to be done for `all'.
  2723. Making all in eval
  2724. make[3]: Nothing to be done for `all'.
  2725. Making all in json
  2726. make[3]: Nothing to be done for `all'.
  2727. Making all in health
  2728. make[3]: Nothing to be done for `all'.
  2729. Making all in locks
  2730. make[3]: Nothing to be done for `all'.
  2731. Making all in log
  2732. make[3]: Nothing to be done for `all'.
  2733. Making all in popen
  2734. make[3]: Nothing to be done for `all'.
  2735. Making all in procfile
  2736. make[3]: Nothing to be done for `all'.
  2737. Making all in simple_pattern
  2738. make[3]: Nothing to be done for `all'.
  2739. Making all in socket
  2740. make[3]: Nothing to be done for `all'.
  2741. Making all in statistical
  2742. make[3]: Nothing to be done for `all'.
  2743. Making all in storage_number
  2744. Making all in tests
  2745. make[4]: Nothing to be done for `all'.
  2746. make[4]: Nothing to be done for `all-am'.
  2747. Making all in threads
  2748. make[3]: Nothing to be done for `all'.
  2749. Making all in url
  2750. make[3]: Nothing to be done for `all'.
  2751. Making all in tests
  2752. make[3]: Nothing to be done for `all'.
  2753. make[3]: Nothing to be done for `all-am'.
  2754. Making all in registry
  2755. make[2]: Nothing to be done for `all'.
  2756. Making all in streaming
  2757. make[2]: Nothing to be done for `all'.
  2758. Making all in web
  2759. Making all in api
  2760. Making all in badges
  2761. make[4]: Nothing to be done for `all'.
  2762. Making all in queries
  2763. Making all in average
  2764. make[5]: Nothing to be done for `all'.
  2765. Making all in des
  2766. make[5]: Nothing to be done for `all'.
  2767. Making all in incremental_sum
  2768. make[5]: Nothing to be done for `all'.
  2769. Making all in max
  2770. make[5]: Nothing to be done for `all'.
  2771. Making all in min
  2772. make[5]: Nothing to be done for `all'.
  2773. Making all in sum
  2774. make[5]: Nothing to be done for `all'.
  2775. Making all in median
  2776. make[5]: Nothing to be done for `all'.
  2777. Making all in ses
  2778. make[5]: Nothing to be done for `all'.
  2779. Making all in stddev
  2780. make[5]: Nothing to be done for `all'.
  2781. make[5]: Nothing to be done for `all-am'.
  2782. Making all in exporters
  2783. Making all in shell
  2784. make[5]: Nothing to be done for `all'.
  2785. Making all in prometheus
  2786. make[5]: Nothing to be done for `all'.
  2787. make[5]: Nothing to be done for `all-am'.
  2788. Making all in formatters
  2789. Making all in csv
  2790. make[5]: Nothing to be done for `all'.
  2791. Making all in json
  2792. make[5]: Nothing to be done for `all'.
  2793. Making all in ssv
  2794. make[5]: Nothing to be done for `all'.
  2795. Making all in value
  2796. make[5]: Nothing to be done for `all'.
  2797. make[5]: Nothing to be done for `all-am'.
  2798. Making all in health
  2799. make[4]: Nothing to be done for `all'.
  2800. make[4]: Nothing to be done for `all-am'.
  2801. Making all in gui
  2802. Making all in dashboard
  2803. make[4]: Nothing to be done for `all'.
  2804. if test -f dashboard.js; then rm -f dashboard.js; fi
  2805. if test -d "../../.git"; then \
  2806.         git --git-dir="../../.git" log -n 1 --format=%H; \
  2807.     fi > version.txt.tmp
  2808. test -s version.txt.tmp || echo 0 > version.txt.tmp
  2809. cat src/dashboard.js/prologue.js.inc src/dashboard.js/utils.js src/dashboard.js/server-detection.js src/dashboard.js/dependencies.js src/dashboard.js/error-handling.js src/dashboard.js/compatibility.js src/dashboard.js/xss.js src/dashboard.js/colors.js src/dashboard.js/units-conversion.js src/dashboard.js/options.js src/dashboard.js/localstorage.js src/dashboard.js/timeout.js src/dashboard.js/themes.js src/dashboard.js/charting/dygraph.js src/dashboard.js/charting/sparkline.js src/dashboard.js/charting/google-charts.js src/dashboard.js/charting/gauge.js src/dashboard.js/charting/easy-pie-chart.js src/dashboard.js/charting/d3pie.js src/dashboard.js/charting/d3.js src/dashboard.js/charting/peity.js src/dashboard.js/charting/textonly.js src/dashboard.js/charting.js src/dashboard.js/chart-registry.js src/dashboard.js/common.js src/dashboard.js/main.js src/dashboard.js/alarms.js src/dashboard.js/registry.js src/dashboard.js/boot.js src/dashboard.js/epilogue.js.inc  > dashboard.js.tmp && mv dashboard.js.tmp dashboard.js
  2810. mv version.txt.tmp version.txt
  2811. Making all in server
  2812. Making all in static
  2813. make[5]: Nothing to be done for `all-am'.
  2814. make[4]: Nothing to be done for `all-am'.
  2815. make[3]: Nothing to be done for `all-am'.
  2816. Making all in claim
  2817. if sed \
  2818.         -e 's#[@]localstatedir_POST@#/usr/local/netdata/var#g' \
  2819.         -e 's#[@]sbindir_POST@#/usr/local/netdata/usr/sbin#g' \
  2820.         -e 's#[@]pluginsdir_POST@#/usr/local/netdata/usr/libexec/netdata/plugins.d#g' \
  2821.         -e 's#[@]configdir_POST@#/usr/local/netdata/etc/netdata#g' \
  2822.         -e 's#[@]libconfigdir_POST@#/usr/local/netdata/usr/lib/netdata/conf.d#g' \
  2823.         -e 's#[@]pkglibexecdir_POST@#/usr/local/netdata/usr/libexec/netdata#g' \
  2824.         -e 's#[@]cachedir_POST@#/usr/local/netdata/var/cache/netdata#g' \
  2825.         -e 's#[@]registrydir_POST@#/usr/local/netdata/var/lib/netdata/registry#g' \
  2826.         -e 's#[@]varlibdir_POST@#/usr/local/netdata/var/lib/netdata#g' \
  2827.         -e 's#[@]webdir_POST@#/usr/local/netdata/usr/share/netdata/web#g' \
  2828.         -e 's#[@]enable_aclk_POST@#yes#g' \
  2829.         -e 's#[@]enable_cloud_POST@#yes#g' \
  2830.         netdata-claim.sh.in > netdata-claim.sh.tmp; then \
  2831.         mv "netdata-claim.sh.tmp" "netdata-claim.sh"; \
  2832.     else \
  2833.         rm -f "netdata-claim.sh.tmp"; \
  2834.         false; \
  2835.     fi
  2836. Making all in parser
  2837. make[2]: Nothing to be done for `all'.
  2838. Making all in spawn
  2839. make[2]: Nothing to be done for `all'.
  2840. Making all in ml
  2841. Making all in kmeans
  2842. make[3]: Nothing to be done for `all'.
  2843. make[3]: Nothing to be done for `all-am'.
  2844.   CC       libnetdata/os.o
  2845.   CC       web/api/formatters/json_wrapper.o
  2846.   CC       web/api/formatters/charts2json.o
  2847.   CC       web/api/formatters/rrdset2json.o
  2848.   CC       exporting/read_config.o
  2849.   CC       exporting/clean_connectors.o
  2850.   CC       exporting/init_connectors.o
  2851.   CC       exporting/process_data.o
  2852.   CC       exporting/check_filters.o
  2853.   CC       exporting/send_data.o
  2854.   CC       exporting/send_internal_metrics.o
  2855.   CXX      ml/ml.o
  2856.   CC       aclk/aclk_charts_api.o
  2857.   CC       aclk/aclk_alarm_api.o
  2858.   CC       daemon/static_threads_macos.o
  2859.   CXX      aclk/aclk-schemas/proto/agent/v1/disconnect.pb.o
  2860.   CC       libnetdata/adaptive_resortable_list/adaptive_resortable_list.o
  2861.   CC       collectors/cups.plugin/cups_plugin.o
  2862.   CC       libnetdata/config/appconfig.o
  2863.   CC       libnetdata/avl/avl.o
  2864.   CC       libnetdata/buffer/buffer.o
  2865.   CC       libnetdata/circular_buffer/circular_buffer.o
  2866.   CC       libnetdata/clocks/clocks.o
  2867.   CC       libnetdata/completion/completion.o
  2868.   CC       libnetdata/dictionary/dictionary.o
  2869.   CC       libnetdata/eval/eval.o
  2870.   CC       libnetdata/libnetdata.o
  2871.   CC       libnetdata/locks/locks.o
  2872.   CC       libnetdata/log/log.o
  2873.   CC       libnetdata/popen/popen.o
  2874.   CC       libnetdata/procfile/procfile.o
  2875.   CC       libnetdata/simple_pattern/simple_pattern.o
  2876.   CC       libnetdata/socket/socket.o
  2877.   CC       libnetdata/socket/security.o
  2878.   CC       libnetdata/statistical/statistical.o
  2879.   CC       libnetdata/storage_number/storage_number.o
  2880.   CC       libnetdata/threads/threads.o
  2881.   CC       libnetdata/url/url.o
  2882.   CC       libnetdata/json/json.o
  2883.   CC       libnetdata/json/jsmn.o
  2884.   CC       libnetdata/health/health.o
  2885.   CC       daemon/buildinfo.o
  2886.   CC       daemon/common.o
  2887.   CC       daemon/daemon.o
  2888.   CC       daemon/global_statistics.o
  2889.   CC       daemon/analytics.o
  2890. daemon/daemon.c:105:40: warning: passing 'gid_t *' (aka 'unsigned int *') to parameter of type 'int *'
  2891.       converts between pointers to integer types with different sign [-Wpointer-sign]
  2892.         if(getgrouplist(username, gid, supplementary_groups, &ngroups) == -1) {
  2893.                                        ^~~~~~~~~~~~~~~~~~~~
  2894. /Applications/Xcode.app/Contents/Developer/Platforms/MacOSX.platform/Developer/SDKs/MacOSX.sdk/usr/include/unistd.h:650:43: note:
  2895.       passing argument to parameter here
  2896. int      getgrouplist(const char *, int, int *, int *);
  2897.                                               ^
  2898. 1 warning generated.
  2899.   CC       daemon/main.o
  2900.   CC       daemon/signals.o
  2901.   CC       daemon/service.o
  2902.   CC       daemon/static_threads.o
  2903.   CC       daemon/commands.o
  2904.   CC       daemon/unit_test.o
  2905.   CC       web/api/badges/web_buffer_svg.o
  2906.   CC       web/api/exporters/allmetrics.o
  2907.   CC       web/api/exporters/shell/allmetrics_shell.o
  2908.   CC       web/api/queries/average/average.o
  2909.   CC       web/api/queries/des/des.o
  2910.   CC       web/api/queries/incremental_sum/incremental_sum.o
  2911.   CC       web/api/queries/max/max.o
  2912.   CC       web/api/queries/median/median.o
  2913.   CC       web/api/queries/min/min.o
  2914.   CC       web/api/queries/query.o
  2915.   CC       web/api/queries/rrdr.o
  2916.   CC       web/api/queries/ses/ses.o
  2917.   CC       web/api/queries/stddev/stddev.o
  2918.   CC       web/api/queries/sum/sum.o
  2919.   CC       web/api/formatters/rrd2json.o
  2920.   CC       web/api/formatters/csv/csv.o
  2921.   CC       web/api/formatters/json/json.o
  2922.   CC       web/api/formatters/ssv/ssv.o
  2923.   CC       web/api/formatters/value/value.o
  2924.   CC       web/api/health/health_cmdapi.o
  2925.   CC       web/api/web_api_v1.o
  2926.   CC       backends/backends.o
  2927.   CC       backends/graphite/graphite.o
  2928.   CC       backends/json/json.o
  2929.   CC       backends/opentsdb/opentsdb.o
  2930.   CC       backends/prometheus/backend_prometheus.o
  2931.   CC       exporting/exporting_engine.o
  2932.   CC       exporting/graphite/graphite.o
  2933.   CC       exporting/json/json.o
  2934.   CC       exporting/opentsdb/opentsdb.o
  2935.   CC       exporting/prometheus/prometheus.o
  2936.   CC       collectors/checks.plugin/plugin_checks.o
  2937.   CC       health/health.o
  2938.   CC       health/health_config.o
  2939.   CC       health/health_json.o
  2940.   CC       health/health_log.o
  2941.   CC       ml/ml-dummy.o
  2942.   CXX      ml/BitBufferCounter.o
  2943.   CXX      ml/BitRateWindow.o
  2944.   CXX      ml/Config.o
  2945.   CXX      ml/Database.o
  2946.   CXX      ml/Dimension.o
  2947.   CXX      ml/Host.o
  2948.   CXX      ml/kmeans/KMeans.o
  2949.   CXX      ml/kmeans/SamplesBuffer.o
  2950.   CXX      ml/kmeans/dlib/dlib/all/source.o
  2951.   CC       collectors/idlejitter.plugin/plugin_idlejitter.o
  2952.   CC       collectors/plugins.d/plugins_d.o
  2953.   CC       collectors/plugins.d/pluginsd_parser.o
  2954.   CC       registry/registry.o
  2955.   CC       registry/registry_db.o
  2956.   CC       registry/registry_init.o
  2957.   CC       registry/registry_internals.o
  2958.   CC       registry/registry_log.o
  2959.   CC       registry/registry_machine.o
  2960.   CC       registry/registry_person.o
  2961.   CC       registry/registry_url.o
  2962.   CC       database/rrdcalc.o
  2963.   CC       database/rrdcalctemplate.o
  2964.   CC       database/rrddim.o
  2965.   CC       database/rrddimvar.o
  2966.   CC       database/rrdfamily.o
  2967.   CC       database/rrdhost.o
  2968.   CC       database/rrdlabels.o
  2969.   CC       database/rrd.o
  2970.   CC       database/rrdset.o
  2971.   CC       database/rrdsetvar.o
  2972.   CC       database/rrdvar.o
  2973.   CC       database/sqlite/sqlite_functions.o
  2974.   CC       database/sqlite/sqlite_aclk.o
  2975.   CC       database/sqlite/sqlite_health.o
  2976. database/sqlite/sqlite_functions.c:1651:5: error: use of undeclared identifier 'EVP_MD_CTX'
  2977.     EVP_MD_CTX *evpctx;
  2978.     ^
  2979. database/sqlite/sqlite_functions.c:1651:17: error: use of undeclared identifier 'evpctx'
  2980.     EVP_MD_CTX *evpctx;
  2981.                 ^
  2982. database/sqlite/sqlite_functions.c:1652:30: error: use of undeclared identifier 'EVP_MAX_MD_SIZE'
  2983.     unsigned char hash_value[EVP_MAX_MD_SIZE];
  2984.                              ^
  2985. database/sqlite/sqlite_functions.c:1658:5: error: use of undeclared identifier 'evpctx'
  2986.     evpctx = EVP_MD_CTX_create();
  2987.     ^
  2988. database/sqlite/sqlite_functions.c:1658:14: error: implicit declaration of function 'EVP_MD_CTX_create'
  2989.       is invalid in C99 [-Werror,-Wimplicit-function-declaration]
  2990.     evpctx = EVP_MD_CTX_create();
  2991.              ^
  2992. database/sqlite/sqlite_functions.c:1659:5: error: implicit declaration of function 'EVP_DigestInit_ex' is
  2993.       invalid in C99 [-Werror,-Wimplicit-function-declaration]
  2994.     EVP_DigestInit_ex(evpctx, EVP_sha256(), NULL);
  2995.     ^
  2996. database/sqlite/sqlite_functions.c:1659:31: error: implicit declaration of function 'EVP_sha256' is
  2997.       invalid in C99 [-Werror,-Wimplicit-function-declaration]
  2998.     EVP_DigestInit_ex(evpctx, EVP_sha256(), NULL);
  2999.                               ^
  3000. database/sqlite/sqlite_functions.c:1659:23: error: use of undeclared identifier 'evpctx'
  3001.     EVP_DigestInit_ex(evpctx, EVP_sha256(), NULL);
  3002.                       ^
  3003. database/sqlite/sqlite_functions.c:1661:5: error: implicit declaration of function 'EVP_DigestUpdate' is
  3004.       invalid in C99 [-Werror,-Wimplicit-function-declaration]
  3005.     EVP_DigestUpdate(evpctx, st->id, strlen(st->id));
  3006.     ^
  3007. database/sqlite/sqlite_functions.c:1661:22: error: use of undeclared identifier 'evpctx'
  3008.     EVP_DigestUpdate(evpctx, st->id, strlen(st->id));
  3009.                      ^
  3010. database/sqlite/sqlite_functions.c:1662:22: error: use of undeclared identifier 'evpctx'
  3011.     EVP_DigestUpdate(evpctx, st->name, strlen(st->name));
  3012.                      ^
  3013. database/sqlite/sqlite_functions.c:1663:22: error: use of undeclared identifier 'evpctx'
  3014.     EVP_DigestUpdate(evpctx, st->family, strlen(st->family));
  3015.                      ^
  3016. database/sqlite/sqlite_functions.c:1664:22: error: use of undeclared identifier 'evpctx'
  3017.     EVP_DigestUpdate(evpctx, st->context, strlen(st->context));
  3018.                      ^
  3019. database/sqlite/sqlite_health.c:898:5: error: use of undeclared identifier 'EVP_MD_CTX'
  3020.     EVP_MD_CTX *evpctx;
  3021.     ^
  3022. database/sqlite/sqlite_functions.c:1665:22: error: use of undeclared identifier 'evpctx'
  3023.     EVP_DigestUpdate(evpctx, st->title, strlen(st->title));
  3024.                      ^
  3025. database/sqlite/sqlite_health.c:898:17: error: use of undeclared identifier 'evpctx'
  3026.     EVP_MD_CTX *evpctx;
  3027.                 ^
  3028. database/sqlite/sqlite_functions.c:1666:22: error: use of undeclared identifier 'evpctx'
  3029.     EVP_DigestUpdate(evpctx, st->units, strlen(st->units));
  3030.                      ^
  3031. database/sqlite/sqlite_functions.c:1667:22: error: use of undeclared identifier 'evpctx'
  3032.     EVP_DigestUpdate(evpctx, st->plugin_name, strlen(st->plugin_name));
  3033.                      ^
  3034. database/sqlite/sqlite_functions.c:1669:26: error: use of undeclared identifier 'evpctx'
  3035.         EVP_DigestUpdate(evpctx, st->module_name, strlen(st->module_name));
  3036.                          ^
  3037. database/sqlite/sqlite_health.c:899:30: error: use of undeclared identifier 'EVP_MAX_MD_SIZE'
  3038.     unsigned char hash_value[EVP_MAX_MD_SIZE];
  3039.                              ^
  3040. database/sqlite/sqlite_functions.c:1671:22: error: use of undeclared identifier 'evpctx'
  3041.     EVP_DigestUpdate(evpctx, &st->priority, sizeof(st->priority));
  3042.                      ^
  3043. database/sqlite/sqlite_functions.c:1672:22: error: use of undeclared identifier 'evpctx'
  3044.     EVP_DigestUpdate(evpctx, &st->chart_type, sizeof(st->chart_type));
  3045.                      ^
  3046. fatal error: too many errors emitted, stopping now [-ferror-limit=]
  3047. database/sqlite/sqlite_health.c:901:5: error: use of undeclared identifier 'evpctx'
  3048.     evpctx = EVP_MD_CTX_create();
  3049.     ^
  3050. database/sqlite/sqlite_health.c:901:14: error: implicit declaration of function 'EVP_MD_CTX_create' is
  3051.       invalid in C99 [-Werror,-Wimplicit-function-declaration]
  3052.     evpctx = EVP_MD_CTX_create();
  3053.              ^
  3054. database/sqlite/sqlite_health.c:902:5: error: implicit declaration of function 'EVP_DigestInit_ex' is
  3055.       invalid in C99 [-Werror,-Wimplicit-function-declaration]
  3056.     EVP_DigestInit_ex(evpctx, EVP_sha256(), NULL);
  3057.     ^
  3058. 20 errors generated.
  3059. make[2]: *** [database/sqlite/sqlite_functions.o] Error 1
  3060. make[2]: *** Waiting for unfinished jobs....
  3061. database/sqlite/sqlite_health.c:902:31: error: implicit declaration of function 'EVP_sha256' is invalid
  3062.       in C99 [-Werror,-Wimplicit-function-declaration]
  3063.     EVP_DigestInit_ex(evpctx, EVP_sha256(), NULL);
  3064.                               ^
  3065. database/sqlite/sqlite_health.c:902:23: error: use of undeclared identifier 'evpctx'
  3066.     EVP_DigestInit_ex(evpctx, EVP_sha256(), NULL);
  3067.                       ^
  3068. database/sqlite/sqlite_health.c:904:5: error: implicit declaration of function 'EVP_DigestUpdate' is
  3069.       invalid in C99 [-Werror,-Wimplicit-function-declaration]
  3070.     DIGEST_ALERT_CONFIG_VAL(cfg->alarm);
  3071.     ^
  3072. database/sqlite/sqlite_health.c:893:43: note: expanded from macro 'DIGEST_ALERT_CONFIG_VAL'
  3073. #define DIGEST_ALERT_CONFIG_VAL(v) ((v) ? EVP_DigestUpdate(evpctx, (v), strlen((v))) : EVP_Digest...
  3074.                                           ^
  3075. database/sqlite/sqlite_health.c:904:5: error: use of undeclared identifier 'evpctx'
  3076. database/sqlite/sqlite_health.c:893:60: note: expanded from macro 'DIGEST_ALERT_CONFIG_VAL'
  3077. #define DIGEST_ALERT_CONFIG_VAL(v) ((v) ? EVP_DigestUpdate(evpctx, (v), strlen((v))) : EVP_Digest...
  3078.                                                            ^
  3079. database/sqlite/sqlite_health.c:904:5: error: use of undeclared identifier 'evpctx'
  3080. database/sqlite/sqlite_health.c:893:105: note: expanded from macro 'DIGEST_ALERT_CONFIG_VAL'
  3081.   ...((v) ? EVP_DigestUpdate(evpctx, (v), strlen((v))) : EVP_DigestUpdate(evpctx, "", 1))
  3082.                                                                           ^
  3083. database/sqlite/sqlite_health.c:905:5: error: use of undeclared identifier 'evpctx'
  3084.     DIGEST_ALERT_CONFIG_VAL(cfg->template_key);
  3085.     ^
  3086. database/sqlite/sqlite_health.c:893:60: note: expanded from macro 'DIGEST_ALERT_CONFIG_VAL'
  3087. #define DIGEST_ALERT_CONFIG_VAL(v) ((v) ? EVP_DigestUpdate(evpctx, (v), strlen((v))) : EVP_Digest...
  3088.                                                            ^
  3089. database/sqlite/sqlite_health.c:905:5: error: use of undeclared identifier 'evpctx'
  3090. database/sqlite/sqlite_health.c:893:105: note: expanded from macro 'DIGEST_ALERT_CONFIG_VAL'
  3091.   ...((v) ? EVP_DigestUpdate(evpctx, (v), strlen((v))) : EVP_DigestUpdate(evpctx, "", 1))
  3092.                                                                           ^
  3093. database/sqlite/sqlite_health.c:906:5: error: use of undeclared identifier 'evpctx'
  3094.     DIGEST_ALERT_CONFIG_VAL(cfg->os);
  3095.     ^
  3096. database/sqlite/sqlite_health.c:893:60: note: expanded from macro 'DIGEST_ALERT_CONFIG_VAL'
  3097. #define DIGEST_ALERT_CONFIG_VAL(v) ((v) ? EVP_DigestUpdate(evpctx, (v), strlen((v))) : EVP_Digest...
  3098.                                                            ^
  3099. database/sqlite/sqlite_health.c:906:5: error: use of undeclared identifier 'evpctx'
  3100. database/sqlite/sqlite_health.c:893:105: note: expanded from macro 'DIGEST_ALERT_CONFIG_VAL'
  3101.   ...((v) ? EVP_DigestUpdate(evpctx, (v), strlen((v))) : EVP_DigestUpdate(evpctx, "", 1))
  3102.                                                                           ^
  3103. database/sqlite/sqlite_health.c:907:5: error: use of undeclared identifier 'evpctx'
  3104.     DIGEST_ALERT_CONFIG_VAL(cfg->host);
  3105.     ^
  3106. database/sqlite/sqlite_health.c:893:60: note: expanded from macro 'DIGEST_ALERT_CONFIG_VAL'
  3107. #define DIGEST_ALERT_CONFIG_VAL(v) ((v) ? EVP_DigestUpdate(evpctx, (v), strlen((v))) : EVP_Digest...
  3108.                                                            ^
  3109. database/sqlite/sqlite_health.c:907:5: error: use of undeclared identifier 'evpctx'
  3110. database/sqlite/sqlite_health.c:893:105: note: expanded from macro 'DIGEST_ALERT_CONFIG_VAL'
  3111.   ...((v) ? EVP_DigestUpdate(evpctx, (v), strlen((v))) : EVP_DigestUpdate(evpctx, "", 1))
  3112.                                                                           ^
  3113. database/sqlite/sqlite_health.c:908:5: error: use of undeclared identifier 'evpctx'
  3114.     DIGEST_ALERT_CONFIG_VAL(cfg->on);
  3115.     ^
  3116. database/sqlite/sqlite_health.c:893:60: note: expanded from macro 'DIGEST_ALERT_CONFIG_VAL'
  3117. #define DIGEST_ALERT_CONFIG_VAL(v) ((v) ? EVP_DigestUpdate(evpctx, (v), strlen((v))) : EVP_Digest...
  3118.                                                            ^
  3119. database/sqlite/sqlite_health.c:908:5: error: use of undeclared identifier 'evpctx'
  3120. database/sqlite/sqlite_health.c:893:105: note: expanded from macro 'DIGEST_ALERT_CONFIG_VAL'
  3121.   ...((v) ? EVP_DigestUpdate(evpctx, (v), strlen((v))) : EVP_DigestUpdate(evpctx, "", 1))
  3122.                                                                           ^
  3123. fatal error: too many errors emitted, stopping now [-ferror-limit=]
  3124. 20 errors generated.
  3125. make[2]: *** [database/sqlite/sqlite_health.o] Error 1
  3126. make[1]: *** [all-recursive] Error 1
  3127. make: *** [all] Error 2
  3128.  FAILED  
  3129.  
  3130.  FAILED
  3131.  
  3132.  ABORTED  netdata-installer.sh exited with error
  3133.  
  3134. Password:
  3135. Sorry, try again.
  3136. Password:
  3137. Mac-mini-di-Luca:tmp lucamalinconico$
  3138.  
Advertisement
Add Comment
Please, Sign In to add comment