SHARE
TWEET

Untitled

a guest Apr 27th, 2017 110 Never
Not a member of Pastebin yet? Sign Up, it unlocks many cool features!
  1. Compiling the C compiler identification source file "CMakeCCompilerId.c" failed.
  2. Compiler: /opt/fsl-imx-x11/4.1.15-2.0.1/sysroots/x86_64-pokysdk-linux/usr/bin/arm-poky-linux-gnueabi/arm-poky-linux-gnueabi-gcc
  3. Build flags: ;-O2;-pipe;-g;-feliminate-unused-debug-types;-fdebug-prefix-map=/home/eduardas/BigDisk/var-imx-yocto-krogoth/build_x11/tmp/work/x86_64-nativesdk-pokysdk-linux/meta-environment-var-som-mx6/1.0-r8=/usr/src/debug/meta-environment-var-som-mx6/1.0-r8;-fdebug-prefix-map=/home/eduardas/BigDisk/var-imx-yocto-krogoth/build_x11/tmp/sysroots/x86_64-linux=;-fdebug-prefix-map=/home/eduardas/BigDisk/var-imx-yocto-krogoth/build_x11/tmp/sysroots/x86_64-nativesdk-pokysdk-linux=;
  4. Id flags:
  5.  
  6. The output was:
  7. 1
  8. /opt/fsl-imx-x11/4.1.15-2.0.1/sysroots/x86_64-pokysdk-linux/usr/libexec/arm-poky-linux-gnueabi/gcc/arm-poky-linux-gnueabi/5.3.0/real-ld: cannot find crt1.o: No such file or directory
  9. /opt/fsl-imx-x11/4.1.15-2.0.1/sysroots/x86_64-pokysdk-linux/usr/libexec/arm-poky-linux-gnueabi/gcc/arm-poky-linux-gnueabi/5.3.0/real-ld: cannot find crti.o: No such file or directory
  10. /opt/fsl-imx-x11/4.1.15-2.0.1/sysroots/x86_64-pokysdk-linux/usr/libexec/arm-poky-linux-gnueabi/gcc/arm-poky-linux-gnueabi/5.3.0/real-ld: cannot find crtbegin.o: No such file or directory
  11. /opt/fsl-imx-x11/4.1.15-2.0.1/sysroots/x86_64-pokysdk-linux/usr/libexec/arm-poky-linux-gnueabi/gcc/arm-poky-linux-gnueabi/5.3.0/real-ld: cannot find -lgcc
  12. /opt/fsl-imx-x11/4.1.15-2.0.1/sysroots/x86_64-pokysdk-linux/usr/libexec/arm-poky-linux-gnueabi/gcc/arm-poky-linux-gnueabi/5.3.0/real-ld: cannot find -lgcc_s
  13. /opt/fsl-imx-x11/4.1.15-2.0.1/sysroots/x86_64-pokysdk-linux/usr/libexec/arm-poky-linux-gnueabi/gcc/arm-poky-linux-gnueabi/5.3.0/real-ld: cannot find -lc
  14. /opt/fsl-imx-x11/4.1.15-2.0.1/sysroots/x86_64-pokysdk-linux/usr/libexec/arm-poky-linux-gnueabi/gcc/arm-poky-linux-gnueabi/5.3.0/real-ld: cannot find -lgcc
  15. /opt/fsl-imx-x11/4.1.15-2.0.1/sysroots/x86_64-pokysdk-linux/usr/libexec/arm-poky-linux-gnueabi/gcc/arm-poky-linux-gnueabi/5.3.0/real-ld: cannot find -lgcc_s
  16. /opt/fsl-imx-x11/4.1.15-2.0.1/sysroots/x86_64-pokysdk-linux/usr/libexec/arm-poky-linux-gnueabi/gcc/arm-poky-linux-gnueabi/5.3.0/real-ld: cannot find crtend.o: No such file or directory
  17. /opt/fsl-imx-x11/4.1.15-2.0.1/sysroots/x86_64-pokysdk-linux/usr/libexec/arm-poky-linux-gnueabi/gcc/arm-poky-linux-gnueabi/5.3.0/real-ld: cannot find crtn.o: No such file or directory
  18. collect2: error: ld returned 1 exit status
  19.  
  20.  
  21. Compilation of the CXX compiler identification source "CMakeCXXCompilerId.cpp" did not produce an executable in "/home/eduardas/BigDisk/QtProjects/build-cmake_cross_3-DART6_QUAD-Default/CMakeFiles/3.4.3/CompilerIdCXX".
  22.  
  23. Compiling the CXX compiler identification source file "CMakeCXXCompilerId.cpp" failed.
  24. Compiler: /opt/fsl-imx-x11/4.1.15-2.0.1/sysroots/x86_64-pokysdk-linux/usr/bin/arm-poky-linux-gnueabi/arm-poky-linux-gnueabi-cpp
  25. Build flags: ;-O2;-pipe;-g;-feliminate-unused-debug-types;-fdebug-prefix-map=/home/eduardas/BigDisk/var-imx-yocto-krogoth/build_x11/tmp/work/x86_64-nativesdk-pokysdk-linux/meta-environment-var-som-mx6/1.0-r8=/usr/src/debug/meta-environment-var-som-mx6/1.0-r8;-fdebug-prefix-map=/home/eduardas/BigDisk/var-imx-yocto-krogoth/build_x11/tmp/sysroots/x86_64-linux=;-fdebug-prefix-map=/home/eduardas/BigDisk/var-imx-yocto-krogoth/build_x11/tmp/sysroots/x86_64-nativesdk-pokysdk-linux=;
  26. Id flags: -c
  27.  
  28. The output was:
  29. 1
  30. arm-poky-linux-gnueabi-cpp: fatal error: '-c' is not a valid option to the preprocessor
  31. compilation terminated.
  32.  
  33.  
  34. Checking whether the CXX compiler is IAR using "" terminated after 10 s due to timeout.Determining if the C compiler works failed with the following output:
  35. Change Dir: /home/eduardas/BigDisk/QtProjects/build-cmake_cross_3-DART6_QUAD-Default/CMakeFiles/CMakeTmp
  36.  
  37. Run Build Command:"/opt/fsl-imx-x11/4.1.15-2.0.1/sysroots/cortexa9hf-neon-poky-linux-gnueabi/usr/bin/make" "cmTC_63e32/fast"
  38. /opt/fsl-imx-x11/4.1.15-2.0.1/sysroots/cortexa9hf-neon-poky-linux-gnueabi/usr/bin/make: 1: /opt/fsl-imx-x11/4.1.15-2.0.1/sysroots/cortexa9hf-neon-poky-linux-gnueabi/usr/bin/make: Syntax error: word unexpected (expecting ")")
  39.  
  40.  
  41. Compiling the C compiler identification source file "CMakeCCompilerId.c" failed.
  42. Compiler: /opt/fsl-imx-x11/4.1.15-2.0.1/sysroots/x86_64-pokysdk-linux/usr/bin/arm-poky-linux-gnueabi/arm-poky-linux-gnueabi-gcc
  43. Build flags: ;-O2;-pipe;-g;-feliminate-unused-debug-types;-fdebug-prefix-map=/home/eduardas/BigDisk/var-imx-yocto-krogoth/build_x11/tmp/work/x86_64-nativesdk-pokysdk-linux/meta-environment-var-som-mx6/1.0-r8=/usr/src/debug/meta-environment-var-som-mx6/1.0-r8;-fdebug-prefix-map=/home/eduardas/BigDisk/var-imx-yocto-krogoth/build_x11/tmp/sysroots/x86_64-linux=;-fdebug-prefix-map=/home/eduardas/BigDisk/var-imx-yocto-krogoth/build_x11/tmp/sysroots/x86_64-nativesdk-pokysdk-linux=;;
  44. Id flags:
  45.  
  46. The output was:
  47. 1
  48. /opt/fsl-imx-x11/4.1.15-2.0.1/sysroots/x86_64-pokysdk-linux/usr/libexec/arm-poky-linux-gnueabi/gcc/arm-poky-linux-gnueabi/5.3.0/real-ld: cannot find crt1.o: No such file or directory
  49. /opt/fsl-imx-x11/4.1.15-2.0.1/sysroots/x86_64-pokysdk-linux/usr/libexec/arm-poky-linux-gnueabi/gcc/arm-poky-linux-gnueabi/5.3.0/real-ld: cannot find crti.o: No such file or directory
  50. /opt/fsl-imx-x11/4.1.15-2.0.1/sysroots/x86_64-pokysdk-linux/usr/libexec/arm-poky-linux-gnueabi/gcc/arm-poky-linux-gnueabi/5.3.0/real-ld: cannot find crtbegin.o: No such file or directory
  51. /opt/fsl-imx-x11/4.1.15-2.0.1/sysroots/x86_64-pokysdk-linux/usr/libexec/arm-poky-linux-gnueabi/gcc/arm-poky-linux-gnueabi/5.3.0/real-ld: cannot find -lgcc
  52. /opt/fsl-imx-x11/4.1.15-2.0.1/sysroots/x86_64-pokysdk-linux/usr/libexec/arm-poky-linux-gnueabi/gcc/arm-poky-linux-gnueabi/5.3.0/real-ld: cannot find -lgcc_s
  53. /opt/fsl-imx-x11/4.1.15-2.0.1/sysroots/x86_64-pokysdk-linux/usr/libexec/arm-poky-linux-gnueabi/gcc/arm-poky-linux-gnueabi/5.3.0/real-ld: cannot find -lc
  54. /opt/fsl-imx-x11/4.1.15-2.0.1/sysroots/x86_64-pokysdk-linux/usr/libexec/arm-poky-linux-gnueabi/gcc/arm-poky-linux-gnueabi/5.3.0/real-ld: cannot find -lgcc
  55. /opt/fsl-imx-x11/4.1.15-2.0.1/sysroots/x86_64-pokysdk-linux/usr/libexec/arm-poky-linux-gnueabi/gcc/arm-poky-linux-gnueabi/5.3.0/real-ld: cannot find -lgcc_s
  56. /opt/fsl-imx-x11/4.1.15-2.0.1/sysroots/x86_64-pokysdk-linux/usr/libexec/arm-poky-linux-gnueabi/gcc/arm-poky-linux-gnueabi/5.3.0/real-ld: cannot find crtend.o: No such file or directory
  57. /opt/fsl-imx-x11/4.1.15-2.0.1/sysroots/x86_64-pokysdk-linux/usr/libexec/arm-poky-linux-gnueabi/gcc/arm-poky-linux-gnueabi/5.3.0/real-ld: cannot find crtn.o: No such file or directory
  58. collect2: error: ld returned 1 exit status
  59.  
  60.  
  61. Compilation of the CXX compiler identification source "CMakeCXXCompilerId.cpp" did not produce an executable in "/home/eduardas/BigDisk/QtProjects/build-cmake_cross_3-DART6_QUAD-Default/CMakeFiles/3.4.3/CompilerIdCXX".
  62.  
  63. Compiling the CXX compiler identification source file "CMakeCXXCompilerId.cpp" failed.
  64. Compiler: /opt/fsl-imx-x11/4.1.15-2.0.1/sysroots/x86_64-pokysdk-linux/usr/bin/arm-poky-linux-gnueabi/arm-poky-linux-gnueabi-cpp
  65. Build flags: ;-O2;-pipe;-g;-feliminate-unused-debug-types;-fdebug-prefix-map=/home/eduardas/BigDisk/var-imx-yocto-krogoth/build_x11/tmp/work/x86_64-nativesdk-pokysdk-linux/meta-environment-var-som-mx6/1.0-r8=/usr/src/debug/meta-environment-var-som-mx6/1.0-r8;-fdebug-prefix-map=/home/eduardas/BigDisk/var-imx-yocto-krogoth/build_x11/tmp/sysroots/x86_64-linux=;-fdebug-prefix-map=/home/eduardas/BigDisk/var-imx-yocto-krogoth/build_x11/tmp/sysroots/x86_64-nativesdk-pokysdk-linux=;
  66. Id flags: -c
  67.  
  68. The output was:
  69. 1
  70. arm-poky-linux-gnueabi-cpp: fatal error: '-c' is not a valid option to the preprocessor
  71. compilation terminated.
  72.  
  73.  
  74. Checking whether the CXX compiler is IAR using "" terminated after 10 s due to timeout.Determining if the C compiler works failed with the following output:
  75. Change Dir: /home/eduardas/BigDisk/QtProjects/build-cmake_cross_3-DART6_QUAD-Default/CMakeFiles/CMakeTmp
  76.  
  77. Run Build Command:"/opt/fsl-imx-x11/4.1.15-2.0.1/sysroots/cortexa9hf-neon-poky-linux-gnueabi/usr/bin/make" "cmTC_30f9e/fast"
  78. /opt/fsl-imx-x11/4.1.15-2.0.1/sysroots/cortexa9hf-neon-poky-linux-gnueabi/usr/bin/make: 1: /opt/fsl-imx-x11/4.1.15-2.0.1/sysroots/cortexa9hf-neon-poky-linux-gnueabi/usr/bin/make: Syntax error: word unexpected (expecting ")")
RAW Paste Data
We use cookies for various purposes including analytics. By continuing to use Pastebin, you agree to our use of cookies as described in the Cookies Policy. OK, I Understand
 
Top