Advertisement
Guest User

Untitled

a guest
Nov 19th, 2019
270
Never
Not a member of Pastebin yet? Sign Up, it unlocks many cool features!
text 3.93 KB | None
  1. ==> ----------------------------------------------
  2. ==> s
  3.  
  4. ==> Compilazione e installazione del pacchetto
  5. ==> Creazione del pacchetto: compiz-git 0.9.14.0.r1.gfac27fe9a-1 (mar 19 nov 2019, 17:38:14)
  6. ==> Controllo delle dipendenze durante l'avvio in corso...
  7. ==> Controllo delle dipendenze durante la compilazione in corso...
  8. ==> Download dei sorgenti in corso...
  9. -> Clonazione del repository compiz git in corso...
  10. Clone nel repository spoglio '/tmp/yaourt-tmp-nuovo/aur-compiz-git/compiz' in corso...
  11. remote: Counting objects: 101458, done.
  12. remote: Compressing objects: 100% (28102/28102), done.
  13. remote: Total 101458 (delta 72276), reused 101183 (delta 72083)
  14. Ricezione degli oggetti: 100% (101458/101458), 26.47 MiB | 1.75 MiB/s, fatto.
  15. Risoluzione dei delta: 100% (72276/72276), fatto.
  16. -> È stato trovato focus-prevention-disable.patch
  17. -> È stato trovato gtk-extents.patch
  18. -> È stato trovato reverse-unity-config.patch
  19. -> È stato trovato screenshot-launch-fix.patch
  20. -> È stato trovato no-compile-gschemas.patch
  21. -> È stato trovato ccsm-escape-fix.patch
  22. ==> Validazione di source file con sha256sums...
  23. compiz ... Ignorato
  24. focus-prevention-disable.patch ... Verificato
  25. gtk-extents.patch ... Verificato
  26. reverse-unity-config.patch ... Verificato
  27. screenshot-launch-fix.patch ... Verificato
  28. no-compile-gschemas.patch ... Verificato
  29. ccsm-escape-fix.patch ... Verificato
  30. ==> Estrazione dei sorgenti in corso...
  31. -> Creazione di una copia di lavoro del repository compiz git in corso...
  32. Clone in 'compiz' in corso...
  33. fatto.
  34. ==> Avvio di prepare() in corso...
  35. patching file compizconfig/integration/gnome/gsettings/org.compiz.integrated.gschema.xml
  36. patching file metadata/core.xml.in
  37. patching file plugins/animation/animation.xml.in
  38. patching file plugins/commands/commands.xml.in
  39. patching file plugins/decor/decor.xml.in
  40. patching file plugins/expo/expo.xml.in
  41. patching file plugins/ezoom/ezoom.xml.in
  42. patching file plugins/fade/fade.xml.in
  43. patching file plugins/gnomecompat/gnomecompat.xml.in
  44. patching file plugins/grid/grid.xml.in
  45. patching file plugins/resize/resize.xml.in
  46. patching file plugins/scale/scale.xml.in
  47. patching file plugins/staticswitcher/staticswitcher.xml.in
  48. patching file plugins/vpswitch/vpswitch.xml.in
  49. patching file plugins/wall/wall.xml.in
  50. patching file tests/system/xorg-gtest/tests/compiz_xorg_gtest_ewmh.cpp
  51. patching file metadata/core.xml.in
  52. Hunk #1 succeeded at 119 (offset 5 lines).
  53. patching file src/screen.cpp
  54. Hunk #1 succeeded at 2544 (offset 182 lines).
  55. (Stripping trailing CRs from patch; use --binary to disable.)
  56. patching file plugins/screenshot/src/screenshot.cpp
  57. patch unexpectedly ends in middle of line
  58. Hunk #1 succeeded at 434 with fuzz 2.
  59. patching file cmake/recompile_gsettings_schemas_in_dir_user_env.cmake
  60. patching file compizconfig/ccsm/ccm/Pages.py
  61. Hunk #1 FAILED at 33.
  62. Hunk #2 FAILED at 397.
  63. Hunk #3 FAILED at 1383.
  64. 3 out of 3 hunks FAILED -- saving rejects to file compizconfig/ccsm/ccm/Pages.py.rej
  65. patching file compizconfig/ccsm/ccm/Settings.py
  66. Hunk #1 FAILED at 29.
  67. Hunk #2 FAILED at 110.
  68. Hunk #3 FAILED at 966.
  69. Hunk #4 FAILED at 1149.
  70. Hunk #5 FAILED at 1330.
  71. 5 out of 5 hunks FAILED -- saving rejects to file compizconfig/ccsm/ccm/Settings.py.rej
  72. patching file compizconfig/ccsm/ccm/Utils.py
  73. Hunk #1 FAILED at 27.
  74. Hunk #2 FAILED at 57.
  75. Hunk #3 FAILED at 187.
  76. Hunk #4 FAILED at 196.
  77. 4 out of 4 hunks FAILED -- saving rejects to file compizconfig/ccsm/ccm/Utils.py.rej
  78. patching file compizconfig/ccsm/ccm/Widgets.py
  79. Hunk #1 FAILED at 27.
  80. patch unexpectedly ends in middle of line
  81. Hunk #2 FAILED at 295.
  82. 2 out of 2 hunks FAILED -- saving rejects to file compizconfig/ccsm/ccm/Widgets.py.rej
  83. ==> ERRORE: Si è verificato un errore in prepare().
  84. L'operazione sta per essere interrotta...
  85. ==> ERRORE: Makepkg non è riuscito a compilare compiz-git.
  86. ==> Riavviare la compilazione di compiz-git [s/N]
  87. ==> ---------------------------------------------
Advertisement
RAW Paste Data Copied
Advertisement