Guest User

Untitled

a guest
Sep 16th, 2018
84
Never
Not a member of Pastebin yet? Sign Up, it unlocks many cool features!
  1. 12:00:57 [basic-suite.el7.x86_64]   # verify_add_hosts:
  2. 12:00:58 [basic-suite.el7.x86_64]     * Unhandled exception in <function <lambda> at 0x7f17bc065a28>
  3. 12:00:58 [basic-suite.el7.x86_64] Traceback (most recent call last):
  4. 12:00:58 [basic-suite.el7.x86_64]   File "/usr/lib/python2.7/site-packages/ovirtlago/testlib.py", line 234, in assert_equals_within
  5. 12:00:58 [basic-suite.el7.x86_64]     res = func()
  6. 12:00:58 [basic-suite.el7.x86_64]   File "/home/jenkins/workspace/ovirt-master_change-queue-tester/ovirt-system-tests/basic-suite-master/test-scenarios/002_bootstrap.py", line 314, in <lambda>
  7. 12:00:58 [basic-suite.el7.x86_64]     lambda: _single_host_up(hosts_service, total_hosts),
  8. 12:00:58 [basic-suite.el7.x86_64]   File "/home/jenkins/workspace/ovirt-master_change-queue-tester/ovirt-system-tests/basic-suite-master/test-scenarios/002_bootstrap.py", line 147, in _single_host_up
  9. 12:00:58 [basic-suite.el7.x86_64]     _check_problematic_hosts(hosts_service)
  10. 12:00:58 [basic-suite.el7.x86_64]   File "/home/jenkins/workspace/ovirt-master_change-queue-tester/ovirt-system-tests/basic-suite-master/test-scenarios/002_bootstrap.py", line 156, in _check_problematic_hosts
  11. 12:00:58 [basic-suite.el7.x86_64]     raise RuntimeError(dump_hosts)
  12. 12:00:58 [basic-suite.el7.x86_64] RuntimeError: 2 hosts failed installation:
  13. 12:00:58 [basic-suite.el7.x86_64] lago-basic-suite-master-host-0: install_failed
  14. 12:00:58 [basic-suite.el7.x86_64] lago-basic-suite-master-host-1: install_failed
  15. 12:00:58 [basic-suite.el7.x86_64]
  16. 12:00:58 [basic-suite.el7.x86_64]     * Collect artifacts:
  17. 12:01:03 [basic-suite.el7.x86_64]       - [Thread-65] lago-basic-suite-master-engine: ERROR (in 0:00:05)
  18. 12:01:03 [basic-suite.el7.x86_64] Error while running thread
  19. 12:01:03 [basic-suite.el7.x86_64] Traceback (most recent call last):
  20. 12:01:03 [basic-suite.el7.x86_64]   File "/usr/lib/python2.7/site-packages/lago/utils.py", line 58, in _ret_via_queue
  21. 12:01:03 [basic-suite.el7.x86_64]     queue.put({'return': func()})
  22. 12:01:03 [basic-suite.el7.x86_64]   File "/usr/lib/python2.7/site-packages/lago/prefix.py", line 1524, in _collect_artifacts
  23. 12:01:03 [basic-suite.el7.x86_64]     vm.collect_artifacts(path, ignore_nopath)
  24. 12:01:03 [basic-suite.el7.x86_64]   File "/usr/lib/python2.7/site-packages/lago/plugins/vm.py", line 644, in collect_artifacts
  25. 12:01:03 [basic-suite.el7.x86_64]     ignore_nopath=ignore_nopath
  26. 12:01:03 [basic-suite.el7.x86_64]   File "/usr/lib/python2.7/site-packages/lago/plugins/vm.py", line 384, in extract_paths
  27. 12:01:03 [basic-suite.el7.x86_64]     return self.provider.extract_paths(paths, *args, **kwargs)
  28. 12:01:03 [basic-suite.el7.x86_64]   File "/usr/lib/python2.7/site-packages/lago/providers/libvirt/vm.py", line 398, in extract_paths
  29. 12:01:03 [basic-suite.el7.x86_64]     ignore_nopath=ignore_nopath,
  30. 12:01:03 [basic-suite.el7.x86_64]   File "/usr/lib/python2.7/site-packages/lago/plugins/vm.py", line 249, in extract_paths
  31. 12:01:03 [basic-suite.el7.x86_64]     self._extract_paths_scp(paths=paths, ignore_nopath=ignore_nopath)
  32. 12:01:03 [basic-suite.el7.x86_64]   File "/usr/lib/python2.7/site-packages/lago/plugins/vm.py", line 83, in wrapper
  33. 12:01:03 [basic-suite.el7.x86_64]     return func(self, *args, **kwargs)
  34. 12:01:03 [basic-suite.el7.x86_64]   File "/usr/lib/python2.7/site-packages/lago/plugins/vm.py", line 279, in _extract_paths_scp
  35. 12:01:03 [basic-suite.el7.x86_64]     raise ExtractPathNoPathError(err.args[0])
  36. 12:01:03 [basic-suite.el7.x86_64] ExtractPathNoPathError: scp: /var/lib/pgsql/upgrade_rh-postgresql95-postgresql.log: No such file or directory
  37. 12:01:03 [basic-suite.el7.x86_64] Error while running thread
  38. 12:01:03 [basic-suite.el7.x86_64] Traceback (most recent call last):
  39. 12:01:03 [basic-suite.el7.x86_64]   File "/usr/lib/python2.7/site-packages/lago/utils.py", line 58, in _ret_via_queue
  40. 12:01:03 [basic-suite.el7.x86_64]     queue.put({'return': func()})
  41. 12:01:03 [basic-suite.el7.x86_64]   File "/usr/lib/python2.7/site-packages/lago/prefix.py", line 1524, in _collect_artifacts
  42. 12:01:03 [basic-suite.el7.x86_64]     vm.collect_artifacts(path, ignore_nopath)
  43. 12:01:03 [basic-suite.el7.x86_64]   File "/usr/lib/python2.7/site-packages/lago/plugins/vm.py", line 644, in collect_artifacts
  44. 12:01:03 [basic-suite.el7.x86_64]     ignore_nopath=ignore_nopath
  45. 12:01:03 [basic-suite.el7.x86_64]   File "/usr/lib/python2.7/site-packages/lago/plugins/vm.py", line 384, in extract_paths
  46. 12:01:03 [basic-suite.el7.x86_64]     return self.provider.extract_paths(paths, *args, **kwargs)
  47. 12:01:03 [basic-suite.el7.x86_64]   File "/usr/lib/python2.7/site-packages/lago/providers/libvirt/vm.py", line 398, in extract_paths
  48. 12:01:03 [basic-suite.el7.x86_64]     ignore_nopath=ignore_nopath,
  49. 12:01:03 [basic-suite.el7.x86_64]   File "/usr/lib/python2.7/site-packages/lago/plugins/vm.py", line 249, in extract_paths
  50. 12:01:03 [basic-suite.el7.x86_64]     self._extract_paths_scp(paths=paths, ignore_nopath=ignore_nopath)
  51. 12:01:03 [basic-suite.el7.x86_64]   File "/usr/lib/python2.7/site-packages/lago/plugins/vm.py", line 83, in wrapper
  52. 12:01:03 [basic-suite.el7.x86_64]     return func(self, *args, **kwargs)
  53. 12:01:03 [basic-suite.el7.x86_64]   File "/usr/lib/python2.7/site-packages/lago/plugins/vm.py", line 279, in _extract_paths_scp
  54. 12:01:03 [basic-suite.el7.x86_64]     raise ExtractPathNoPathError(err.args[0])
  55. 12:01:03 [basic-suite.el7.x86_64] ExtractPathNoPathError: scp: /var/lib/pgsql/upgrade_rh-postgresql95-postgresql.log: No such file or directory
  56. 12:01:03 [basic-suite.el7.x86_64]     * Collect artifacts: ERROR (in 0:00:05)
  57. 12:01:03 [basic-suite.el7.x86_64]   # verify_add_hosts: ERROR (in 0:00:05)
  58. 12:01:03 [basic-suite.el7.x86_64]   # Results located at /dev/shm/ost/deployment-basic-suite-master/002_bootstrap.py.junit.xml
  59. 12:01:03 [basic-suite.el7.x86_64] @ Run test: 002_bootstrap.py: ERROR (in 0:00:53)
  60. 12:01:03 [basic-suite.el7.x86_64] Error occured, aborting
  61. 12:01:03 [basic-suite.el7.x86_64] Traceback (most recent call last):
  62. 12:01:03 [basic-suite.el7.x86_64]   File "/usr/lib/python2.7/site-packages/ovirtlago/cmd.py", line 383, in do_run
  63. 12:01:03 [basic-suite.el7.x86_64]     self.cli_plugins[args.ovirtverb].do_run(args)
  64. 12:01:03 [basic-suite.el7.x86_64]   File "/usr/lib/python2.7/site-packages/lago/plugins/cli.py", line 184, in do_run
  65. 12:01:03 [basic-suite.el7.x86_64]     self._do_run(**vars(args))
  66. 12:01:03 [basic-suite.el7.x86_64]   File "/usr/lib/python2.7/site-packages/lago/utils.py", line 505, in wrapper
  67. 12:01:03 [basic-suite.el7.x86_64]     return func(*args, **kwargs)
  68. 12:01:03 [basic-suite.el7.x86_64]   File "/usr/lib/python2.7/site-packages/lago/utils.py", line 516, in wrapper
  69. 12:01:03 [basic-suite.el7.x86_64]     return func(*args, prefix=prefix, **kwargs)
  70. 12:01:03 [basic-suite.el7.x86_64]   File "/usr/lib/python2.7/site-packages/ovirtlago/cmd.py", line 107, in do_ovirt_runtest
  71. 12:01:03 [basic-suite.el7.x86_64]     raise RuntimeError('Some tests failed')
  72. 12:01:03 [basic-suite.el7.x86_64] RuntimeError: Some tests failed
  73. 12:01:03 [basic-suite.el7.x86_64] + res=1
  74. 12:01:03 [basic-suite.el7.x86_64] + [[ 1 -ne 0 ]]
  75. 12:01:03 [basic-suite.el7.x86_64] + xmllint --format /dev/shm/ost/deployment-basic-suite-master/002_bootstrap.py.junit.xml
  76. 12:01:03 [basic-suite.el7.x86_64] <?xml version="1.0" encoding="UTF-8"?>
  77. 12:01:03 [basic-suite.el7.x86_64] <testsuite name="nosetests" tests="31" errors="1" failures="0" skip="0">
  78. 12:01:03 [basic-suite.el7.x86_64]   <testcase classname="002_bootstrap" name="copy_storage_script" time="0.511"/>
  79. 12:01:03 [basic-suite.el7.x86_64]   <testcase classname="002_bootstrap" name="download_engine_certs" time="0.175"/>
  80. 12:01:03 [basic-suite.el7.x86_64]   <testcase classname="002_bootstrap" name="add_dc" time="0.953"/>
  81. 12:01:03 [basic-suite.el7.x86_64]   <testcase classname="002_bootstrap" name="add_cluster" time="0.399"/>
  82. 12:01:03 [basic-suite.el7.x86_64]   <testcase classname="002_bootstrap" name="add_hosts" time="2.533"/>
  83. 12:01:03 [basic-suite.el7.x86_64]   <testcase classname="002_bootstrap" name="sync_time" time="7.134"/>
  84. 12:01:03 [basic-suite.el7.x86_64]   <testcase classname="002_bootstrap" name="get_version" time="0.129"/>
  85. 12:01:03 [basic-suite.el7.x86_64]   <testcase classname="002_bootstrap" name="get_domains" time="0.086"/>
  86. 12:01:03 [basic-suite.el7.x86_64]   <testcase classname="002_bootstrap" name="get_operating_systems" time="0.091"/>
  87. 12:01:03 [basic-suite.el7.x86_64]   <testcase classname="002_bootstrap" name="get_system_options" time="0.036"/>
  88. 12:01:03 [basic-suite.el7.x86_64]   <testcase classname="002_bootstrap" name="get_cluster_levels" time="0.090"/>
  89. 12:01:03 [basic-suite.el7.x86_64]   <testcase classname="002_bootstrap" name="add_affinity_group" time="0.177"/>
  90. 12:01:03 [basic-suite.el7.x86_64]   <testcase classname="002_bootstrap" name="add_qos" time="0.208"/>
  91. 12:01:03 [basic-suite.el7.x86_64]   <testcase classname="002_bootstrap" name="add_bookmark" time="0.108"/>
  92. 12:01:03 [basic-suite.el7.x86_64]   <testcase classname="002_bootstrap" name="configure_storage" time="29.265"/>
  93. 12:01:03 [basic-suite.el7.x86_64]   <testcase classname="002_bootstrap" name="list_glance_images" time="1.601"/>
  94. 12:01:03 [basic-suite.el7.x86_64]   <testcase classname="002_bootstrap" name="add_dc_quota" time="1.319"/>
  95. 12:01:03 [basic-suite.el7.x86_64]   <testcase classname="002_bootstrap" name="update_default_dc" time="0.189"/>
  96. 12:01:03 [basic-suite.el7.x86_64]   <testcase classname="002_bootstrap" name="update_default_cluster" time="0.185"/>
  97. 12:01:03 [basic-suite.el7.x86_64]   <testcase classname="002_bootstrap" name="add_mac_pool" time="0.215"/>
  98. 12:01:03 [basic-suite.el7.x86_64]   <testcase classname="002_bootstrap" name="remove_default_dc" time="0.207"/>
  99. 12:01:03 [basic-suite.el7.x86_64]   <testcase classname="002_bootstrap" name="remove_default_cluster" time="0.098"/>
  100. 12:01:03 [basic-suite.el7.x86_64]   <testcase classname="002_bootstrap" name="add_quota_storage_limits" time="0.176"/>
  101. 12:01:03 [basic-suite.el7.x86_64]   <testcase classname="002_bootstrap" name="add_quota_cluster_limits" time="0.265"/>
  102. 12:01:03 [basic-suite.el7.x86_64]   <testcase classname="002_bootstrap" name="set_dc_quota_audit" time="1.144"/>
  103. 12:01:03 [basic-suite.el7.x86_64]   <testcase classname="002_bootstrap" name="add_role" time="0.163"/>
  104. 12:01:03 [basic-suite.el7.x86_64]   <testcase classname="002_bootstrap" name="add_scheduling_policy" time="0.099"/>
  105. 12:01:03 [basic-suite.el7.x86_64]   <testcase classname="002_bootstrap" name="add_affinity_label" time="0.105"/>
  106. 12:01:03 [basic-suite.el7.x86_64]   <testcase classname="002_bootstrap" name="add_tag" time="0.096"/>
  107. 12:01:03 [basic-suite.el7.x86_64]   <testcase classname="002_bootstrap" name="add_cpu_profile" time="0.168"/>
  108. 12:01:03 [basic-suite.el7.x86_64]   <testcase classname="002_bootstrap" name="verify_add_hosts" time="0.181">
  109. 12:01:03 [basic-suite.el7.x86_64]     <error type="exceptions.RuntimeError" message="2 hosts failed installation:&#10;lago-basic-suite-master-host-0: install_failed&#10;lago-basic-suite-master-host-1: install_failed&#10;&#10;-------------------- &gt;&gt; begin captured logging &lt;&lt; --------------------&#10;ovirtlago.testlib: ERROR:     * Unhandled exception in &lt;function &lt;lambda&gt; at 0x7f17bc065a28&gt;&#10;Traceback (most recent call last):&#10;  File &quot;/usr/lib/python2.7/site-packages/ovirtlago/testlib.py&quot;, line 234, in assert_equals_within&#10;    res = func()&#10;  File &quot;/home/jenkins/workspace/ovirt-master_change-queue-tester/ovirt-system-tests/basic-suite-master/test-scenarios/002_bootstrap.py&quot;, line 314, in &lt;lambda&gt;&#10;    lambda: _single_host_up(hosts_service, total_hosts),&#10;  File &quot;/home/jenkins/workspace/ovirt-master_change-queue-tester/ovirt-system-tests/basic-suite-master/test-scenarios/002_bootstrap.py&quot;, line 147, in _single_host_up&#10;    _check_problematic_hosts(hosts_service)&#10;  File &quot;/home/jenkins/workspace/ovirt-master_change-queue-tester/ovirt-system-tests/basic-suite-master/test-scenarios/002_bootstrap.py&quot;, line 156, in _check_problematic_hosts&#10;    raise RuntimeError(dump_hosts)&#10;RuntimeError: 2 hosts failed installation:&#10;lago-basic-suite-master-host-0: install_failed&#10;lago-basic-suite-master-host-1: install_failed&#10;&#10;--------------------- &gt;&gt; end captured logging &lt;&lt; ---------------------"><![CDATA[  File "/usr/lib64/python2.7/unittest/case.py", line 369, in run
  110. 12:01:03 [basic-suite.el7.x86_64]     testMethod()
  111. 12:01:03 [basic-suite.el7.x86_64]   File "/usr/lib/python2.7/site-packages/nose/case.py", line 197, in runTest
  112. 12:01:03 [basic-suite.el7.x86_64]     self.test(*self.arg)
  113. 12:01:03 [basic-suite.el7.x86_64]   File "/usr/lib/python2.7/site-packages/ovirtlago/testlib.py", line 142, in wrapped_test
  114. 12:01:03 [basic-suite.el7.x86_64]     test()
  115. 12:01:03 [basic-suite.el7.x86_64]   File "/usr/lib/python2.7/site-packages/ovirtlago/testlib.py", line 60, in wrapper
  116. 12:01:03 [basic-suite.el7.x86_64]     return func(get_test_prefix(), *args, **kwargs)
  117. 12:01:03 [basic-suite.el7.x86_64]   File "/usr/lib/python2.7/site-packages/ovirtlago/testlib.py", line 79, in wrapper
  118. 12:01:03 [basic-suite.el7.x86_64]     prefix.virt_env.engine_vm().get_api(api_ver=4), *args, **kwargs
  119. 12:01:03 [basic-suite.el7.x86_64]   File "/home/jenkins/workspace/ovirt-master_change-queue-tester/ovirt-system-tests/basic-suite-master/test-scenarios/002_bootstrap.py", line 315, in verify_add_hosts
  120. 12:01:03 [basic-suite.el7.x86_64]     timeout=constants.ADD_HOST_TIMEOUT
  121. 12:01:03 [basic-suite.el7.x86_64]   File "/usr/lib/python2.7/site-packages/ovirtlago/testlib.py", line 278, in assert_true_within
  122. 12:01:03 [basic-suite.el7.x86_64]     assert_equals_within(func, True, timeout, allowed_exceptions)
  123. 12:01:03 [basic-suite.el7.x86_64]   File "/usr/lib/python2.7/site-packages/ovirtlago/testlib.py", line 234, in assert_equals_within
  124. 12:01:03 [basic-suite.el7.x86_64]     res = func()
  125. 12:01:03 [basic-suite.el7.x86_64]   File "/home/jenkins/workspace/ovirt-master_change-queue-tester/ovirt-system-tests/basic-suite-master/test-scenarios/002_bootstrap.py", line 314, in <lambda>
  126. 12:01:03 [basic-suite.el7.x86_64]     lambda: _single_host_up(hosts_service, total_hosts),
  127. 12:01:03 [basic-suite.el7.x86_64]   File "/home/jenkins/workspace/ovirt-master_change-queue-tester/ovirt-system-tests/basic-suite-master/test-scenarios/002_bootstrap.py", line 147, in _single_host_up
  128. 12:01:03 [basic-suite.el7.x86_64]     _check_problematic_hosts(hosts_service)
  129. 12:01:03 [basic-suite.el7.x86_64]   File "/home/jenkins/workspace/ovirt-master_change-queue-tester/ovirt-system-tests/basic-suite-master/test-scenarios/002_bootstrap.py", line 156, in _check_problematic_hosts
  130. 12:01:03 [basic-suite.el7.x86_64]     raise RuntimeError(dump_hosts)
  131. 12:01:03 [basic-suite.el7.x86_64] '2 hosts failed installation:\nlago-basic-suite-master-host-0: install_failed\nlago-basic-suite-master-host-1: install_failed\n\n-------------------- >> begin captured logging << --------------------\novirtlago.testlib: ERROR:     * Unhandled exception in <function <lambda> at 0x7f17bc065a28>\nTraceback (most recent call last):\n  File "/usr/lib/python2.7/site-packages/ovirtlago/testlib.py", line 234, in assert_equals_within\n    res = func()\n  File "/home/jenkins/workspace/ovirt-master_change-queue-tester/ovirt-system-tests/basic-suite-master/test-scenarios/002_bootstrap.py", line 314, in <lambda>\n    lambda: _single_host_up(hosts_service, total_hosts),\n  File "/home/jenkins/workspace/ovirt-master_change-queue-tester/ovirt-system-tests/basic-suite-master/test-scenarios/002_bootstrap.py", line 147, in _single_host_up\n    _check_problematic_hosts(hosts_service)\n  File "/home/jenkins/workspace/ovirt-master_change-queue-tester/ovirt-system-tests/basic-suite-master/test-scenarios/002_bootstrap.py", line 156, in _check_problematic_hosts\n    raise RuntimeError(dump_hosts)\nRuntimeError: 2 hosts failed installation:\nlago-basic-suite-master-host-0: install_failed\nlago-basic-suite-master-host-1: install_failed\n\n--------------------- >> end captured logging << ---------------------']]></error>
  132. 12:01:03 [basic-suite.el7.x86_64]   </testcase>
  133. 12:01:03 [basic-suite.el7.x86_64] </testsuite>
RAW Paste Data

Adblocker detected! Please consider disabling it...

We've detected AdBlock Plus or some other adblocking software preventing Pastebin.com from fully loading.

We don't have any obnoxious sound, or popup ads, we actively block these annoying types of ads!

Please add Pastebin.com to your ad blocker whitelist or disable your adblocking software.

×