Guest User

Untitled

a guest
Jan 14th, 2017
149
Never
Not a member of Pastebin yet? Sign Up, it unlocks many cool features!
  1. C:\Users\Cyrell\Documents\MCP\ForgeGradle 1.7.10 + 1.8\Forge 1.9.4-v12.17.0.2051
  2. >gradlew setupDecompWorkspace --stacktrace
  3. To honour the JVM settings for this build a new JVM will be forked. Please consi
  4. der using the daemon: https://docs.gradle.org/2.7/userguide/gradle_daemon.html.
  5. #################################################
  6. ForgeGradle 2.2-SNAPSHOT-e77786c
  7. https://github.com/MinecraftForge/ForgeGradle
  8. #################################################
  9. Powered by MCP unknown
  10. http://modcoderpack.com
  11. by: Searge, ProfMobius, Fesh0r,
  12. R4wk, ZeuX, IngisKahn, bspkrs
  13. #################################################
  14. :deobfCompileDummyTask
  15. :deobfProvidedDummyTask
  16. :getVersionJson
  17. :extractUserdev UP-TO-DATE
  18. :extractDependencyATs SKIPPED
  19. :extractMcpData SKIPPED
  20. :extractMcpMappings SKIPPED
  21. :genSrgs SKIPPED
  22. :downloadClient SKIPPED
  23. :downloadServer SKIPPED
  24. :splitServerJar SKIPPED
  25. :mergeJars SKIPPED
  26. :deobfMcSRG SKIPPED
  27. :decompileMc SKIPPED
  28. :fixMcSources SKIPPED
  29. :applySourcePatches SKIPPED
  30. :remapMcSources SKIPPED
  31. :recompileMc FAILED
  32.  
  33. FAILURE: Build failed with an exception.
  34.  
  35. * What went wrong:
  36. Execution failed for task ':recompileMc'.
  37. > Compile failed; see the compiler error output for details.
  38.  
  39. * Try:
  40. Run with --info or --debug option to get more log output.
  41.  
  42. * Exception is:
  43. org.gradle.api.tasks.TaskExecutionException: Execution failed for task ':recompi
  44. leMc'.
  45. at org.gradle.api.internal.tasks.execution.ExecuteActionsTaskExecuter.ex
  46. ecuteActions(ExecuteActionsTaskExecuter.java:69)
  47. at org.gradle.api.internal.tasks.execution.ExecuteActionsTaskExecuter.ex
  48. ecute(ExecuteActionsTaskExecuter.java:46)
  49. at org.gradle.api.internal.tasks.execution.PostExecutionAnalysisTaskExec
  50. uter.execute(PostExecutionAnalysisTaskExecuter.java:35)
  51. at org.gradle.api.internal.tasks.execution.SkipUpToDateTaskExecuter.exec
  52. ute(SkipUpToDateTaskExecuter.java:64)
  53. at org.gradle.api.internal.tasks.execution.ValidatingTaskExecuter.execut
  54. e(ValidatingTaskExecuter.java:58)
  55. at org.gradle.api.internal.tasks.execution.SkipEmptySourceFilesTaskExecu
  56. ter.execute(SkipEmptySourceFilesTaskExecuter.java:52)
  57. at org.gradle.api.internal.tasks.execution.SkipTaskWithNoActionsExecuter
  58. .execute(SkipTaskWithNoActionsExecuter.java:52)
  59. at org.gradle.api.internal.tasks.execution.SkipOnlyIfTaskExecuter.execut
  60. e(SkipOnlyIfTaskExecuter.java:53)
  61. at org.gradle.api.internal.tasks.execution.ExecuteAtMostOnceTaskExecuter
  62. .execute(ExecuteAtMostOnceTaskExecuter.java:43)
  63. at org.gradle.execution.taskgraph.DefaultTaskGraphExecuter$EventFiringTa
  64. skWorker.execute(DefaultTaskGraphExecuter.java:203)
  65. at org.gradle.execution.taskgraph.DefaultTaskGraphExecuter$EventFiringTa
  66. skWorker.execute(DefaultTaskGraphExecuter.java:185)
  67. at org.gradle.execution.taskgraph.AbstractTaskPlanExecutor$TaskExecutorW
  68. orker.processTask(AbstractTaskPlanExecutor.java:62)
  69. at org.gradle.execution.taskgraph.AbstractTaskPlanExecutor$TaskExecutorW
  70. orker.run(AbstractTaskPlanExecutor.java:50)
  71. at org.gradle.execution.taskgraph.DefaultTaskPlanExecutor.process(Defaul
  72. tTaskPlanExecutor.java:25)
  73. at org.gradle.execution.taskgraph.DefaultTaskGraphExecuter.execute(Defau
  74. ltTaskGraphExecuter.java:110)
  75. at org.gradle.execution.SelectedTaskExecutionAction.execute(SelectedTask
  76. ExecutionAction.java:37)
  77. at org.gradle.execution.DefaultBuildExecuter.execute(DefaultBuildExecute
  78. r.java:37)
  79. at org.gradle.execution.DefaultBuildExecuter.access$000(DefaultBuildExec
  80. uter.java:23)
  81. at org.gradle.execution.DefaultBuildExecuter$1.proceed(DefaultBuildExecu
  82. ter.java:43)
  83. at org.gradle.execution.DryRunBuildExecutionAction.execute(DryRunBuildEx
  84. ecutionAction.java:32)
  85. at org.gradle.execution.DefaultBuildExecuter.execute(DefaultBuildExecute
  86. r.java:37)
  87. at org.gradle.execution.DefaultBuildExecuter.execute(DefaultBuildExecute
  88. r.java:30)
  89. at org.gradle.initialization.DefaultGradleLauncher$4.run(DefaultGradleLa
  90. uncher.java:155)
  91. at org.gradle.internal.Factories$1.create(Factories.java:22)
  92. at org.gradle.internal.progress.DefaultBuildOperationExecutor.run(Defaul
  93. tBuildOperationExecutor.java:90)
  94. at org.gradle.internal.progress.DefaultBuildOperationExecutor.run(Defaul
  95. tBuildOperationExecutor.java:52)
  96. at org.gradle.initialization.DefaultGradleLauncher.doBuildStages(Default
  97. GradleLauncher.java:152)
  98. at org.gradle.initialization.DefaultGradleLauncher.access$200(DefaultGra
  99. dleLauncher.java:33)
  100. at org.gradle.initialization.DefaultGradleLauncher$1.create(DefaultGradl
  101. eLauncher.java:100)
  102. at org.gradle.initialization.DefaultGradleLauncher$1.create(DefaultGradl
  103. eLauncher.java:94)
  104. at org.gradle.internal.progress.DefaultBuildOperationExecutor.run(Defaul
  105. tBuildOperationExecutor.java:90)
  106. at org.gradle.internal.progress.DefaultBuildOperationExecutor.run(Defaul
  107. tBuildOperationExecutor.java:62)
  108. at org.gradle.initialization.DefaultGradleLauncher.doBuild(DefaultGradle
  109. Launcher.java:94)
  110. at org.gradle.initialization.DefaultGradleLauncher.run(DefaultGradleLaun
  111. cher.java:83)
  112. at org.gradle.launcher.exec.InProcessBuildActionExecuter$DefaultBuildCon
  113. troller.run(InProcessBuildActionExecuter.java:94)
  114. at org.gradle.tooling.internal.provider.ExecuteBuildActionRunner.run(Exe
  115. cuteBuildActionRunner.java:28)
  116. at org.gradle.launcher.exec.ChainingBuildActionRunner.run(ChainingBuildA
  117. ctionRunner.java:35)
  118. at org.gradle.launcher.exec.InProcessBuildActionExecuter.execute(InProce
  119. ssBuildActionExecuter.java:43)
  120. at org.gradle.launcher.exec.InProcessBuildActionExecuter.execute(InProce
  121. ssBuildActionExecuter.java:28)
  122. at org.gradle.launcher.exec.ContinuousBuildActionExecuter.execute(Contin
  123. uousBuildActionExecuter.java:77)
  124. at org.gradle.launcher.exec.ContinuousBuildActionExecuter.execute(Contin
  125. uousBuildActionExecuter.java:47)
  126. at org.gradle.launcher.daemon.server.exec.ExecuteBuild.doBuild(ExecuteBu
  127. ild.java:52)
  128. at org.gradle.launcher.daemon.server.exec.BuildCommandOnly.execute(Build
  129. CommandOnly.java:36)
  130. at org.gradle.launcher.daemon.server.api.DaemonCommandExecution.proceed(
  131. DaemonCommandExecution.java:120)
  132. at org.gradle.launcher.daemon.server.exec.WatchForDisconnection.execute(
  133. WatchForDisconnection.java:37)
  134. at org.gradle.launcher.daemon.server.api.DaemonCommandExecution.proceed(
  135. DaemonCommandExecution.java:120)
  136. at org.gradle.launcher.daemon.server.exec.ResetDeprecationLogger.execute
  137. (ResetDeprecationLogger.java:26)
  138. at org.gradle.launcher.daemon.server.api.DaemonCommandExecution.proceed(
  139. DaemonCommandExecution.java:120)
  140. at org.gradle.launcher.daemon.server.exec.RequestStopIfSingleUsedDaemon.
  141. execute(RequestStopIfSingleUsedDaemon.java:34)
  142. at org.gradle.launcher.daemon.server.api.DaemonCommandExecution.proceed(
  143. DaemonCommandExecution.java:120)
  144. at org.gradle.launcher.daemon.server.exec.ForwardClientInput$2.call(Forw
  145. ardClientInput.java:74)
  146. at org.gradle.launcher.daemon.server.exec.ForwardClientInput$2.call(Forw
  147. ardClientInput.java:72)
  148. at org.gradle.util.Swapper.swap(Swapper.java:38)
  149. at org.gradle.launcher.daemon.server.exec.ForwardClientInput.execute(For
  150. wardClientInput.java:72)
  151. at org.gradle.launcher.daemon.server.api.DaemonCommandExecution.proceed(
  152. DaemonCommandExecution.java:120)
  153. at org.gradle.launcher.daemon.server.health.DaemonHealthTracker.execute(
  154. DaemonHealthTracker.java:40)
  155. at org.gradle.launcher.daemon.server.api.DaemonCommandExecution.proceed(
  156. DaemonCommandExecution.java:120)
  157. at org.gradle.launcher.daemon.server.exec.LogToClient.doBuild(LogToClien
  158. t.java:66)
  159. at org.gradle.launcher.daemon.server.exec.BuildCommandOnly.execute(Build
  160. CommandOnly.java:36)
  161. at org.gradle.launcher.daemon.server.api.DaemonCommandExecution.proceed(
  162. DaemonCommandExecution.java:120)
  163. at org.gradle.launcher.daemon.server.exec.EstablishBuildEnvironment.doBu
  164. ild(EstablishBuildEnvironment.java:71)
  165. at org.gradle.launcher.daemon.server.exec.BuildCommandOnly.execute(Build
  166. CommandOnly.java:36)
  167. at org.gradle.launcher.daemon.server.api.DaemonCommandExecution.proceed(
  168. DaemonCommandExecution.java:120)
  169. at org.gradle.launcher.daemon.server.health.HintGCAfterBuild.execute(Hin
  170. tGCAfterBuild.java:41)
  171. at org.gradle.launcher.daemon.server.api.DaemonCommandExecution.proceed(
  172. DaemonCommandExecution.java:120)
  173. at org.gradle.launcher.daemon.server.exec.StartBuildOrRespondWithBusy$1.
  174. run(StartBuildOrRespondWithBusy.java:50)
  175. at org.gradle.launcher.daemon.server.DaemonStateCoordinator$1.run(Daemon
  176. StateCoordinator.java:246)
  177. at org.gradle.internal.concurrent.ExecutorPolicy$CatchAndRecordFailures.
  178. onExecute(ExecutorPolicy.java:54)
  179. at org.gradle.internal.concurrent.StoppableExecutorImpl$1.run(StoppableE
  180. xecutorImpl.java:40)
  181. Caused by: : Compile failed; see the compiler error output for details.
  182. at org.apache.tools.ant.taskdefs.Javac.compile(Javac.java:1174)
  183. at org.apache.tools.ant.taskdefs.Javac.execute(Javac.java:930)
  184. at org.apache.tools.ant.UnknownElement.execute(UnknownElement.java:292)
  185. at org.apache.tools.ant.dispatch.DispatchUtils.execute(DispatchUtils.jav
  186. a:106)
  187. at org.gradle.api.internal.project.ant.BasicAntBuilder.nodeCompleted(Bas
  188. icAntBuilder.java:77)
  189. at org.gradle.api.internal.project.ant.BasicAntBuilder.doInvokeMethod(Ba
  190. sicAntBuilder.java:92)
  191. at net.minecraftforge.gradle.user.TaskRecompileMc.doStuff(TaskRecompileM
  192. c.java:85)
  193. at org.gradle.internal.reflect.JavaMethod.invoke(JavaMethod.java:75)
  194. at org.gradle.api.internal.project.taskfactory.AnnotationProcessingTaskF
  195. actory$StandardTaskAction.doExecute(AnnotationProcessingTaskFactory.java:226)
  196. at org.gradle.api.internal.project.taskfactory.AnnotationProcessingTaskF
  197. actory$StandardTaskAction.execute(AnnotationProcessingTaskFactory.java:219)
  198. at org.gradle.api.internal.project.taskfactory.AnnotationProcessingTaskF
  199. actory$StandardTaskAction.execute(AnnotationProcessingTaskFactory.java:208)
  200. at org.gradle.api.internal.AbstractTask$TaskActionWrapper.execute(Abstra
  201. ctTask.java:585)
  202. at org.gradle.api.internal.AbstractTask$TaskActionWrapper.execute(Abstra
  203. ctTask.java:568)
  204. at org.gradle.api.internal.tasks.execution.ExecuteActionsTaskExecuter.ex
  205. ecuteAction(ExecuteActionsTaskExecuter.java:80)
  206. at org.gradle.api.internal.tasks.execution.ExecuteActionsTaskExecuter.ex
  207. ecuteActions(ExecuteActionsTaskExecuter.java:61)
  208. ... 68 more
  209.  
  210.  
  211. BUILD FAILED
  212.  
  213. Total time: 1 mins 40.112 secs
  214.  
  215. C:\Users\Cyrell\Documents\MCP\ForgeGradle 1.7.10 + 1.8\Forge 1.9.4-v12.17.0.2051
  216. >
RAW Paste Data