SHARE
TWEET

Untitled

a guest Oct 4th, 2017 80 Never
Not a member of Pastebin yet? Sign Up, it unlocks many cool features!
  1. pom.contributors=
  2. project.build.developers=
  3. classworlds.conf=C\:\\ws\\DevSuite2.0.1\\.metadata\\.plugins\\org.eclipse.m2e.launching\\launches\\m2conf3499084163798502399.tmp
  4. project.description=A simple Camel route in Karaf container
  5. pom.pomFile=C\:\\ws\\DevSuite2.0.1\\karaf-fis\\pom.xml
  6. java.endorsed.dirs=C\:\\Program Files\\Java\\jdk1.8.0_112\\jre\\lib\\endorsed
  7. project.build.groupId=org.karaf.fis
  8. env.USERNAME=Aurelien Pupier
  9. maven-bundle-plugin.version=2.3.7
  10. sun.os.patch.level=
  11. java.vendor.url=http\://java.oracle.com/
  12. env.COMPUTERNAME=DESKTOP-9NT300B
  13. env.\=C\:=C\:\\install\\DevelopmentSuite-2.0.1\\devstudio
  14. pom.profiles=
  15. maven-symbolicname=org.karaf.fis.karaf-fis
  16. java.version=1.8.0_112
  17. env.FPS_BROWSER_APP_PROFILE_STRING=Internet Explorer
  18. project.build.contributors=
  19. java.vendor.url.bug=http\://bugreport.sun.com/bugreport/
  20. env.USERPROFILE=C\:\\Users\\Aurelien Pupier
  21. pom.description=A simple Camel route in Karaf container
  22. user.name=Aurelien Pupier
  23. project.build.pomFile=C\:\\ws\\DevSuite2.0.1\\karaf-fis\\pom.xml
  24. sun.io.unicode.encoding=UnicodeLittle
  25. sun.jnu.encoding=Cp1252
  26. java.runtime.name=Java(TM) SE Runtime Environment
  27. project.build.outputdirectory=C\:\\ws\\DevSuite2.0.1\\karaf-fis\\target\\classes
  28. env.LOCALAPPDATA=C\:\\Users\\Aurelien Pupier\\AppData\\Local
  29. env.COMMONPROGRAMW6432=C\:\\Program Files\\Common Files
  30. env.VS140COMNTOOLS=C\:\\Program Files (x86)\\Microsoft Visual Studio 14.0\\Common7\\Tools\\
  31. project.version=1.0.0-SNAPSHOT
  32. java.specification.name=Java Platform API Specification
  33. user.timezone=Europe/Paris
  34. pom.mailingLists=
  35. user.script=
  36. path.separator=;
  37. project.contributors=
  38. pom.artifactId=karaf-fis
  39. env.PROCESSOR_IDENTIFIER=Intel64 Family 6 Model 60 Stepping 3, GenuineIntel
  40. project.name=Fabric8 \:\: Quickstarts \:\: Karaf \:\: Camel Log
  41. file.encoding=Cp1252
  42. sun.java.command=org.codehaus.plexus.classworlds.launcher.Launcher -B -X -e clean install
  43. env.NUMBER_OF_PROCESSORS=8
  44. env.APPDATA=C\:\\Users\\Aurelien Pupier\\AppData\\Roaming
  45. project.id=org.karaf.fis\:karaf-fis\:bundle\:1.0.0-SNAPSHOT
  46. env.WINDIR=C\:\\WINDOWS
  47. Export-Package=;-split-package\:\=merge-first
  48. java.io.tmpdir=C\:\\Users\\AURELI~1\\AppData\\Local\\Temp\\
  49. project.build.mailingLists=
  50. user.language=en
  51. Include-Resource={assembly/etc/org.ops4j.pax.logging.cfg\=src/main/resources/assembly/etc/org.ops4j.pax.logging.cfg},{OSGI-INF/blueprint/camel-log.xml\=src/main/resources/OSGI-INF/blueprint/camel-log.xml}
  52. fabric8.internal.effective.platform.mode=openshift
  53. line.separator=\r\n
  54. project.build.directory=C\:\\ws\\DevSuite2.0.1\\karaf-fis\\target
  55. env.COMMONPROGRAMFILES=C\:\\Program Files\\Common Files
  56. java.vm.info=mixed mode
  57. sun.desktop=windows
  58. java.vm.specification.name=Java Virtual Machine Specification
  59. project.modelEncoding=UTF-8
  60. project.build.id=org.karaf.fis\:karaf-fis\:bundle\:1.0.0-SNAPSHOT
  61. env.PATHEXT=.COM;.EXE;.BAT;.CMD;.VBS;.VBE;.JS;.JSE;.WSF;.WSH;.MSC
  62. env.ONEDRIVE=C\:\\Users\\Aurelien Pupier\\OneDrive
  63. env.USERDOMAIN_ROAMINGPROFILE=DESKTOP-9NT300B
  64. project.build.licenses=
  65. pom.modelVersion=4.0.0
  66. project.licenses=
  67. env.LOGONSERVER=\\\\DESKTOP-9NT300B
  68. env.PSMODULEPATH=C\:\\Program Files\\WindowsPowerShell\\Modules;C\:\\WINDOWS\\system32\\WindowsPowerShell\\v1.0\\Modules
  69. project.developers=
  70. java.awt.printerjob=sun.awt.windows.WPrinterJob
  71. -removeheaders=Include-Resource,Private-Package
  72. env.DOCKER_VM_IP=10.0.75.2/24
  73. env.PUBLIC=C\:\\Users\\Public
  74. pom.version=1.0.0-SNAPSHOT
  75. env.USERDOMAIN=DESKTOP-9NT300B
  76. env.VBOX_MSI_INSTALL_PATH=C\:\\Program Files\\Oracle\\VirtualBox\\
  77. -plugin=org.apache.felix.bundleplugin.BlueprintPlugin,aQute.lib.spring.SpringXMLType
  78. project.mailingLists=
  79. pom.packaging=bundle
  80. env.PROCESSOR_LEVEL=6
  81. fabric8.maven.plugin.version=3.2.13
  82. env.PROGRAMFILES(X86)=C\:\\Program Files (x86)
  83. Bundle-Description=A simple Camel route in Karaf container
  84. env.DOCKER_TLS_VERIFY-BAK=1
  85. camel.version=2.18.1
  86. project.projectDirectory=C\:\\ws\\DevSuite2.0.1\\karaf-fis
  87. os.name=Windows 10
  88. project.build.modelVersion=4.0.0
  89. java.specification.vendor=Oracle Corporation
  90. env.VAGRANT_HOME=C\:\\install\\.vagrant_home
  91. env.TMP=C\:\\Users\\AURELI~1\\AppData\\Local\\Temp
  92. java.vm.name=Java HotSpot(TM) 64-Bit Server VM
  93. env.OS=Windows_NT
  94. java.library.path=C\:\\Program Files\\Java\\jdk1.8.0_112\\bin;C\:\\WINDOWS\\Sun\\Java\\bin;C\:\\WINDOWS\\system32;C\:\\WINDOWS;C\:\\Program Files\\Docker\\Docker\\Resources\\bin;C\:\\ProgramData\\Oracle\\Java\\javapath;C\:\\WINDOWS\\system32;C\:\\WINDOWS;C\:\\WINDOWS\\System32\\Wbem;C\:\\WINDOWS\\System32\\WindowsPowerShell\\v1.0\\;C\:\\Program Files (x86)\\PuTTY\\;C\:\\HashiCorp\\Vagrant\\bin;C\:\\Program Files\\Git\\cmd;C\:\\DevelopmentSuite-1.2.0-161205-1202\\jdk8\\bin;C\:\\Program Files (x86)\\Windows Kits\\10\\Windows Performance Toolkit\\;C\:\\Program Files (x86)\\Skype\\Phone\\;C\:\\Program Files\\nodejs\\;C\:\\Program Files\\TortoiseHg\\;C\:\\Program Files\\OpenVPN\\bin;c\:\\install\\DevelopemtnSuite-171003\\cdk\\bin;c\:\\install\\DevelopemtnSuite-171003\\kompose;C\:\\Users\\Aurelien Pupier\\.minishift\\cache\\oc\\v3.6.173.0.5;c\:\\install\\DevelopmentSuite-2.0.1\\cdk\\bin;c\:\\install\\DevelopmentSuite-2.0.1\\cygwin\\bin;c\:\\install\\DevelopmentSuite-2.0.1\\kompose;C\:\\Users\\Aurelien Pupier\\.minishift\\cache\\oc\\v3.5.5.31;c\:\\install\\DevelopmentSuite-2.0\\cdk\\bin;c\:\\install\\DevelopmentSuite-2.0\\cygwin\\bin;c\:\\install\\DevelopmentSuite-2.0\\kompose;c\:\\install\\DevelopmentSuite-1.4.0-170425-1124\\cdk\\bin;c\:\\install\\DevelopmentSuite-1.4.0-170425-1124\\kompose;C\:\\Users\\Aurelien Pupier\\.minishift\\cache\\oc\\v3.4.1.2;c\:\\DevelopmentSuite-1.3.0-172802\\cdk\\bin;c\:\\DevelopmentSuite-161220-1700\\cdk\\bin;c\:\\DevelopmentSuite-1.2.0-161205-1202\\cdk\\bin;c\:\\install\\DevelopmentSuite-1.1.0\\cdk\\bin;c\:\\install\\DevelopmentSuite\\cdk\\bin;C\:\\HashiCorp\\Vagrant\\bin;c\:\\install\\DevelopmentSuite\\cygwin\\bin;C\:\\Program Files\\Docker Toolbox;C\:\\install\\apache-maven-3.3.9-bin\\apache-maven-3.3.9\\bin;C\:\\Program Files\\Git\\bin;C\:\\Users\\Aurelien Pupier\\AppData\\Local\\Microsoft\\WindowsApps;C\:\\install\\che;C\:\\minishift\\minishift-windows-amd64.exe;C\:\\Program Files (x86)\\Microsoft VS Code\\bin;C\:\\Users\\Aurelien Pupier\\AppData\\Roaming\\npm;C\:\\Users\\Aurelien Pupier\\AppData\\Local\\Microsoft\\WindowsApps;;.
  95. project.build.build=org.apache.maven.model.Build@7f2c995b
  96. env.PROGRAMW6432=C\:\\Program Files
  97. env.PATH=C\:\\Program Files\\Docker\\Docker\\Resources\\bin;C\:\\ProgramData\\Oracle\\Java\\javapath;C\:\\WINDOWS\\system32;C\:\\WINDOWS;C\:\\WINDOWS\\System32\\Wbem;C\:\\WINDOWS\\System32\\WindowsPowerShell\\v1.0\\;C\:\\Program Files (x86)\\PuTTY\\;C\:\\HashiCorp\\Vagrant\\bin;C\:\\Program Files\\Git\\cmd;C\:\\DevelopmentSuite-1.2.0-161205-1202\\jdk8\\bin;C\:\\Program Files (x86)\\Windows Kits\\10\\Windows Performance Toolkit\\;C\:\\Program Files (x86)\\Skype\\Phone\\;C\:\\Program Files\\nodejs\\;C\:\\Program Files\\TortoiseHg\\;C\:\\Program Files\\OpenVPN\\bin;c\:\\install\\DevelopemtnSuite-171003\\cdk\\bin;c\:\\install\\DevelopemtnSuite-171003\\kompose;C\:\\Users\\Aurelien Pupier\\.minishift\\cache\\oc\\v3.6.173.0.5;c\:\\install\\DevelopmentSuite-2.0.1\\cdk\\bin;c\:\\install\\DevelopmentSuite-2.0.1\\cygwin\\bin;c\:\\install\\DevelopmentSuite-2.0.1\\kompose;C\:\\Users\\Aurelien Pupier\\.minishift\\cache\\oc\\v3.5.5.31;c\:\\install\\DevelopmentSuite-2.0\\cdk\\bin;c\:\\install\\DevelopmentSuite-2.0\\cygwin\\bin;c\:\\install\\DevelopmentSuite-2.0\\kompose;c\:\\install\\DevelopmentSuite-1.4.0-170425-1124\\cdk\\bin;c\:\\install\\DevelopmentSuite-1.4.0-170425-1124\\kompose;C\:\\Users\\Aurelien Pupier\\.minishift\\cache\\oc\\v3.4.1.2;c\:\\DevelopmentSuite-1.3.0-172802\\cdk\\bin;c\:\\DevelopmentSuite-161220-1700\\cdk\\bin;c\:\\DevelopmentSuite-1.2.0-161205-1202\\cdk\\bin;c\:\\install\\DevelopmentSuite-1.1.0\\cdk\\bin;c\:\\install\\DevelopmentSuite\\cdk\\bin;C\:\\HashiCorp\\Vagrant\\bin;c\:\\install\\DevelopmentSuite\\cygwin\\bin;C\:\\Program Files\\Docker Toolbox;C\:\\install\\apache-maven-3.3.9-bin\\apache-maven-3.3.9\\bin;C\:\\Program Files\\Git\\bin;C\:\\Users\\Aurelien Pupier\\AppData\\Local\\Microsoft\\WindowsApps;C\:\\install\\che;C\:\\minishift\\minishift-windows-amd64.exe;C\:\\Program Files (x86)\\Microsoft VS Code\\bin;C\:\\Users\\Aurelien Pupier\\AppData\\Roaming\\npm;C\:\\Users\\Aurelien Pupier\\AppData\\Local\\Microsoft\\WindowsApps;
  98. fabric8.version=2.2.192
  99. pom.build=org.apache.maven.model.Build@7f2c995b
  100. java.class.version=52.0
  101. maven.multiModuleProjectDirectory=C\:\\ws\\DevSuite2.0.1\\karaf-fis
  102. project.build.version=1.0.0-SNAPSHOT
  103. env.DOCKER_HOST-BACK=tcp\://10.1.2.2\:2376
  104. pom.projectDirectory=C\:\\ws\\DevSuite2.0.1\\karaf-fis
  105. project.modelVersion=4.0.0
  106. env.HOMEDRIVE=C\:
  107. env.SYSTEMROOT=C\:\\WINDOWS
  108. env.COMSPEC=C\:\\WINDOWS\\system32\\cmd.exe
  109. Bundle-SymbolicName=org.karaf.fis.karaf-fis
  110. sun.boot.library.path=C\:\\Program Files\\Java\\jdk1.8.0_112\\jre\\bin
  111. project.build.sourceEncoding=UTF-8
  112. env.SYSTEMDRIVE=C\:
  113. Private-Package=\!*
  114. env.PROCESSOR_REVISION=3c03
  115. project.build.artifactId=karaf-fis
  116. sun.management.compiler=HotSpot 64-Bit Tiered Compilers
  117. java.awt.graphicsenv=sun.awt.Win32GraphicsEnvironment
  118. user.variant=
  119. pom.name=Fabric8 \:\: Quickstarts \:\: Karaf \:\: Camel Log
  120. env.DOCKER_MACHINE_NAME-BAK=498b304
  121. pom.developers=
  122. project.build=org.apache.maven.model.Build@7f2c995b
  123. maven-install-plugin.version=2.5.2
  124. project.baseDir=C\:\\ws\\DevSuite2.0.1\\karaf-fis
  125. project.build.name=Fabric8 \:\: Quickstarts \:\: Karaf \:\: Camel Log
  126. env.PROGRAMFILES=C\:\\Program Files
  127. java.vm.specification.version=1.8
  128. project.build.description=A simple Camel route in Karaf container
  129. project.groupId=org.karaf.fis
  130. Bundle-Version=1.0.0.SNAPSHOT
  131. env.PROGRAMDATA=C\:\\ProgramData
  132. env.DOCKER_CERT_PATH-BAK=C\:\\certificate
  133. env.HYPERV_VIRTUAL_SWITCH=ExternalVirtualSwitch
  134. docker.image.user=myproject
  135. awt.toolkit=sun.awt.windows.WToolkit
  136. sun.cpu.isalist=amd64
  137. project.build.profiles=
  138. env.MAVEN_HOME=C\:\\install\\apache-maven-3.3.9-bin\\apache-maven-3.3.9
  139. project.profiles=
  140. java.ext.dirs=C\:\\Program Files\\Java\\jdk1.8.0_112\\jre\\lib\\ext;C\:\\WINDOWS\\Sun\\Java\\lib\\ext
  141. maven-compiler-plugin.version=3.6.0
  142. Import-Package=*
  143. os.version=10.0
  144. user.home=C\:\\Users\\Aurelien Pupier
  145. java.vm.vendor=Oracle Corporation
  146. env.GITHUB_CLIENT_SECRET=e3e1e0a37992b30af59c65cbe0368af152f7619f
  147. env.JAVA_HOME=C\:\\Program Files\\Java\\jdk1.8.0_112
  148. user.dir=C\:\\ws\\DevSuite2.0.1\\karaf-fis
  149. project.build.modelEncoding=UTF-8
  150. env.COMMONPROGRAMFILES(X86)=C\:\\Program Files (x86)\\Common Files
  151. env.CHE_VERSION=nightly
  152. sun.cpu.endian=little
  153. env.ALLUSERSPROFILE=C\:\\ProgramData
  154. pom.licenses=
  155. project.dir=C\:\\ws\\DevSuite2.0.1\\karaf-fis
  156. classifier=
  157. env.PROCESSOR_ARCHITECTURE=AMD64
  158. java.vm.version=25.112-b15
  159. java.class.path=/C\:/install/DevelopmentSuite-2.0.1/devstudio/studio/plugins/org.eclipse.m2e.maven.runtime_1.7.1.20161104-1803/jars/plexus-classworlds-2.5.2.jar
  160. env.\=\:\:=\:\:\\
  161. env.GIT_HOME=C\:\\Program Files\\Git
  162. org.slf4j.simpleLogger.defaultLogLevel=debug
  163. env.HOMEPATH=\\Users\\Aurelien Pupier
  164. os.arch=amd64
  165. maven.build.version=Apache Maven 3.3.9 (bb52d8502b132ec0a5a3f4c09453c07478323dc5; 2015-11-10T17\:41\:47+01\:00)
  166. project.build.projectDirectory=C\:\\ws\\DevSuite2.0.1\\karaf-fis
  167. env.SESSIONNAME=Console
  168. sun.java.launcher=SUN_STANDARD
  169. project.packaging=bundle
  170. java.vm.specification.vendor=Oracle Corporation
  171. file.separator=\\
  172. java.runtime.version=1.8.0_112-b15
  173. project.pomFile=C\:\\ws\\DevSuite2.0.1\\karaf-fis\\pom.xml
  174. sun.boot.class.path=C\:\\Program Files\\Java\\jdk1.8.0_112\\jre\\lib\\resources.jar;C\:\\Program Files\\Java\\jdk1.8.0_112\\jre\\lib\\rt.jar;C\:\\Program Files\\Java\\jdk1.8.0_112\\jre\\lib\\sunrsasign.jar;C\:\\Program Files\\Java\\jdk1.8.0_112\\jre\\lib\\jsse.jar;C\:\\Program Files\\Java\\jdk1.8.0_112\\jre\\lib\\jce.jar;C\:\\Program Files\\Java\\jdk1.8.0_112\\jre\\lib\\charsets.jar;C\:\\Program Files\\Java\\jdk1.8.0_112\\jre\\lib\\jfr.jar;C\:\\Program Files\\Java\\jdk1.8.0_112\\jre\\classes
  175. project.build.packaging=bundle
  176. maven.version=3.3.9
  177. env.GYP_MSVS_VERSION=2015
  178. env.TEMP=C\:\\Users\\AURELI~1\\AppData\\Local\\Temp
  179. project.artifactId=karaf-fis
  180. user.country=US
  181. env.FPS_BROWSER_USER_PROFILE_STRING=Default
  182. pom.modelEncoding=UTF-8
  183. maven.home=C\:\\ws\\DevSuite2.0.1\\karaf-fis\\EMBEDDED
  184. -sourcepath=C\:\\ws\\DevSuite2.0.1\\karaf-fis\\src\\main\\java,C\:\\ws\\DevSuite2.0.1\\karaf-fis\\target\\generated-sources\\annotations
  185. pom.groupId=org.karaf.fis
  186. java.vendor=Oracle Corporation
  187. karaf.version=4.0.8
  188. Bundle-Name=Fabric8 \:\: Quickstarts \:\: Karaf \:\: Camel Log
  189. java.specification.version=1.8
  190. sun.arch.data.model=64
  191. #-----------------------------------------------------------------------
  192.  
  193. [DEBUG] BND Classpath:
  194. #-----------------------------------------------------------------------
  195. -classpath:\
  196.  C:\ws\DevSuite2.0.1\karaf-fis\target\classes,\
  197.  C:\Users\Aurelien Pupier\.m2\repository\org\apache\camel\camel-blueprint\2.18.1\camel-blueprint-2.18.1.jar,\
  198.  C:\Users\Aurelien Pupier\.m2\repository\org\apache\camel\camel-core\2.18.1\camel-core-2.18.1.jar,\
  199.  C:\Users\Aurelien Pupier\.m2\repository\org\slf4j\slf4j-api\1.7.21\slf4j-api-1.7.21.jar,\
  200.  C:\Users\Aurelien Pupier\.m2\repository\org\apache\camel\camel-core-xml\2.18.1\camel-core-xml-2.18.1.jar,\
  201.  C:\Users\Aurelien Pupier\.m2\repository\org\apache\camel\camel-core-osgi\2.18.1\camel-core-osgi-2.18.1.jar,\
  202.  C:\Users\Aurelien Pupier\.m2\repository\com\sun\xml\bind\jaxb-core\2.2.11\jaxb-core-2.2.11.jar,\
  203.  C:\Users\Aurelien Pupier\.m2\repository\com\sun\xml\bind\jaxb-impl\2.2.11\jaxb-impl-2.2.11.jar,\
  204.  C:\Users\Aurelien Pupier\.m2\repository\org\apache\karaf\features\base\4.0.8\base-4.0.8.jar,\
  205.  C:\Users\Aurelien Pupier\.m2\repository\org\apache\karaf\org.apache.karaf.main\4.0.8\org.apache.karaf.main-4.0.8.jar,\
  206.  C:\Users\Aurelien Pupier\.m2\repository\org\apache\karaf\org.apache.karaf.util\4.0.8\org.apache.karaf.util-4.0.8.jar,\
  207.  C:\Users\Aurelien Pupier\.m2\repository\org\apache\felix\org.apache.felix.utils\1.8.4\org.apache.felix.utils-1.8.4.jar,\
  208.  C:\Users\Aurelien Pupier\.m2\repository\org\apache\karaf\org.apache.karaf.exception\4.0.8\org.apache.karaf.exception-4.0.8.jar,\
  209.  C:\Users\Aurelien Pupier\.m2\repository\org\apache\karaf\org.apache.karaf.client\4.0.8\org.apache.karaf.client-4.0.8.jar,\
  210.  C:\Users\Aurelien Pupier\.m2\repository\org\apache\sshd\sshd-core\0.14.0\sshd-core-0.14.0.jar,\
  211.  C:\Users\Aurelien Pupier\.m2\repository\org\apache\karaf\jaas\org.apache.karaf.jaas.boot\4.0.8\org.apache.karaf.jaas.boot-4.0.8.jar,\
  212.  C:\Users\Aurelien Pupier\.m2\repository\org\apache\karaf\diagnostic\org.apache.karaf.diagnostic.boot\4.0.8\org.apache.karaf.diagnostic.boot-4.0.8.jar,\
  213.  C:\Users\Aurelien Pupier\.m2\repository\org\eclipse\tycho\org.eclipse.osgi\3.10.101.v20150820-1432\org.eclipse.osgi-3.10.101.v20150820-1432.jar,\
  214.  C:\Users\Aurelien Pupier\.m2\repository\org\apache\felix\org.apache.felix.framework\5.6.1\org.apache.felix.framework-5.6.1.jar,\
  215.  C:\Users\Aurelien Pupier\.m2\repository\jline\jline\2.14.1\jline-2.14.1.jar,\
  216.  C:\Users\Aurelien Pupier\.m2\repository\org\jledit\core\0.2.1\core-0.2.1.jar,\
  217.  C:\Users\Aurelien Pupier\.m2\repository\org\ops4j\pax\logging\pax-logging-api\1.8.5\pax-logging-api-1.8.5.jar,\
  218.  C:\Users\Aurelien Pupier\.m2\repository\org\ops4j\pax\logging\pax-logging-service\1.8.5\pax-logging-service-1.8.5.jar,\
  219.  C:\Users\Aurelien Pupier\.m2\repository\org\ops4j\pax\url\pax-url-aether\2.5.1\pax-url-aether-2.5.1.jar,\
  220.  C:\Users\Aurelien Pupier\.m2\repository\org\ops4j\pax\url\pax-url-aether-support\2.5.1\pax-url-aether-support-2.5.1.jar,\
  221.  C:\Users\Aurelien Pupier\.m2\repository\org\apache\felix\org.apache.felix.fileinstall\3.5.6\org.apache.felix.fileinstall-3.5.6.jar,\
  222.  C:\Users\Aurelien Pupier\.m2\repository\org\apache\felix\org.apache.felix.configadmin\1.8.8\org.apache.felix.configadmin-1.8.8.jar,\
  223.  C:\Users\Aurelien Pupier\.m2\repository\org\apache\karaf\features\org.apache.karaf.features.core\4.0.8\org.apache.karaf.features.core-4.0.8.jar
  224. #-----------------------------------------------------------------------
  225.  
  226. [DEBUG] BND Manifest:
  227. #-----------------------------------------------------------------------
  228. Manifest-Version: 1.0
  229. Bnd-LastModified: 1507120136978
  230. Bundle-Description: A simple Camel route in Karaf container
  231. Bundle-ManifestVersion: 2
  232. Bundle-Name: Fabric8 :: Quickstarts :: Karaf :: Camel Log
  233. Bundle-SymbolicName: org.karaf.fis.karaf-fis
  234. Bundle-Version: 1.0.0.SNAPSHOT
  235. Created-By: 1.8.0_112 (Oracle Corporation)
  236. Import-Package: org.osgi.service.blueprint;version="[1.0.0,2.0.0)"
  237. Tool: Bnd-1.50.0
  238. #-----------------------------------------------------------------------
  239.  
  240. [DEBUG] Final Manifest:
  241. #-----------------------------------------------------------------------
  242. Manifest-Version: 1.0
  243. Bnd-LastModified: 1507120136978
  244. Build-Jdk: 1.8.0_112
  245. Built-By: Aurelien Pupier
  246. Bundle-Description: A simple Camel route in Karaf container
  247. Bundle-ManifestVersion: 2
  248. Bundle-Name: Fabric8 :: Quickstarts :: Karaf :: Camel Log
  249. Bundle-SymbolicName: org.karaf.fis.karaf-fis
  250. Bundle-Version: 1.0.0.SNAPSHOT
  251. Created-By: Apache Maven Bundle Plugin
  252. Import-Package: org.osgi.service.blueprint;version="[1.0.0,2.0.0)"
  253. Tool: Bnd-1.50.0
  254. #-----------------------------------------------------------------------
  255.  
  256. [WARNING] Bundle org.karaf.fis:karaf-fis:bundle:1.0.0-SNAPSHOT : No translation found for macro: body
  257. [WARNING] Bundle org.karaf.fis:karaf-fis:bundle:1.0.0-SNAPSHOT : No translation found for macro: id
  258. [INFO]
  259. [INFO] --- maven-install-plugin:2.5.2:install (default-install) @ karaf-fis ---
  260. [DEBUG] Dependency collection stats: {ConflictMarker.analyzeTime=0, ConflictMarker.markTime=0, ConflictMarker.nodeCount=40, ConflictIdSorter.graphTime=0, ConflictIdSorter.topsortTime=0, ConflictIdSorter.conflictIdCount=19, ConflictIdSorter.conflictIdCycleCount=0, ConflictResolver.totalTime=0, ConflictResolver.conflictItemCount=40, DefaultDependencyCollector.collectTime=4, DefaultDependencyCollector.transformTime=1}
  261. [DEBUG] org.apache.maven.plugins:maven-install-plugin:jar:2.5.2:
  262. [DEBUG]    org.apache.maven:maven-plugin-api:jar:2.2.1:compile
  263. [DEBUG]    org.apache.maven:maven-project:jar:2.2.1:compile
  264. [DEBUG]       org.apache.maven:maven-settings:jar:2.2.1:compile
  265. [DEBUG]       org.apache.maven:maven-profile:jar:2.2.1:compile
  266. [DEBUG]       org.apache.maven:maven-plugin-registry:jar:2.2.1:compile
  267. [DEBUG]       org.codehaus.plexus:plexus-interpolation:jar:1.11:compile
  268. [DEBUG]       org.codehaus.plexus:plexus-container-default:jar:1.0-alpha-9-stable-1:compile
  269. [DEBUG]          junit:junit:jar:3.8.1:compile
  270. [DEBUG]          classworlds:classworlds:jar:1.1-alpha-2:compile
  271. [DEBUG]    org.apache.maven:maven-model:jar:2.2.1:compile
  272. [DEBUG]    org.apache.maven:maven-artifact-manager:jar:2.2.1:compile
  273. [DEBUG]       org.apache.maven:maven-repository-metadata:jar:2.2.1:compile
  274. [DEBUG]       backport-util-concurrent:backport-util-concurrent:jar:3.1:compile
  275. [DEBUG]    org.apache.maven:maven-artifact:jar:2.2.1:compile
  276. [DEBUG]    commons-codec:commons-codec:jar:1.6:compile
  277. [DEBUG]    org.apache.maven.shared:maven-shared-utils:jar:0.4:compile
  278. [DEBUG]       com.google.code.findbugs:jsr305:jar:2.0.1:compile
  279. [DEBUG]    org.codehaus.plexus:plexus-utils:jar:3.0.15:compile
  280. [DEBUG] Created new class realm plugin>org.apache.maven.plugins:maven-install-plugin:2.5.2
  281. [DEBUG] Importing foreign packages into class realm plugin>org.apache.maven.plugins:maven-install-plugin:2.5.2
  282. [DEBUG]   Imported:  < project>org.karaf.fis:karaf-fis:1.0.0-SNAPSHOT
  283. [DEBUG] Populating class realm plugin>org.apache.maven.plugins:maven-install-plugin:2.5.2
  284. [DEBUG]   Included: org.apache.maven.plugins:maven-install-plugin:jar:2.5.2
  285. [DEBUG]   Included: org.codehaus.plexus:plexus-interpolation:jar:1.11
  286. [DEBUG]   Included: junit:junit:jar:3.8.1
  287. [DEBUG]   Included: backport-util-concurrent:backport-util-concurrent:jar:3.1
  288. [DEBUG]   Included: commons-codec:commons-codec:jar:1.6
  289. [DEBUG]   Included: org.apache.maven.shared:maven-shared-utils:jar:0.4
  290. [DEBUG]   Included: com.google.code.findbugs:jsr305:jar:2.0.1
  291. [DEBUG]   Included: org.codehaus.plexus:plexus-utils:jar:3.0.15
  292. [DEBUG] Configuring mojo org.apache.maven.plugins:maven-install-plugin:2.5.2:install from plugin realm ClassRealm[plugin>org.apache.maven.plugins:maven-install-plugin:2.5.2, parent: sun.misc.Launcher$AppClassLoader@55f96302]
  293. [DEBUG] Configuring mojo 'org.apache.maven.plugins:maven-install-plugin:2.5.2:install' with basic configurator -->
  294. [DEBUG]   (f) artifact = org.karaf.fis:karaf-fis:bundle:1.0.0-SNAPSHOT
  295. [DEBUG]   (f) attachedArtifacts = [org.karaf.fis:karaf-fis:yml:openshift:1.0.0-SNAPSHOT, org.karaf.fis:karaf-fis:json:openshift:1.0.0-SNAPSHOT, org.karaf.fis:karaf-fis:yml:kubernetes:1.0.0-SNAPSHOT, org.karaf.fis:karaf-fis:json:kubernetes:1.0.0-SNAPSHOT]
  296. [DEBUG]   (f) createChecksum = false
  297. [DEBUG]   (f) installAtEnd = false
  298. [DEBUG]   (f) localRepository =       id: local
  299.       url: file:///C:/Users/Aurelien%20Pupier/.m2/repository/
  300.    layout: default
  301. snapshots: [enabled => true, update => always]
  302.  releases: [enabled => true, update => always]
  303.  
  304. [DEBUG]   (f) packaging = bundle
  305. [DEBUG]   (f) pomFile = C:\ws\DevSuite2.0.1\karaf-fis\pom.xml
  306. [DEBUG]   (f) project = MavenProject: org.karaf.fis:karaf-fis:1.0.0-SNAPSHOT @ C:\ws\DevSuite2.0.1\karaf-fis\pom.xml
  307. [DEBUG]   (f) reactorProjects = [MavenProject: org.karaf.fis:karaf-fis:1.0.0-SNAPSHOT @ C:\ws\DevSuite2.0.1\karaf-fis\pom.xml]
  308. [DEBUG]   (s) skip = false
  309. [DEBUG]   (f) updateReleaseInfo = false
  310. [DEBUG] -- end configuration --
  311. [INFO] Installing C:\ws\DevSuite2.0.1\karaf-fis\target\karaf-fis-1.0.0-SNAPSHOT.jar to C:\Users\Aurelien Pupier\.m2\repository\org\karaf\fis\karaf-fis\1.0.0-SNAPSHOT\karaf-fis-1.0.0-SNAPSHOT.jar
  312. [DEBUG] Writing tracking file C:\Users\Aurelien Pupier\.m2\repository\org\karaf\fis\karaf-fis\1.0.0-SNAPSHOT\_remote.repositories
  313. [INFO] Installing C:\ws\DevSuite2.0.1\karaf-fis\pom.xml to C:\Users\Aurelien Pupier\.m2\repository\org\karaf\fis\karaf-fis\1.0.0-SNAPSHOT\karaf-fis-1.0.0-SNAPSHOT.pom
  314. [DEBUG] Writing tracking file C:\Users\Aurelien Pupier\.m2\repository\org\karaf\fis\karaf-fis\1.0.0-SNAPSHOT\_remote.repositories
  315. [DEBUG] Installing org.karaf.fis:karaf-fis:1.0.0-SNAPSHOT/maven-metadata.xml to C:\Users\Aurelien Pupier\.m2\repository\org\karaf\fis\karaf-fis\1.0.0-SNAPSHOT\maven-metadata-local.xml
  316. [DEBUG] Installing org.karaf.fis:karaf-fis/maven-metadata.xml to C:\Users\Aurelien Pupier\.m2\repository\org\karaf\fis\karaf-fis\maven-metadata-local.xml
  317. [INFO] Installing C:\ws\DevSuite2.0.1\karaf-fis\target\classes\META-INF\fabric8\openshift.yml to C:\Users\Aurelien Pupier\.m2\repository\org\karaf\fis\karaf-fis\1.0.0-SNAPSHOT\karaf-fis-1.0.0-SNAPSHOT-openshift.yml
  318. [DEBUG] Writing tracking file C:\Users\Aurelien Pupier\.m2\repository\org\karaf\fis\karaf-fis\1.0.0-SNAPSHOT\_remote.repositories
  319. [DEBUG] Installing org.karaf.fis:karaf-fis:1.0.0-SNAPSHOT/maven-metadata.xml to C:\Users\Aurelien Pupier\.m2\repository\org\karaf\fis\karaf-fis\1.0.0-SNAPSHOT\maven-metadata-local.xml
  320. [DEBUG] Installing org.karaf.fis:karaf-fis/maven-metadata.xml to C:\Users\Aurelien Pupier\.m2\repository\org\karaf\fis\karaf-fis\maven-metadata-local.xml
  321. [INFO] Installing C:\ws\DevSuite2.0.1\karaf-fis\target\classes\META-INF\fabric8\openshift.json to C:\Users\Aurelien Pupier\.m2\repository\org\karaf\fis\karaf-fis\1.0.0-SNAPSHOT\karaf-fis-1.0.0-SNAPSHOT-openshift.json
  322. [DEBUG] Writing tracking file C:\Users\Aurelien Pupier\.m2\repository\org\karaf\fis\karaf-fis\1.0.0-SNAPSHOT\_remote.repositories
  323. [DEBUG] Installing org.karaf.fis:karaf-fis:1.0.0-SNAPSHOT/maven-metadata.xml to C:\Users\Aurelien Pupier\.m2\repository\org\karaf\fis\karaf-fis\1.0.0-SNAPSHOT\maven-metadata-local.xml
  324. [DEBUG] Installing org.karaf.fis:karaf-fis/maven-metadata.xml to C:\Users\Aurelien Pupier\.m2\repository\org\karaf\fis\karaf-fis\maven-metadata-local.xml
  325. [INFO] Installing C:\ws\DevSuite2.0.1\karaf-fis\target\classes\META-INF\fabric8\kubernetes.yml to C:\Users\Aurelien Pupier\.m2\repository\org\karaf\fis\karaf-fis\1.0.0-SNAPSHOT\karaf-fis-1.0.0-SNAPSHOT-kubernetes.yml
  326. [DEBUG] Writing tracking file C:\Users\Aurelien Pupier\.m2\repository\org\karaf\fis\karaf-fis\1.0.0-SNAPSHOT\_remote.repositories
  327. [DEBUG] Installing org.karaf.fis:karaf-fis:1.0.0-SNAPSHOT/maven-metadata.xml to C:\Users\Aurelien Pupier\.m2\repository\org\karaf\fis\karaf-fis\1.0.0-SNAPSHOT\maven-metadata-local.xml
  328. [DEBUG] Installing org.karaf.fis:karaf-fis/maven-metadata.xml to C:\Users\Aurelien Pupier\.m2\repository\org\karaf\fis\karaf-fis\maven-metadata-local.xml
  329. [INFO] Installing C:\ws\DevSuite2.0.1\karaf-fis\target\classes\META-INF\fabric8\kubernetes.json to C:\Users\Aurelien Pupier\.m2\repository\org\karaf\fis\karaf-fis\1.0.0-SNAPSHOT\karaf-fis-1.0.0-SNAPSHOT-kubernetes.json
  330. [DEBUG] Writing tracking file C:\Users\Aurelien Pupier\.m2\repository\org\karaf\fis\karaf-fis\1.0.0-SNAPSHOT\_remote.repositories
  331. [DEBUG] Installing org.karaf.fis:karaf-fis:1.0.0-SNAPSHOT/maven-metadata.xml to C:\Users\Aurelien Pupier\.m2\repository\org\karaf\fis\karaf-fis\1.0.0-SNAPSHOT\maven-metadata-local.xml
  332. [DEBUG] Installing org.karaf.fis:karaf-fis/maven-metadata.xml to C:\Users\Aurelien Pupier\.m2\repository\org\karaf\fis\karaf-fis\maven-metadata-local.xml
  333. [INFO]
  334. [INFO] --- maven-bundle-plugin:2.3.7:install (default-install) @ karaf-fis ---
  335. [DEBUG] Configuring mojo org.apache.felix:maven-bundle-plugin:2.3.7:install from plugin realm ClassRealm[extension>org.apache.felix:maven-bundle-plugin:2.3.7, parent: sun.misc.Launcher$AppClassLoader@55f96302]
  336. [DEBUG] Configuring mojo 'org.apache.felix:maven-bundle-plugin:2.3.7:install' with basic configurator -->
  337. [DEBUG]   (f) attachedArtifacts = [org.karaf.fis:karaf-fis:yml:openshift:1.0.0-SNAPSHOT, org.karaf.fis:karaf-fis:json:openshift:1.0.0-SNAPSHOT, org.karaf.fis:karaf-fis:yml:kubernetes:1.0.0-SNAPSHOT, org.karaf.fis:karaf-fis:json:kubernetes:1.0.0-SNAPSHOT]
  338. [DEBUG]   (f) localRepository =       id: local
  339.       url: file:///C:/Users/Aurelien%20Pupier/.m2/repository/
  340.    layout: default
  341. snapshots: [enabled => true, update => always]
  342.  releases: [enabled => true, update => always]
  343.  
  344. [DEBUG]   (f) project = MavenProject: org.karaf.fis:karaf-fis:1.0.0-SNAPSHOT @ C:\ws\DevSuite2.0.1\karaf-fis\pom.xml
  345. [DEBUG] -- end configuration --
  346. [DEBUG]  (f) repositoryXml = file:/C:/Users/Aurelien%20Pupier/.m2/repository/repository.xml
  347. [DEBUG]  (f) bundleJar = file:/C:/Users/Aurelien%20Pupier/.m2/repository/org/karaf/fis/karaf-fis/1.0.0-SNAPSHOT/karaf-fis-1.0.0-SNAPSHOT.jar
  348. [DEBUG]  (f) sourceJar = null
  349. [DEBUG]  (f) docJar = null
  350. [DEBUG]  (f) obrXml = null
  351. [INFO] Installing org/karaf/fis/karaf-fis/1.0.0-SNAPSHOT/karaf-fis-1.0.0-SNAPSHOT.jar
  352. [INFO] Writing OBR metadata
  353. [INFO]
  354. [INFO] --- karaf-maven-plugin:4.0.8:assembly (karaf-assembly) @ karaf-fis ---
  355. [DEBUG] Configuring mojo org.apache.karaf.tooling:karaf-maven-plugin:4.0.8:assembly from plugin realm ClassRealm[extension>org.apache.karaf.tooling:karaf-maven-plugin:4.0.8, parent: sun.misc.Launcher$AppClassLoader@55f96302]
  356. [DEBUG] Configuring mojo 'org.apache.karaf.tooling:karaf-maven-plugin:4.0.8:assembly' with basic configurator -->
  357. [DEBUG]   (f) blacklistedBundles = [camel-karaf-commands;url="mvn:org.apache.camel.karaf/camel-karaf-commands/2.18.1", camel-karaf-commands-catalog;url="mvn:org.apache.camel.karaf/camel-karaf-commands-catalog/2.18.1"]
  358. [DEBUG]   (f) featureArtifactType = xml
  359. [DEBUG]   (f) featuresCfgFile = C:\ws\DevSuite2.0.1\karaf-fis\target\assembly\etc\org.apache.karaf.features.cfg
  360. [DEBUG]   (f) ignoreDependencyFlag = false
  361. [DEBUG]   (f) includeBuildOutputDirectory = false
  362. [DEBUG]   (f) javase = 1.8
  363. [DEBUG]   (f) karafVersion = v4x
  364. [DEBUG]   (f) libraries = [mvn:org.apache.karaf.jaas/org.apache.karaf.jaas.boot/4.0.8;type:=boot;export:=true;delegate:=true]
  365. [DEBUG]   (f) localRepo =       id: local
  366.       url: file:///C:/Users/Aurelien%20Pupier/.m2/repository/
  367.    layout: default
  368. snapshots: [enabled => true, update => always]
  369.  releases: [enabled => true, update => always]
  370.  
  371. [DEBUG]   (s) mavenSession = org.apache.maven.execution.MavenSession@506aabf6
  372. [DEBUG]   (f) project = MavenProject: org.karaf.fis:karaf-fis:1.0.0-SNAPSHOT @ C:\ws\DevSuite2.0.1\karaf-fis\pom.xml
  373. [DEBUG]   (f) propertyFileEdits = C:\ws\DevSuite2.0.1\karaf-fis/src/main/karaf/assembly-property-edits.xml
  374. [DEBUG]   (f) remoteRepos = [      id: fuse-internal
  375.       url: http://download.eng.brq.redhat.com/brewroot/repos/jb-fuse-6.2-build/latest/maven/
  376.    layout: default
  377. snapshots: [enabled => true, update => daily]
  378.  releases: [enabled => true, update => daily]
  379. ,       id: apache.snapshots
  380.       url: https://repository.apache.org/content/repositories/snapshots/
  381.    layout: default
  382. snapshots: [enabled => true, update => daily]
  383.  releases: [enabled => false, update => daily]
  384. ,       id: central
  385.       url: https://repo.maven.apache.org/maven2
  386.    layout: default
  387. snapshots: [enabled => false, update => daily]
  388.  releases: [enabled => true, update => daily]
  389. ]
  390. [DEBUG]   (f) sourceDirectory = C:\ws\DevSuite2.0.1\karaf-fis\src\main\resources\assembly
  391. [DEBUG]   (f) startupBundles = [mvn:org.karaf.fis/karaf-fis/1.0.0-SNAPSHOT;start-level=80]
  392. [DEBUG]   (f) startupFeatures = [framework, scr, jaas, aries-blueprint, camel-blueprint, fabric8-karaf-blueprint, fabric8-karaf-checks]
  393. [DEBUG]   (f) startupPropertiesFile = C:\ws\DevSuite2.0.1\karaf-fis\target\assembly\etc\startup.properties
  394. [DEBUG]   (f) systemDirectory = C:\ws\DevSuite2.0.1\karaf-fis\target\assembly\system
  395. [DEBUG]   (f) useReferenceUrls = true
  396. [DEBUG]   (f) workDirectory = C:\ws\DevSuite2.0.1\karaf-fis\target\assembly
  397. [DEBUG] -- end configuration --
  398. [INFO] Using repositories: http://download.eng.brq.redhat.com/brewroot/repos/jb-fuse-6.2-build/latest/maven/@id=fuse-internal@snapshots,https://repository.apache.org/content/repositories/snapshots/@id=apache.snapshots@noreleases@snapshots,https://repo.maven.apache.org/maven2@id=central
  399. [INFO] Creating work directory
  400. [INFO] Loading kar and features repositories dependencies
  401. [INFO] Generating karaf assembly: C:\ws\DevSuite2.0.1\karaf-fis\target\assembly
  402. [INFO] Unzipping kars
  403. [DEBUG] Using manager PaxLocalRepositoryManager with priority 0.0 for C:\Users\Aurelien Pupier\.m2\repository
  404. [DEBUG] Resolved (org.apache.karaf.features:framework:kar:4.0.8) as C:\Users\Aurelien Pupier\.m2\repository\org\apache\karaf\features\framework\4.0.8\framework-4.0.8.kar
  405. [DEBUG] Uncompress the KAR file file:/C:/Users/Aurelien%20Pupier/.m2/repository/org/apache/karaf/features/framework/4.0.8/framework-4.0.8.kar into directory C:\ws\DevSuite2.0.1\karaf-fis\target\assembly\system
  406. [DEBUG] Creating directory system
  407. [DEBUG] Creating directory org
  408. [DEBUG] Creating directory apache
  409. [DEBUG] Creating directory karaf
  410. [DEBUG] Creating directory features
  411. [DEBUG] Creating directory framework
  412. [DEBUG] Creating directory 4.0.8
  413. [DEBUG] Creating directory ops4j
  414. [DEBUG] Creating directory pax
  415. [DEBUG] Creating directory url
  416. [DEBUG] Creating directory pax-url-aether
  417. [DEBUG] Creating directory 2.5.2
  418. [DEBUG] Creating directory logging
  419. [DEBUG] Creating directory pax-logging-api
  420. [DEBUG] Creating directory 1.8.5
  421. [DEBUG] Creating directory pax-logging-service
  422. [DEBUG] Creating directory 1.8.5
  423. [DEBUG] Creating directory felix
  424. [DEBUG] Creating directory org.apache.felix.configadmin
  425. [DEBUG] Creating directory 1.8.12
  426. [DEBUG] Creating directory org.apache.felix.fileinstall
  427. [DEBUG] Creating directory 3.5.6
  428. [DEBUG] Creating directory org.apache.karaf.features.core
  429. [DEBUG] Creating directory 4.0.8
  430. [DEBUG] Creating directory
  431. [DEBUG] Creating directory system
  432. [DEBUG] Creating directory org
  433. [DEBUG] Creating directory eclipse
  434. [DEBUG] Creating directory tycho
  435. [DEBUG] Creating directory org.eclipse.osgi
  436. [DEBUG] Creating directory 3.10.101.v20150820-1432
  437. [DEBUG] Creating directory slf4j
  438. [DEBUG] Creating directory slf4j-api
  439. [DEBUG] Creating directory 1.7.12
  440. [DEBUG] Creating directory apache
  441. [DEBUG] Creating directory felix
  442. [DEBUG] Creating directory org.apache.felix.framework
  443. [DEBUG] Creating directory 5.6.1
  444. [DEBUG] Creating directory karaf
  445. [DEBUG] Creating directory org.apache.karaf.client
  446. [DEBUG] Creating directory 4.0.8
  447. [DEBUG] Creating directory jline
  448. [DEBUG] Creating directory jline
  449. [DEBUG] Creating directory 2.14.1
  450. [DEBUG] Creating directory etc
  451. [DEBUG] Creating directory bin
  452. [DEBUG] Creating directory contrib
  453. [DEBUG] Creating directory lib
  454. [DEBUG] Creating directory endorsed
  455. [DEBUG] Creating directory boot
  456. [DEBUG] Creating directory ext
  457. [DEBUG] Creating directory deploy
  458. [DEBUG] Creating directory data
  459. [DEBUG] Creating directory tmp
  460. [DEBUG] Resolved (org.apache.karaf.features:framework:xml:features:4.0.8) as C:\Users\Aurelien Pupier\.m2\repository\org\apache\karaf\features\framework\4.0.8\framework-4.0.8-features.xml
  461. [DEBUG] Resolved (org.apache.karaf.features:enterprise:xml:features:4.0.8) as C:\Users\Aurelien Pupier\.m2\repository\org\apache\karaf\features\enterprise\4.0.8\enterprise-4.0.8-features.xml
  462. [DEBUG] Using manager PaxLocalRepositoryManager with priority 0.0 for C:\Users\Aurelien Pupier\.m2\repository
  463. [DEBUG] Using manager PaxLocalRepositoryManager with priority 0.0 for C:\Users\Aurelien Pupier\.m2\repository
  464. [DEBUG] Resolved (io.fabric8:fabric8-karaf-features:xml:features:2.2.192) as C:\Users\Aurelien Pupier\.m2\repository\io\fabric8\fabric8-karaf-features\2.2.192\fabric8-karaf-features-2.2.192-features.xml
  465. [DEBUG] Resolved (org.apache.karaf.features:standard:xml:features:4.0.8) as C:\Users\Aurelien Pupier\.m2\repository\org\apache\karaf\features\standard\4.0.8\standard-4.0.8-features.xml
  466. [DEBUG] Resolved (org.apache.camel.karaf:apache-camel:xml:features:2.18.1) as C:\Users\Aurelien Pupier\.m2\repository\org\apache\camel\karaf\apache-camel\2.18.1\apache-camel-2.18.1-features.xml
  467. [DEBUG] Resolved (io.fabric8.kubernetes:kubernetes-karaf:xml:features:1.4.33) as C:\Users\Aurelien Pupier\.m2\repository\io\fabric8\kubernetes\kubernetes-karaf\1.4.33\kubernetes-karaf-1.4.33-features.xml
  468. [DEBUG] Resolved (org.ops4j.pax.cdi:pax-cdi-features:xml:features:0.12.0) as C:\Users\Aurelien Pupier\.m2\repository\org\ops4j\pax\cdi\pax-cdi-features\0.12.0\pax-cdi-features-0.12.0-features.xml
  469. [DEBUG] Resolved (org.ops4j.pax.jdbc:pax-jdbc-features:xml:features:0.9.0) as C:\Users\Aurelien Pupier\.m2\repository\org\ops4j\pax\jdbc\pax-jdbc-features\0.9.0\pax-jdbc-features-0.9.0-features.xml
  470. [DEBUG] Resolved (org.ops4j.pax.web:pax-web-features:xml:features:4.3.0) as C:\Users\Aurelien Pupier\.m2\repository\org\ops4j\pax\web\pax-web-features\4.3.0\pax-web-features-4.3.0-features.xml
  471. [DEBUG] Resolved (org.apache.cxf.karaf:apache-cxf:xml:features:3.1.8) as C:\Users\Aurelien Pupier\.m2\repository\org\apache\cxf\karaf\apache-cxf\3.1.8\apache-cxf-3.1.8-features.xml
  472. [DEBUG] Resolved (org.apache.jclouds.karaf:jclouds-karaf:xml:features:1.9.2) as C:\Users\Aurelien Pupier\.m2\repository\org\apache\jclouds\karaf\jclouds-karaf\1.9.2\jclouds-karaf-1.9.2-features.xml
  473. [DEBUG] Resolved (org.ops4j.pax.cdi:pax-cdi-features:xml:features:1.0.0.RC1) as C:\Users\Aurelien Pupier\.m2\repository\org\ops4j\pax\cdi\pax-cdi-features\1.0.0.RC1\pax-cdi-features-1.0.0.RC1-features.xml
  474. [INFO] Loading profiles
  475. [INFO] Downloading libraries
  476. [DEBUG] Resolved (org.apache.karaf.jaas:org.apache.karaf.jaas.boot:jar:4.0.8) as C:\Users\Aurelien Pupier\.m2\repository\org\apache\karaf\jaas\org.apache.karaf.jaas.boot\4.0.8\org.apache.karaf.jaas.boot-4.0.8.jar
  477. [INFO] Loading repositories
  478. [DEBUG] Resolved (org.apache.camel.karaf:apache-camel:xml:features:2.18.1) as C:\Users\Aurelien Pupier\.m2\repository\org\apache\camel\karaf\apache-camel\2.18.1\apache-camel-2.18.1-features.xml
  479. [DEBUG] Resolved (org.apache.karaf.features:framework:xml:features:4.0.8) as C:\Users\Aurelien Pupier\.m2\repository\org\apache\karaf\features\framework\4.0.8\framework-4.0.8-features.xml
  480. [DEBUG] Using manager PaxLocalRepositoryManager with priority 0.0 for C:\Users\Aurelien Pupier\.m2\repository
  481. [DEBUG] Resolved (org.apache.karaf.features:standard:xml:features:4.0.8) as C:\Users\Aurelien Pupier\.m2\repository\org\apache\karaf\features\standard\4.0.8\standard-4.0.8-features.xml
  482. [DEBUG] Using manager PaxLocalRepositoryManager with priority 0.0 for C:\Users\Aurelien Pupier\.m2\repository
  483. [DEBUG] Resolved (org.apache.karaf.features:enterprise:xml:features:4.0.8) as C:\Users\Aurelien Pupier\.m2\repository\org\apache\karaf\features\enterprise\4.0.8\enterprise-4.0.8-features.xml
  484. [DEBUG] Resolved (io.fabric8:fabric8-karaf-features:xml:features:2.2.192) as C:\Users\Aurelien Pupier\.m2\repository\io\fabric8\fabric8-karaf-features\2.2.192\fabric8-karaf-features-2.2.192-features.xml
  485. [DEBUG] Resolved (io.fabric8.kubernetes:kubernetes-karaf:xml:features:1.4.33) as C:\Users\Aurelien Pupier\.m2\repository\io\fabric8\kubernetes\kubernetes-karaf\1.4.33\kubernetes-karaf-1.4.33-features.xml
  486. [DEBUG] Resolved (org.ops4j.pax.jdbc:pax-jdbc-features:xml:features:0.9.0) as C:\Users\Aurelien Pupier\.m2\repository\org\ops4j\pax\jdbc\pax-jdbc-features\0.9.0\pax-jdbc-features-0.9.0-features.xml
  487. [DEBUG] Resolved (org.ops4j.pax.cdi:pax-cdi-features:xml:features:0.12.0) as C:\Users\Aurelien Pupier\.m2\repository\org\ops4j\pax\cdi\pax-cdi-features\0.12.0\pax-cdi-features-0.12.0-features.xml
  488. [DEBUG] Resolved (org.ops4j.pax.web:pax-web-features:xml:features:4.3.0) as C:\Users\Aurelien Pupier\.m2\repository\org\ops4j\pax\web\pax-web-features\4.3.0\pax-web-features-4.3.0-features.xml
  489. [DEBUG] Resolved (org.apache.jclouds.karaf:jclouds-karaf:xml:features:1.9.2) as C:\Users\Aurelien Pupier\.m2\repository\org\apache\jclouds\karaf\jclouds-karaf\1.9.2\jclouds-karaf-1.9.2-features.xml
  490. [DEBUG] Resolved (org.apache.cxf.karaf:apache-cxf:xml:features:3.1.8) as C:\Users\Aurelien Pupier\.m2\repository\org\apache\cxf\karaf\apache-cxf\3.1.8\apache-cxf-3.1.8-features.xml
  491. [DEBUG] Resolved (org.ops4j.pax.cdi:pax-cdi-features:xml:features:1.0.0.RC1) as C:\Users\Aurelien Pupier\.m2\repository\org\ops4j\pax\cdi\pax-cdi-features\1.0.0.RC1\pax-cdi-features-1.0.0.RC1-features.xml
  492. [INFO] Resolving features
  493. [DEBUG] Resolved (org.apache.felix:org.apache.felix.fileinstall:jar:3.5.6) as C:\Users\Aurelien Pupier\.m2\repository\org\apache\felix\org.apache.felix.fileinstall\3.5.6\org.apache.felix.fileinstall-3.5.6.jar
  494. [DEBUG] Resolved (org.ops4j.pax.logging:pax-logging-service:jar:1.8.5) as C:\Users\Aurelien Pupier\.m2\repository\org\ops4j\pax\logging\pax-logging-service\1.8.5\pax-logging-service-1.8.5.jar
  495. [DEBUG] Resolved (org.ops4j.pax.url:pax-url-aether:jar:2.5.2) as C:\Users\Aurelien Pupier\.m2\repository\org\ops4j\pax\url\pax-url-aether\2.5.2\pax-url-aether-2.5.2.jar
  496. [DEBUG] Resolved (org.ops4j.pax.logging:pax-logging-api:jar:1.8.5) as C:\Users\Aurelien Pupier\.m2\repository\org\ops4j\pax\logging\pax-logging-api\1.8.5\pax-logging-api-1.8.5.jar
  497. [DEBUG] Resolved (org.apache.felix:org.apache.felix.configadmin:jar:1.8.12) as C:\Users\Aurelien Pupier\.m2\repository\org\apache\felix\org.apache.felix.configadmin\1.8.12\org.apache.felix.configadmin-1.8.12.jar
  498. [DEBUG] Resolved (org.apache.karaf.features:org.apache.karaf.features.core:jar:4.0.8) as C:\Users\Aurelien Pupier\.m2\repository\org\apache\karaf\features\org.apache.karaf.features.core\4.0.8\org.apache.karaf.features.core-4.0.8.jar
  499. [DEBUG] Resolved (org.apache.karaf.scr:org.apache.karaf.scr.management:jar:4.0.8) as C:\Users\Aurelien Pupier\.m2\repository\org\apache\karaf\scr\org.apache.karaf.scr.management\4.0.8\org.apache.karaf.scr.management-4.0.8.jar
  500. [DEBUG] Resolved (org.apache.felix:org.apache.felix.inventory:jar:1.0.4) as C:\Users\Aurelien Pupier\.m2\repository\org\apache\felix\org.apache.felix.inventory\1.0.4\org.apache.felix.inventory-1.0.4.jar
  501. [DEBUG] Resolved (org.apache.felix:org.apache.felix.webconsole.plugins.ds:jar:2.0.2) as C:\Users\Aurelien Pupier\.m2\repository\org\apache\felix\org.apache.felix.webconsole.plugins.ds\2.0.2\org.apache.felix.webconsole.plugins.ds-2.0.2.jar
  502. [DEBUG] Resolved (org.apache.karaf.scr:org.apache.karaf.scr.command:jar:4.0.8) as C:\Users\Aurelien Pupier\.m2\repository\org\apache\karaf\scr\org.apache.karaf.scr.command\4.0.8\org.apache.karaf.scr.command-4.0.8.jar
  503. [DEBUG] Resolved (org.apache.felix:org.apache.felix.metatype:jar:1.1.2) as C:\Users\Aurelien Pupier\.m2\repository\org\apache\felix\org.apache.felix.metatype\1.1.2\org.apache.felix.metatype-1.1.2.jar
  504. [DEBUG] Resolved (org.apache.felix:org.apache.felix.scr:jar:2.0.6) as C:\Users\Aurelien Pupier\.m2\repository\org\apache\felix\org.apache.felix.scr\2.0.6\org.apache.felix.scr-2.0.6.jar
  505. [DEBUG] Resolved (org.apache.felix:org.apache.felix.scr.compat:jar:1.0.4) as C:\Users\Aurelien Pupier\.m2\repository\org\apache\felix\org.apache.felix.scr.compat\1.0.4\org.apache.felix.scr.compat-1.0.4.jar
  506. [DEBUG] Resolved (io.fabric8:fabric8-karaf-checks:jar:2.2.192) as C:\Users\Aurelien Pupier\.m2\repository\io\fabric8\fabric8-karaf-checks\2.2.192\fabric8-karaf-checks-2.2.192.jar
  507. [DEBUG] Resolved (org.apache.camel:camel-blueprint:jar:2.18.1) as C:\Users\Aurelien Pupier\.m2\repository\org\apache\camel\camel-blueprint\2.18.1\camel-blueprint-2.18.1.jar
  508. [DEBUG] Resolved (io.fabric8:fabric8-karaf-blueprint:jar:2.2.192) as C:\Users\Aurelien Pupier\.m2\repository\io\fabric8\fabric8-karaf-blueprint\2.2.192\fabric8-karaf-blueprint-2.2.192.jar
  509. [DEBUG] Resolved (org.apache.karaf.jaas.blueprint:org.apache.karaf.jaas.blueprint.config:jar:4.0.8) as C:\Users\Aurelien Pupier\.m2\repository\org\apache\karaf\jaas\blueprint\org.apache.karaf.jaas.blueprint.config\4.0.8\org.apache.karaf.jaas.blueprint.config-4.0.8.jar
  510. [DEBUG] Resolved (org.apache.karaf.jaas:org.apache.karaf.jaas.command:jar:4.0.8) as C:\Users\Aurelien Pupier\.m2\repository\org\apache\karaf\jaas\org.apache.karaf.jaas.command\4.0.8\org.apache.karaf.jaas.command-4.0.8.jar
  511. [DEBUG] Resolved (org.apache.karaf.jaas:org.apache.karaf.jaas.modules:jar:4.0.8) as C:\Users\Aurelien Pupier\.m2\repository\org\apache\karaf\jaas\org.apache.karaf.jaas.modules\4.0.8\org.apache.karaf.jaas.modules-4.0.8.jar
  512. [DEBUG] Resolved (org.apache.karaf.jaas:org.apache.karaf.jaas.config:jar:4.0.8) as C:\Users\Aurelien Pupier\.m2\repository\org\apache\karaf\jaas\org.apache.karaf.jaas.config\4.0.8\org.apache.karaf.jaas.config-4.0.8.jar
  513. [DEBUG] Resolved (org.apache.karaf.bundle:org.apache.karaf.bundle.blueprintstate:jar:4.0.8) as C:\Users\Aurelien Pupier\.m2\repository\org\apache\karaf\bundle\org.apache.karaf.bundle.blueprintstate\4.0.8\org.apache.karaf.bundle.blueprintstate-4.0.8.jar
  514. [DEBUG] Resolved (org.apache.aries.blueprint:org.apache.aries.blueprint.core:jar:1.7.1) as C:\Users\Aurelien Pupier\.m2\repository\org\apache\aries\blueprint\org.apache.aries.blueprint.core\1.7.1\org.apache.aries.blueprint.core-1.7.1.jar
  515. [DEBUG] Resolved (org.apache.aries.blueprint:org.apache.aries.blueprint.cm:jar:1.0.9) as C:\Users\Aurelien Pupier\.m2\repository\org\apache\aries\blueprint\org.apache.aries.blueprint.cm\1.0.9\org.apache.aries.blueprint.cm-1.0.9.jar
  516. [DEBUG] Resolved (org.apache.aries.blueprint:org.apache.aries.blueprint.api:jar:1.0.1) as C:\Users\Aurelien Pupier\.m2\repository\org\apache\aries\blueprint\org.apache.aries.blueprint.api\1.0.1\org.apache.aries.blueprint.api-1.0.1.jar
  517. [DEBUG] Resolved (org.apache.aries.blueprint:org.apache.aries.blueprint.core.compatibility:jar:1.0.0) as C:\Users\Aurelien Pupier\.m2\repository\org\apache\aries\blueprint\org.apache.aries.blueprint.core.compatibility\1.0.0\org.apache.aries.blueprint.core.compatibility-1.0.0.jar
  518. [DEBUG] Resolved (org.apache.karaf.http:org.apache.karaf.http.core:jar:4.0.8) as C:\Users\Aurelien Pupier\.m2\repository\org\apache\karaf\http\org.apache.karaf.http.core\4.0.8\org.apache.karaf.http.core-4.0.8.jar
  519. [DEBUG] Resolved (org.apache.camel:camel-core:jar:2.18.1) as C:\Users\Aurelien Pupier\.m2\repository\org\apache\camel\camel-core\2.18.1\camel-core-2.18.1.jar
  520. [DEBUG] Resolved (org.apache.camel:camel-catalog:jar:2.18.1) as C:\Users\Aurelien Pupier\.m2\repository\org\apache\camel\camel-catalog\2.18.1\camel-catalog-2.18.1.jar
  521. [DEBUG] Resolved (org.apache.camel:camel-commands-core:jar:2.18.1) as C:\Users\Aurelien Pupier\.m2\repository\org\apache\camel\camel-commands-core\2.18.1\camel-commands-core-2.18.1.jar
  522. [DEBUG] Resolved (io.fabric8:fabric8-karaf-core:jar:2.2.192) as C:\Users\Aurelien Pupier\.m2\repository\io\fabric8\fabric8-karaf-core\2.2.192\fabric8-karaf-core-2.2.192.jar
  523. [DEBUG] Resolved (commons-codec:commons-codec:jar:1.10) as C:\Users\Aurelien Pupier\.m2\repository\commons-codec\commons-codec\1.10\commons-codec-1.10.jar
  524. [DEBUG] Resolved (org.apache.commons:commons-lang3:jar:3.4) as C:\Users\Aurelien Pupier\.m2\repository\org\apache\commons\commons-lang3\3.4\commons-lang3-3.4.jar
  525. [DEBUG] Resolved (org.apache.aries.proxy:org.apache.aries.proxy.api:jar:1.0.1) as C:\Users\Aurelien Pupier\.m2\repository\org\apache\aries\proxy\org.apache.aries.proxy.api\1.0.1\org.apache.aries.proxy.api-1.0.1.jar
  526. [DEBUG] Resolved (org.apache.aries:org.apache.aries.util:jar:1.1.1) as C:\Users\Aurelien Pupier\.m2\repository\org\apache\aries\org.apache.aries.util\1.1.1\org.apache.aries.util-1.1.1.jar
  527. [DEBUG] Resolved (org.apache.aries.proxy:org.apache.aries.proxy.impl:jar:1.0.5) as C:\Users\Aurelien Pupier\.m2\repository\org\apache\aries\proxy\org.apache.aries.proxy.impl\1.0.5\org.apache.aries.proxy.impl-1.0.5.jar
  528. [DEBUG] Resolved (org.ow2.asm:asm-all:jar:5.0.4) as C:\Users\Aurelien Pupier\.m2\repository\org\ow2\asm\asm-all\5.0.4\asm-all-5.0.4.jar
  529. [DEBUG] Resolved (org.apache.servicemix.bundles:org.apache.servicemix.bundles.jaxb-impl:jar:2.2.11_1) as C:\Users\Aurelien Pupier\.m2\repository\org\apache\servicemix\bundles\org.apache.servicemix.bundles.jaxb-impl\2.2.11_1\org.apache.servicemix.bundles.jaxb-impl-2.2.11_1.jar
  530. [DEBUG] Resolved (org.apache.servicemix.specs:org.apache.servicemix.specs.activation-api-1.1:jar:2.7.0) as C:\Users\Aurelien Pupier\.m2\repository\org\apache\servicemix\specs\org.apache.servicemix.specs.activation-api-1.1\2.7.0\org.apache.servicemix.specs.activation-api-1.1-2.7.0.jar
  531. [DEBUG] Resolved (org.apache.servicemix.specs:org.apache.servicemix.specs.stax-api-1.0:jar:2.7.0) as C:\Users\Aurelien Pupier\.m2\repository\org\apache\servicemix\specs\org.apache.servicemix.specs.stax-api-1.0\2.7.0\org.apache.servicemix.specs.stax-api-1.0-2.7.0.jar
  532. [DEBUG] Using manager PaxLocalRepositoryManager with priority 0.0 for C:\Users\Aurelien Pupier\.m2\repository
  533. [DEBUG] Resolved (org.apache.servicemix.specs:org.apache.servicemix.specs.jaxb-api-2.2:jar:2.7.0) as C:\Users\Aurelien Pupier\.m2\repository\org\apache\servicemix\specs\org.apache.servicemix.specs.jaxb-api-2.2\2.7.0\org.apache.servicemix.specs.jaxb-api-2.2-2.7.0.jar
  534. [DEBUG] Resolved (org.codehaus.woodstox:stax2-api:jar:3.1.4) as C:\Users\Aurelien Pupier\.m2\repository\org\codehaus\woodstox\stax2-api\3.1.4\stax2-api-3.1.4.jar
  535. [DEBUG] Resolved (org.codehaus.woodstox:woodstox-core-asl:jar:4.4.1) as C:\Users\Aurelien Pupier\.m2\repository\org\codehaus\woodstox\woodstox-core-asl\4.4.1\woodstox-core-asl-4.4.1.jar
  536. [DEBUG] Resolved (com.fasterxml.jackson.jaxrs:jackson-jaxrs-base:jar:2.7.5) as C:\Users\Aurelien Pupier\.m2\repository\com\fasterxml\jackson\jaxrs\jackson-jaxrs-base\2.7.5\jackson-jaxrs-base-2.7.5.jar
  537. [DEBUG] Resolved (org.yaml:snakeyaml:jar:1.17) as C:\Users\Aurelien Pupier\.m2\repository\org\yaml\snakeyaml\1.17\snakeyaml-1.17.jar
  538. [DEBUG] Resolved (com.fasterxml.jackson.jaxrs:jackson-jaxrs-json-provider:jar:2.7.5) as C:\Users\Aurelien Pupier\.m2\repository\com\fasterxml\jackson\jaxrs\jackson-jaxrs-json-provider\2.7.5\jackson-jaxrs-json-provider-2.7.5.jar
  539. [DEBUG] Resolved (io.fabric8:kubernetes-client:jar:bundle:1.4.33) as C:\Users\Aurelien Pupier\.m2\repository\io\fabric8\kubernetes-client\1.4.33\kubernetes-client-1.4.33-bundle.jar
  540. [DEBUG] Resolved (org.apache.servicemix.bundles:org.apache.servicemix.bundles.automaton:jar:1.11-8_1) as C:\Users\Aurelien Pupier\.m2\repository\org\apache\servicemix\bundles\org.apache.servicemix.bundles.automaton\1.11-8_1\org.apache.servicemix.bundles.automaton-1.11-8_1.jar
  541. [DEBUG] Resolved (com.fasterxml.jackson.module:jackson-module-jaxb-annotations:jar:2.7.5) as C:\Users\Aurelien Pupier\.m2\repository\com\fasterxml\jackson\module\jackson-module-jaxb-annotations\2.7.5\jackson-module-jaxb-annotations-2.7.5.jar
  542. [DEBUG] Resolved (org.apache.servicemix.bundles:org.apache.servicemix.bundles.okhttp:jar:3.4.1_1) as C:\Users\Aurelien Pupier\.m2\repository\org\apache\servicemix\bundles\org.apache.servicemix.bundles.okhttp\3.4.1_1\org.apache.servicemix.bundles.okhttp-3.4.1_1.jar
  543. [DEBUG] Resolved (com.fasterxml.jackson.core:jackson-annotations:jar:2.7.5) as C:\Users\Aurelien Pupier\.m2\repository\com\fasterxml\jackson\core\jackson-annotations\2.7.5\jackson-annotations-2.7.5.jar
  544. [DEBUG] Resolved (javax.validation:validation-api:jar:1.1.0.Final) as C:\Users\Aurelien Pupier\.m2\repository\javax\validation\validation-api\1.1.0.Final\validation-api-1.1.0.Final.jar
  545. [DEBUG] Resolved (io.fabric8:zjsonpatch:jar:0.3.0) as C:\Users\Aurelien Pupier\.m2\repository\io\fabric8\zjsonpatch\0.3.0\zjsonpatch-0.3.0.jar
  546. [DEBUG] Resolved (com.fasterxml.jackson.core:jackson-core:jar:2.7.5) as C:\Users\Aurelien Pupier\.m2\repository\com\fasterxml\jackson\core\jackson-core\2.7.5\jackson-core-2.7.5.jar
  547. [DEBUG] Resolved (com.fasterxml.jackson.core:jackson-databind:jar:2.7.5) as C:\Users\Aurelien Pupier\.m2\repository\com\fasterxml\jackson\core\jackson-databind\2.7.5\jackson-databind-2.7.5.jar
  548. [DEBUG] Resolved (io.fabric8:kubernetes-model:jar:1.0.65) as C:\Users\Aurelien Pupier\.m2\repository\io\fabric8\kubernetes-model\1.0.65\kubernetes-model-1.0.65.jar
  549. [DEBUG] Resolved (com.fasterxml.jackson.dataformat:jackson-dataformat-yaml:jar:2.7.5) as C:\Users\Aurelien Pupier\.m2\repository\com\fasterxml\jackson\dataformat\jackson-dataformat-yaml\2.7.5\jackson-dataformat-yaml-2.7.5.jar
  550. [DEBUG] Resolved (org.apache.servicemix.bundles:org.apache.servicemix.bundles.generex:jar:1.0.1_1) as C:\Users\Aurelien Pupier\.m2\repository\org\apache\servicemix\bundles\org.apache.servicemix.bundles.generex\1.0.1_1\org.apache.servicemix.bundles.generex-1.0.1_1.jar
  551. [DEBUG] Resolved (org.apache.servicemix.bundles:org.apache.servicemix.bundles.okio:jar:1.9.0_1) as C:\Users\Aurelien Pupier\.m2\repository\org\apache\servicemix\bundles\org.apache.servicemix.bundles.okio\1.9.0_1\org.apache.servicemix.bundles.okio-1.9.0_1.jar
  552. [DEBUG] Resolved (javax.servlet:javax.servlet-api:jar:3.1.0) as C:\Users\Aurelien Pupier\.m2\repository\javax\servlet\javax.servlet-api\3.1.0\javax.servlet-api-3.1.0.jar
  553. [DEBUG] Resolved (org.apache.xbean:xbean-bundleutils:jar:4.1) as C:\Users\Aurelien Pupier\.m2\repository\org\apache\xbean\xbean-bundleutils\4.1\xbean-bundleutils-4.1.jar
  554. [DEBUG] Resolved (org.ops4j.pax.web:pax-web-api:jar:4.3.0) as C:\Users\Aurelien Pupier\.m2\repository\org\ops4j\pax\web\pax-web-api\4.3.0\pax-web-api-4.3.0.jar
  555. [DEBUG] Resolved (org.apache.xbean:xbean-reflect:jar:4.1) as C:\Users\Aurelien Pupier\.m2\repository\org\apache\xbean\xbean-reflect\4.1\xbean-reflect-4.1.jar
  556. [DEBUG] Resolved (org.ow2.asm:asm-all:jar:5.0.2) as C:\Users\Aurelien Pupier\.m2\repository\org\ow2\asm\asm-all\5.0.2\asm-all-5.0.2.jar
  557. [DEBUG] Resolved (org.ops4j.pax.web:pax-web-jetty:jar:4.3.0) as C:\Users\Aurelien Pupier\.m2\repository\org\ops4j\pax\web\pax-web-jetty\4.3.0\pax-web-jetty-4.3.0.jar
  558. [DEBUG] Resolved (org.apache.xbean:xbean-finder:jar:4.1) as C:\Users\Aurelien Pupier\.m2\repository\org\apache\xbean\xbean-finder\4.1\xbean-finder-4.1.jar
  559. [DEBUG] Resolved (org.ops4j.pax.web:pax-web-spi:jar:4.3.0) as C:\Users\Aurelien Pupier\.m2\repository\org\ops4j\pax\web\pax-web-spi\4.3.0\pax-web-spi-4.3.0.jar
  560. [DEBUG] Resolved (org.ops4j.pax.web:pax-web-runtime:jar:4.3.0) as C:\Users\Aurelien Pupier\.m2\repository\org\ops4j\pax\web\pax-web-runtime\4.3.0\pax-web-runtime-4.3.0.jar
  561. [DEBUG] Resolved (org.apache.aries.spifly:org.apache.aries.spifly.dynamic.bundle:jar:1.0.1) as C:\Users\Aurelien Pupier\.m2\repository\org\apache\aries\spifly\org.apache.aries.spifly.dynamic.bundle\1.0.1\org.apache.aries.spifly.dynamic.bundle-1.0.1.jar
  562. [DEBUG] Resolved (org.eclipse.jetty.websocket:javax-websocket-client-impl:jar:9.2.19.v20160908) as C:\Users\Aurelien Pupier\.m2\repository\org\eclipse\jetty\websocket\javax-websocket-client-impl\9.2.19.v20160908\javax-websocket-client-impl-9.2.19.v20160908.jar
  563. [DEBUG] Resolved (org.eclipse.jetty.websocket:javax-websocket-server-impl:jar:9.2.19.v20160908) as C:\Users\Aurelien Pupier\.m2\repository\org\eclipse\jetty\websocket\javax-websocket-server-impl\9.2.19.v20160908\javax-websocket-server-impl-9.2.19.v20160908.jar
  564. [DEBUG] Resolved (org.eclipse.jetty:jetty-rewrite:jar:9.2.19.v20160908) as C:\Users\Aurelien Pupier\.m2\repository\org\eclipse\jetty\jetty-rewrite\9.2.19.v20160908\jetty-rewrite-9.2.19.v20160908.jar
  565. [DEBUG] Resolved (org.eclipse.jetty:jetty-util:jar:9.2.19.v20160908) as C:\Users\Aurelien Pupier\.m2\repository\org\eclipse\jetty\jetty-util\9.2.19.v20160908\jetty-util-9.2.19.v20160908.jar
  566. [DEBUG] Resolved (org.eclipse.jetty:jetty-io:jar:9.2.19.v20160908) as C:\Users\Aurelien Pupier\.m2\repository\org\eclipse\jetty\jetty-io\9.2.19.v20160908\jetty-io-9.2.19.v20160908.jar
  567. [DEBUG] Resolved (org.eclipse.jetty.websocket:websocket-client:jar:9.2.19.v20160908) as C:\Users\Aurelien Pupier\.m2\repository\org\eclipse\jetty\websocket\websocket-client\9.2.19.v20160908\websocket-client-9.2.19.v20160908.jar
  568. [DEBUG] Resolved (org.eclipse.jetty:jetty-security:jar:9.2.19.v20160908) as C:\Users\Aurelien Pupier\.m2\repository\org\eclipse\jetty\jetty-security\9.2.19.v20160908\jetty-security-9.2.19.v20160908.jar
  569. [DEBUG] Resolved (org.eclipse.jetty:jetty-client:jar:9.2.19.v20160908) as C:\Users\Aurelien Pupier\.m2\repository\org\eclipse\jetty\jetty-client\9.2.19.v20160908\jetty-client-9.2.19.v20160908.jar
  570. [DEBUG] Resolved (org.apache.geronimo.specs:geronimo-jta_1.1_spec:jar:1.1.1) as C:\Users\Aurelien Pupier\.m2\repository\org\apache\geronimo\specs\geronimo-jta_1.1_spec\1.1.1\geronimo-jta_1.1_spec-1.1.1.jar
  571. [DEBUG] Resolved (org.eclipse.jetty:jetty-jmx:jar:9.2.19.v20160908) as C:\Users\Aurelien Pupier\.m2\repository\org\eclipse\jetty\jetty-jmx\9.2.19.v20160908\jetty-jmx-9.2.19.v20160908.jar
  572. [DEBUG] Resolved (org.eclipse.jetty:jetty-server:jar:9.2.19.v20160908) as C:\Users\Aurelien Pupier\.m2\repository\org\eclipse\jetty\jetty-server\9.2.19.v20160908\jetty-server-9.2.19.v20160908.jar
  573. [DEBUG] Resolved (org.eclipse.jetty:jetty-jndi:jar:9.2.19.v20160908) as C:\Users\Aurelien Pupier\.m2\repository\org\eclipse\jetty\jetty-jndi\9.2.19.v20160908\jetty-jndi-9.2.19.v20160908.jar
  574. [DEBUG] Resolved (org.eclipse.jetty:jetty-jaas:jar:9.2.19.v20160908) as C:\Users\Aurelien Pupier\.m2\repository\org\eclipse\jetty\jetty-jaas\9.2.19.v20160908\jetty-jaas-9.2.19.v20160908.jar
  575. [DEBUG] Resolved (javax.annotation:javax.annotation-api:jar:1.2) as C:\Users\Aurelien Pupier\.m2\repository\javax\annotation\javax.annotation-api\1.2\javax.annotation-api-1.2.jar
  576. [DEBUG] Resolved (org.apache.aries:org.apache.aries.util:jar:1.1.0) as C:\Users\Aurelien Pupier\.m2\repository\org\apache\aries\org.apache.aries.util\1.1.0\org.apache.aries.util-1.1.0.jar
  577. [DEBUG] Resolved (org.eclipse.jetty:jetty-servlet:jar:9.2.19.v20160908) as C:\Users\Aurelien Pupier\.m2\repository\org\eclipse\jetty\jetty-servlet\9.2.19.v20160908\jetty-servlet-9.2.19.v20160908.jar
  578. [DEBUG] Resolved (org.eclipse.jetty:jetty-jaspi:jar:9.2.19.v20160908) as C:\Users\Aurelien Pupier\.m2\repository\org\eclipse\jetty\jetty-jaspi\9.2.19.v20160908\jetty-jaspi-9.2.19.v20160908.jar
  579. [DEBUG] Resolved (org.eclipse.jetty:jetty-plus:jar:9.2.19.v20160908) as C:\Users\Aurelien Pupier\.m2\repository\org\eclipse\jetty\jetty-plus\9.2.19.v20160908\jetty-plus-9.2.19.v20160908.jar
  580. [DEBUG] Resolved (org.apache.servicemix.specs:org.apache.servicemix.specs.activation-api-1.1:jar:2.5.0) as C:\Users\Aurelien Pupier\.m2\repository\org\apache\servicemix\specs\org.apache.servicemix.specs.activation-api-1.1\2.5.0\org.apache.servicemix.specs.activation-api-1.1-2.5.0.jar
  581. [DEBUG] Resolved (org.eclipse.jetty.websocket:websocket-server:jar:9.2.19.v20160908) as C:\Users\Aurelien Pupier\.m2\repository\org\eclipse\jetty\websocket\websocket-server\9.2.19.v20160908\websocket-server-9.2.19.v20160908.jar
  582. [DEBUG] Resolved (org.eclipse.jetty.websocket:websocket-servlet:jar:9.2.19.v20160908) as C:\Users\Aurelien Pupier\.m2\repository\org\eclipse\jetty\websocket\websocket-servlet\9.2.19.v20160908\websocket-servlet-9.2.19.v20160908.jar
  583. [DEBUG] Resolved (org.eclipse.jetty:jetty-webapp:jar:9.2.19.v20160908) as C:\Users\Aurelien Pupier\.m2\repository\org\eclipse\jetty\jetty-webapp\9.2.19.v20160908\jetty-webapp-9.2.19.v20160908.jar
  584. [DEBUG] Resolved (javax.websocket:javax.websocket-api:jar:1.1) as C:\Users\Aurelien Pupier\.m2\repository\javax\websocket\javax.websocket-api\1.1\javax.websocket-api-1.1.jar
  585. [DEBUG] Resolved (org.eclipse.jetty:jetty-util-ajax:jar:9.2.19.v20160908) as C:\Users\Aurelien Pupier\.m2\repository\org\eclipse\jetty\jetty-util-ajax\9.2.19.v20160908\jetty-util-ajax-9.2.19.v20160908.jar
  586. [DEBUG] Resolved (org.eclipse.jetty:jetty-servlets:jar:9.2.19.v20160908) as C:\Users\Aurelien Pupier\.m2\repository\org\eclipse\jetty\jetty-servlets\9.2.19.v20160908\jetty-servlets-9.2.19.v20160908.jar
  587. [DEBUG] Resolved (org.eclipse.jetty.websocket:websocket-common:jar:9.2.19.v20160908) as C:\Users\Aurelien Pupier\.m2\repository\org\eclipse\jetty\websocket\websocket-common\9.2.19.v20160908\websocket-common-9.2.19.v20160908.jar
  588. [DEBUG] Resolved (org.eclipse.jetty:jetty-xml:jar:9.2.19.v20160908) as C:\Users\Aurelien Pupier\.m2\repository\org\eclipse\jetty\jetty-xml\9.2.19.v20160908\jetty-xml-9.2.19.v20160908.jar
  589. [DEBUG] Resolved (javax.mail:mail:jar:1.4.4) as C:\Users\Aurelien Pupier\.m2\repository\javax\mail\mail\1.4.4\mail-1.4.4.jar
  590. [DEBUG] Resolved (org.eclipse.jetty:jetty-continuation:jar:9.2.19.v20160908) as C:\Users\Aurelien Pupier\.m2\repository\org\eclipse\jetty\jetty-continuation\9.2.19.v20160908\jetty-continuation-9.2.19.v20160908.jar
  591. [DEBUG] Resolved (org.eclipse.jetty.websocket:websocket-api:jar:9.2.19.v20160908) as C:\Users\Aurelien Pupier\.m2\repository\org\eclipse\jetty\websocket\websocket-api\9.2.19.v20160908\websocket-api-9.2.19.v20160908.jar
  592. [DEBUG] Resolved (org.eclipse.jetty:jetty-http:jar:9.2.19.v20160908) as C:\Users\Aurelien Pupier\.m2\repository\org\eclipse\jetty\jetty-http\9.2.19.v20160908\jetty-http-9.2.19.v20160908.jar
  593. [DEBUG] Resolved (org.apache.geronimo.specs:geronimo-jaspic_1.0_spec:jar:1.1) as C:\Users\Aurelien Pupier\.m2\repository\org\apache\geronimo\specs\geronimo-jaspic_1.0_spec\1.1\geronimo-jaspic_1.0_spec-1.1.jar
  594. [DEBUG] Skipped remote request for org.karaf.fis:karaf-fis:1.0.0-SNAPSHOT/maven-metadata.xml, locally installed metadata up-to-date.
  595. [DEBUG] Skipped remote request for org.karaf.fis:karaf-fis:1.0.0-SNAPSHOT/maven-metadata.xml, locally installed metadata up-to-date.
  596. [DEBUG] Resolved (org.karaf.fis:karaf-fis:jar:1.0.0-SNAPSHOT) as C:\Users\Aurelien Pupier\.m2\repository\org\karaf\fis\karaf-fis\1.0.0-SNAPSHOT\karaf-fis-1.0.0-SNAPSHOT.jar
  597. [INFO] Installing bundle mvn:com.fasterxml.jackson.core/jackson-annotations/2.7.5
  598. [INFO] Installing bundle mvn:com.fasterxml.jackson.core/jackson-core/2.7.5
  599. [INFO] Installing bundle mvn:com.fasterxml.jackson.core/jackson-databind/2.7.5
  600. [INFO] Installing bundle mvn:com.fasterxml.jackson.dataformat/jackson-dataformat-yaml/2.7.5
  601. [INFO] Installing bundle mvn:io.fabric8/fabric8-karaf-blueprint/2.2.192
  602. [INFO] Installing bundle mvn:io.fabric8/fabric8-karaf-checks/2.2.192
  603. [INFO] Installing bundle mvn:io.fabric8/fabric8-karaf-core/2.2.192
  604. [INFO] Installing bundle mvn:io.fabric8/kubernetes-client/1.4.33/jar/bundle
  605. [INFO] Installing bundle mvn:io.fabric8/kubernetes-model/1.0.65
  606. [INFO] Installing bundle mvn:io.fabric8/zjsonpatch/0.3.0
  607. [INFO] Installing bundle mvn:javax.mail/mail/1.4.4
  608. [INFO] Installing bundle mvn:javax.servlet/javax.servlet-api/3.1.0
  609. [INFO] Installing bundle mvn:javax.validation/validation-api/1.1.0.Final
  610. [INFO] Installing bundle mvn:javax.websocket/javax.websocket-api/1.1
  611. [INFO] Installing bundle mvn:org.apache.aries.blueprint/org.apache.aries.blueprint.api/1.0.1
  612. [INFO] Installing bundle mvn:org.apache.aries.blueprint/org.apache.aries.blueprint.cm/1.0.9
  613. [INFO] Installing bundle mvn:org.apache.aries.blueprint/org.apache.aries.blueprint.core/1.7.1
  614. [INFO] Installing bundle mvn:org.apache.aries.blueprint/org.apache.aries.blueprint.core.compatibility/1.0.0
  615. [INFO] Installing bundle mvn:org.apache.aries.proxy/org.apache.aries.proxy.api/1.0.1
  616. [INFO] Installing bundle mvn:org.apache.aries.proxy/org.apache.aries.proxy.impl/1.0.5
  617. [INFO] Installing bundle mvn:org.apache.aries.spifly/org.apache.aries.spifly.dynamic.bundle/1.0.1
  618. [INFO] Installing bundle mvn:org.apache.aries/org.apache.aries.util/1.1.1
  619. [INFO] Installing bundle mvn:org.apache.camel/camel-blueprint/2.18.1
  620. [INFO] Installing bundle mvn:org.apache.camel/camel-catalog/2.18.1
  621. [INFO] Installing bundle mvn:org.apache.camel/camel-commands-core/2.18.1
  622. [INFO] Installing bundle mvn:org.apache.camel/camel-core/2.18.1
  623. [INFO] Installing bundle mvn:commons-codec/commons-codec/1.10
  624. [INFO] Installing bundle mvn:org.apache.commons/commons-lang3/3.4
  625. [INFO] Installing bundle mvn:org.apache.felix/org.apache.felix.configadmin/1.8.12
  626. [INFO] Installing bundle mvn:org.apache.felix/org.apache.felix.fileinstall/3.5.6
  627. [INFO] Installing bundle mvn:org.apache.felix/org.apache.felix.metatype/1.1.2
  628. [INFO] Installing bundle mvn:org.apache.felix/org.apache.felix.scr/2.0.6
  629. [INFO] Installing bundle mvn:org.apache.felix/org.apache.felix.scr.compat/1.0.4
  630. [INFO] Installing bundle mvn:org.apache.geronimo.specs/geronimo-jaspic_1.0_spec/1.1
  631. [INFO] Installing bundle mvn:org.apache.geronimo.specs/geronimo-jta_1.1_spec/1.1.1
  632. [INFO] Installing bundle mvn:org.apache.karaf.features/org.apache.karaf.features.core/4.0.8
  633. [INFO] Installing bundle mvn:org.apache.karaf.http/org.apache.karaf.http.core/4.0.8
  634. [INFO] Installing bundle mvn:org.apache.karaf.jaas.blueprint/org.apache.karaf.jaas.blueprint.config/4.0.8
  635. [INFO] Installing bundle mvn:org.apache.karaf.jaas/org.apache.karaf.jaas.config/4.0.8
  636. [INFO] Installing bundle mvn:org.apache.karaf.jaas/org.apache.karaf.jaas.modules/4.0.8
  637. [INFO] Installing bundle mvn:org.apache.servicemix.bundles/org.apache.servicemix.bundles.automaton/1.11-8_1
  638. [INFO] Installing bundle mvn:org.apache.servicemix.bundles/org.apache.servicemix.bundles.generex/1.0.1_1
  639. [INFO] Installing bundle mvn:org.apache.servicemix.bundles/org.apache.servicemix.bundles.jaxb-impl/2.2.11_1
  640. [INFO] Installing bundle mvn:org.apache.servicemix.bundles/org.apache.servicemix.bundles.okhttp/3.4.1_1
  641. [INFO] Installing bundle mvn:org.apache.servicemix.bundles/org.apache.servicemix.bundles.okio/1.9.0_1
  642. [INFO] Installing bundle mvn:org.apache.xbean/xbean-bundleutils/4.1
  643. [INFO] Installing bundle mvn:org.apache.xbean/xbean-finder/4.1
  644. [INFO] Installing bundle mvn:org.eclipse.jetty/jetty-client/9.2.19.v20160908
  645. [INFO] Installing bundle mvn:org.eclipse.jetty/jetty-continuation/9.2.19.v20160908
  646. [INFO] Installing bundle mvn:org.eclipse.jetty/jetty-http/9.2.19.v20160908
  647. [INFO] Installing bundle mvn:org.eclipse.jetty/jetty-io/9.2.19.v20160908
  648. [INFO] Installing bundle mvn:org.eclipse.jetty/jetty-jaas/9.2.19.v20160908
  649. [INFO] Installing bundle mvn:org.eclipse.jetty/jetty-jaspi/9.2.19.v20160908
  650. [INFO] Installing bundle mvn:org.eclipse.jetty/jetty-jmx/9.2.19.v20160908
  651. [INFO] Installing bundle mvn:org.eclipse.jetty/jetty-jndi/9.2.19.v20160908
  652. [INFO] Installing bundle mvn:org.eclipse.jetty/jetty-plus/9.2.19.v20160908
  653. [INFO] Installing bundle mvn:org.eclipse.jetty/jetty-rewrite/9.2.19.v20160908
  654. [INFO] Installing bundle mvn:org.eclipse.jetty/jetty-security/9.2.19.v20160908
  655. [INFO] Installing bundle mvn:org.eclipse.jetty/jetty-server/9.2.19.v20160908
  656. [INFO] Installing bundle mvn:org.eclipse.jetty/jetty-servlet/9.2.19.v20160908
  657. [INFO] Installing bundle mvn:org.eclipse.jetty/jetty-servlets/9.2.19.v20160908
  658. [INFO] Installing bundle mvn:org.eclipse.jetty/jetty-util/9.2.19.v20160908
  659. [INFO] Installing bundle mvn:org.eclipse.jetty/jetty-util-ajax/9.2.19.v20160908
  660. [INFO] Installing bundle mvn:org.eclipse.jetty/jetty-webapp/9.2.19.v20160908
  661. [INFO] Installing bundle mvn:org.eclipse.jetty.websocket/websocket-api/9.2.19.v20160908
  662. [INFO] Installing bundle mvn:org.eclipse.jetty.websocket/websocket-client/9.2.19.v20160908
  663. [INFO] Installing bundle mvn:org.eclipse.jetty.websocket/websocket-common/9.2.19.v20160908
  664. [INFO] Installing bundle mvn:org.eclipse.jetty.websocket/javax-websocket-client-impl/9.2.19.v20160908
  665. [INFO] Installing bundle mvn:org.eclipse.jetty.websocket/javax-websocket-server-impl/9.2.19.v20160908
  666. [INFO] Installing bundle mvn:org.eclipse.jetty.websocket/websocket-server/9.2.19.v20160908
  667. [INFO] Installing bundle mvn:org.eclipse.jetty.websocket/websocket-servlet/9.2.19.v20160908
  668. [INFO] Installing bundle mvn:org.eclipse.jetty/jetty-xml/9.2.19.v20160908
  669. [INFO] Installing bundle mvn:org.karaf.fis/karaf-fis/1.0.0-SNAPSHOT
  670. [INFO] Installing bundle mvn:org.ow2.asm/asm-all/5.0.4
  671. [INFO] Installing bundle mvn:org.ops4j.pax.logging/pax-logging-api/1.8.5
  672. [INFO] Installing bundle mvn:org.ops4j.pax.logging/pax-logging-service/1.8.5
  673. [INFO] Installing bundle mvn:org.ops4j.pax.url/pax-url-aether/2.5.2
  674. [INFO] Installing bundle mvn:org.ops4j.pax.web/pax-web-api/4.3.0
  675. [INFO] Installing bundle mvn:org.ops4j.pax.web/pax-web-jetty/4.3.0
  676. [INFO] Installing bundle mvn:org.ops4j.pax.web/pax-web-runtime/4.3.0
  677. [INFO] Installing bundle mvn:org.ops4j.pax.web/pax-web-spi/4.3.0
  678. [INFO] Installing bundle mvn:org.codehaus.woodstox/stax2-api/3.1.4
  679. [INFO] Installing bundle mvn:org.codehaus.woodstox/woodstox-core-asl/4.4.1
  680. [INFO] Installing feature config for jaas-boot/0.0.0
  681. [INFO] Installing feature config for jaas/4.0.8
  682. [INFO] Installing feature config for jaas-condition-aries_blueprint/4.0.8
  683. [INFO] Installing feature config for fabric8-karaf-blueprint/2.2.192
  684. [INFO] Installing feature config for camel-blueprint/2.18.1
  685. [INFO] Installing feature config for xml-specs-api/2.7.0
  686. [INFO] Installing feature config for scr/4.0.8
  687. [INFO] Installing feature config for kubernetes-client/1.4.33
  688. [INFO] Installing feature config for aries-proxy/4.0.8
  689. [INFO] Installing feature config for framework/4.0.8
  690. [INFO] Installing feature config for http/4.0.8
  691. [INFO] Installing feature config for pax-http-jetty/4.3.0
  692. [DEBUG] Resolved (org.ops4j.pax.web:pax-web-features:xml:jettyconfig:4.3.0) as C:\Users\Aurelien Pupier\.m2\repository\org\ops4j\pax\web\pax-web-features\4.3.0\pax-web-features-4.3.0-jettyconfig.xml
  693. [INFO] Installing feature config for fabric8-karaf-checks/2.2.192
  694. [INFO] Installing feature config for aries-blueprint/4.0.8
  695. [INFO] Installing feature config for camel-core/2.18.1
  696. [INFO] Installing feature config for pax-jetty/9.2.19.v20160908
  697. [INFO] Installing feature config for fabric8-karaf-core/2.2.192
  698. [INFO] Installing feature config for pax-http/4.3.0
  699. [INFO] Feature 6eec7130-2020-41c7-9fa5-5bc751b03c6a is defined as a boot feature
  700. [INFO] == Installing artifact mvn:org.apache.camel/camel-blueprint/2.18.1
  701. [INFO]
  702. [INFO] --- fabric8-maven-plugin:3.2.13:build (build-image) @ karaf-fis ---
  703. [DEBUG] Configuring mojo io.fabric8:fabric8-maven-plugin:3.2.13:build from plugin realm ClassRealm[plugin>io.fabric8:fabric8-maven-plugin:3.2.13, parent: sun.misc.Launcher$AppClassLoader@55f96302]
  704. [DEBUG] Configuring mojo 'io.fabric8:fabric8-maven-plugin:3.2.13:build' with basic configurator -->
  705. [DEBUG]   (f) autoPull = on
  706. [DEBUG]   (f) buildRecreate = none
  707. [DEBUG]   (f) execution = io.fabric8:fabric8-maven-plugin:3.2.13:build {execution: build-image}
  708. [DEBUG]   (f) findImageStreamTagAttempts = 15
  709. [DEBUG]   (f) keepContainer = false
  710. [DEBUG]   (f) logStdout = false
  711. [DEBUG]   (f) maxConnections = 100
  712. [DEBUG]   (f) openshiftManifest = C:\ws\DevSuite2.0.1\karaf-fis\target\classes\META-INF\fabric8\openshift.yml
  713. [DEBUG]   (f) outputDirectory = target/docker
  714. [DEBUG]   (f) project = MavenProject: org.karaf.fis:karaf-fis:1.0.0-SNAPSHOT @ C:\ws\DevSuite2.0.1\karaf-fis\pom.xml
  715. [DEBUG]   (f) removeVolumes = false
  716. [DEBUG]   (f) resourceDir = C:\ws\DevSuite2.0.1\karaf-fis\src\main\fabric8
  717. [DEBUG]   (f) s2iBuildNameSuffix = -s2i
  718. [DEBUG]   (f) session = org.apache.maven.execution.MavenSession@506aabf6
  719. [DEBUG]   (f) settings = org.apache.maven.execution.SettingsAdapter@6824b913
  720. [DEBUG]   (f) skip = false
  721. [DEBUG]   (f) skipBuild = false
  722. [DEBUG]   (f) skipBuildPom = true
  723. [DEBUG]   (f) skipExtendedAuth = false
  724. [DEBUG]   (f) skipMachine = false
  725. [DEBUG]   (f) skipTag = false
  726. [DEBUG]   (f) sourceDirectory = src/main/docker
  727. [DEBUG]   (f) targetDir = C:\ws\DevSuite2.0.1\karaf-fis\target\classes\META-INF\fabric8
  728. [DEBUG]   (f) useColor = true
  729. [DEBUG]   (f) useProjectClasspath = false
  730. [DEBUG]   (f) verbose = false
  731. [DEBUG] -- end configuration --
  732. [DEBUG] Trying to configure client from Kubernetes config...
  733. [DEBUG] Found for Kubernetes config at: [C:\Users\Aurelien Pupier\.kube\config].
  734. [INFO] F8: Using OpenShift build with strategy S2I
  735. [INFO] F8: Running generator karaf
  736. [DEBUG] Field directory source: ${project.build.directory}/assembly/ interpolated to: target/assembly/
  737. [DEBUG] After assembly is interpolated:
  738.  
  739. <?xml version="1.0"?>
  740. <assembly xsi:schemaLocation="http://maven.apache.org/plugins/maven-assembly-plugin/assembly/1.1.3 http://maven.apache.org/xsd/assembly-1.1.3.xsd"
  741.     xmlns="http://maven.apache.org/plugins/maven-assembly-plugin/assembly/1.1.3"
  742.     xmlns:xsi="http://www.w3.org/2001/XMLSchema-instance">
  743.   <id>karaf</id>
  744.   <fileSets>
  745.     <fileSet>
  746.       <useDefaultExcludes>false</useDefaultExcludes>
  747.       <outputDirectory>/${project.artifactId}-${project.version}</outputDirectory>
  748.       <directoryMode>0774</directoryMode>
  749.       <directory>target/assembly/</directory>
  750.     </fileSet>
  751.   </fileSets>
  752. </assembly>
  753.  
  754.  
  755.  
  756. [DEBUG] All known ContainerDescriptorHandler components: [metaInf-services, file-aggregator, plexus, metaInf-spring]
  757. [DEBUG] No ArtifactResolver with hint project-cache-aware
  758. [ERROR] OS=Windows and the assembly descriptor contains a *nix-specific root-relative-reference (starting with slash) /${project.artifactId}-${project.version}
  759. [DEBUG] FileSet[karaf-fis-1.0.0-SNAPSHOT/] dir perms: -1 file perms: -1
  760. [DEBUG] The archive base directory is 'null'
  761. [DEBUG] NOT reformatting any files in C:\ws\DevSuite2.0.1\karaf-fis\target\assembly
  762. [DEBUG] Adding file-set in: C:\ws\DevSuite2.0.1\karaf-fis\target\assembly to archive location: ./karaf-fis-1.0.0-SNAPSHOT/
  763. [INFO] Copying files to C:\ws\DevSuite2.0.1\karaf-fis\target\docker\karaf-fis\latest\build\maven
  764. [INFO] Building tar: C:\ws\DevSuite2.0.1\karaf-fis\target\docker\karaf-fis\latest\tmp\docker-build.tar
  765. [DEBUG] Dockerfile already added, skipping
  766. [INFO] F8: [karaf-fis:latest] "karaf": Created docker source tar C:\ws\DevSuite2.0.1\karaf-fis\target\docker\karaf-fis\latest\tmp\docker-build.tar
  767. [DEBUG] Trying to configure client from Kubernetes config...
  768. [DEBUG] Found for Kubernetes config at: [C:\Users\Aurelien Pupier\.kube\config].
  769. [INFO] F8: Using BuildConfig karaf-fis-s2i for S2I build
  770. [INFO] F8: Using ImageStream karaf-fis
  771. [DEBUG] F8: fmp-dependency: Skipping jar:file:/C:/Users/Aurelien%20Pupier/.m2/repository/org/ops4j/pax/logging/pax-logging-service/1.8.5/pax-logging-service-1.8.5.jar!/META-INF/fabric8/kubernetes.yml: java.io.FileNotFoundException: JAR entry META-INF/fabric8/kubernetes.yml not found in C:\Users\Aurelien Pupier\.m2\repository\org\ops4j\pax\logging\pax-logging-service\1.8.5\pax-logging-service-1.8.5.jar
  772. [DEBUG] F8: fmp-dependency: Skipping jar:file:/C:/Users/Aurelien%20Pupier/.m2/repository/org/ops4j/pax/logging/pax-logging-api/1.8.5/pax-logging-api-1.8.5.jar!/META-INF/fabric8/kubernetes.yml: java.io.FileNotFoundException: JAR entry META-INF/fabric8/kubernetes.yml not found in C:\Users\Aurelien Pupier\.m2\repository\org\ops4j\pax\logging\pax-logging-api\1.8.5\pax-logging-api-1.8.5.jar
  773. [DEBUG] F8: fmp-dependency: Skipping jar:file:/C:/Users/Aurelien%20Pupier/.m2/repository/org/ops4j/pax/url/pax-url-aether/2.5.1/pax-url-aether-2.5.1.jar!/META-INF/fabric8/kubernetes.yml: java.io.FileNotFoundException: JAR entry META-INF/fabric8/kubernetes.yml not found in C:\Users\Aurelien Pupier\.m2\repository\org\ops4j\pax\url\pax-url-aether\2.5.1\pax-url-aether-2.5.1.jar
  774. [DEBUG] F8: fmp-dependency: Skipping jar:file:/C:/Users/Aurelien%20Pupier/.m2/repository/org/apache/felix/org.apache.felix.fileinstall/3.5.6/org.apache.felix.fileinstall-3.5.6.jar!/META-INF/fabric8/kubernetes.yml: java.io.FileNotFoundException: JAR entry META-INF/fabric8/kubernetes.yml not found in C:\Users\Aurelien Pupier\.m2\repository\org\apache\felix\org.apache.felix.fileinstall\3.5.6\org.apache.felix.fileinstall-3.5.6.jar
  775. [DEBUG] F8: fmp-dependency: Skipping jar:file:/C:/Users/Aurelien%20Pupier/.m2/repository/com/sun/xml/bind/jaxb-impl/2.2.11/jaxb-impl-2.2.11.jar!/META-INF/fabric8/kubernetes.yml: java.io.FileNotFoundException: JAR entry META-INF/fabric8/kubernetes.yml not found in C:\Users\Aurelien Pupier\.m2\repository\com\sun\xml\bind\jaxb-impl\2.2.11\jaxb-impl-2.2.11.jar
  776. [DEBUG] F8: fmp-dependency: Skipping jar:file:/C:/Users/Aurelien%20Pupier/.m2/repository/org/apache/karaf/features/org.apache.karaf.features.core/4.0.8/org.apache.karaf.features.core-4.0.8.jar!/META-INF/fabric8/kubernetes.yml: java.io.FileNotFoundException: JAR entry META-INF/fabric8/kubernetes.yml not found in C:\Users\Aurelien Pupier\.m2\repository\org\apache\karaf\features\org.apache.karaf.features.core\4.0.8\org.apache.karaf.features.core-4.0.8.jar
  777. [DEBUG] F8: fmp-dependency: Skipping jar:file:/C:/Users/Aurelien%20Pupier/.m2/repository/org/jledit/core/0.2.1/core-0.2.1.jar!/META-INF/fabric8/kubernetes.yml: java.io.FileNotFoundException: JAR entry META-INF/fabric8/kubernetes.yml not found in C:\Users\Aurelien Pupier\.m2\repository\org\jledit\core\0.2.1\core-0.2.1.jar
  778. [DEBUG] F8: fmp-dependency: Skipping jar:file:/C:/Users/Aurelien%20Pupier/.m2/repository/com/sun/xml/bind/jaxb-core/2.2.11/jaxb-core-2.2.11.jar!/META-INF/fabric8/kubernetes.yml: java.io.FileNotFoundException: JAR entry META-INF/fabric8/kubernetes.yml not found in C:\Users\Aurelien Pupier\.m2\repository\com\sun\xml\bind\jaxb-core\2.2.11\jaxb-core-2.2.11.jar
  779. [DEBUG] F8: fmp-dependency: Skipping jar:file:/C:/Users/Aurelien%20Pupier/.m2/repository/jline/jline/2.14.1/jline-2.14.1.jar!/META-INF/fabric8/kubernetes.yml: java.io.FileNotFoundException: JAR entry META-INF/fabric8/kubernetes.yml not found in C:\Users\Aurelien Pupier\.m2\repository\jline\jline\2.14.1\jline-2.14.1.jar
  780. [DEBUG] F8: fmp-dependency: Skipping jar:file:/C:/Users/Aurelien%20Pupier/.m2/repository/org/apache/felix/org.apache.felix.configadmin/1.8.8/org.apache.felix.configadmin-1.8.8.jar!/META-INF/fabric8/kubernetes.yml: java.io.FileNotFoundException: JAR entry META-INF/fabric8/kubernetes.yml not found in C:\Users\Aurelien Pupier\.m2\repository\org\apache\felix\org.apache.felix.configadmin\1.8.8\org.apache.felix.configadmin-1.8.8.jar
  781. [DEBUG] F8: fmp-dependency: Skipping jar:file:/C:/Users/Aurelien%20Pupier/.m2/repository/org/ops4j/pax/url/pax-url-aether-support/2.5.1/pax-url-aether-support-2.5.1.jar!/META-INF/fabric8/kubernetes.yml: java.io.FileNotFoundException: JAR entry META-INF/fabric8/kubernetes.yml not found in C:\Users\Aurelien Pupier\.m2\repository\org\ops4j\pax\url\pax-url-aether-support\2.5.1\pax-url-aether-support-2.5.1.jar
  782. [DEBUG] F8: fmp-dependency: Skipping jar:file:/C:/Users/Aurelien%20Pupier/.m2/repository/org/apache/karaf/features/org.apache.karaf.features.core/4.0.8/org.apache.karaf.features.core-4.0.8.jar!/META-INF/fabric8/openshift.yml: java.io.FileNotFoundException: JAR entry META-INF/fabric8/openshift.yml not found in C:\Users\Aurelien Pupier\.m2\repository\org\apache\karaf\features\org.apache.karaf.features.core\4.0.8\org.apache.karaf.features.core-4.0.8.jar
  783. [DEBUG] F8: fmp-dependency: Skipping jar:file:/C:/Users/Aurelien%20Pupier/.m2/repository/com/sun/xml/bind/jaxb-impl/2.2.11/jaxb-impl-2.2.11.jar!/META-INF/fabric8/openshift.yml: java.io.FileNotFoundException: JAR entry META-INF/fabric8/openshift.yml not found in C:\Users\Aurelien Pupier\.m2\repository\com\sun\xml\bind\jaxb-impl\2.2.11\jaxb-impl-2.2.11.jar
  784. [DEBUG] F8: fmp-dependency: Skipping jar:file:/C:/Users/Aurelien%20Pupier/.m2/repository/org/ops4j/pax/logging/pax-logging-service/1.8.5/pax-logging-service-1.8.5.jar!/META-INF/fabric8/openshift.yml: java.io.FileNotFoundException: JAR entry META-INF/fabric8/openshift.yml not found in C:\Users\Aurelien Pupier\.m2\repository\org\ops4j\pax\logging\pax-logging-service\1.8.5\pax-logging-service-1.8.5.jar
  785. [DEBUG] F8: fmp-dependency: Skipping jar:file:/C:/Users/Aurelien%20Pupier/.m2/repository/org/ops4j/pax/url/pax-url-aether-support/2.5.1/pax-url-aether-support-2.5.1.jar!/META-INF/fabric8/openshift.yml: java.io.FileNotFoundException: JAR entry META-INF/fabric8/openshift.yml not found in C:\Users\Aurelien Pupier\.m2\repository\org\ops4j\pax\url\pax-url-aether-support\2.5.1\pax-url-aether-support-2.5.1.jar
  786. [DEBUG] F8: fmp-dependency: Skipping jar:file:/C:/Users/Aurelien%20Pupier/.m2/repository/org/ops4j/pax/logging/pax-logging-api/1.8.5/pax-logging-api-1.8.5.jar!/META-INF/fabric8/openshift.yml: java.io.FileNotFoundException: JAR entry META-INF/fabric8/openshift.yml not found in C:\Users\Aurelien Pupier\.m2\repository\org\ops4j\pax\logging\pax-logging-api\1.8.5\pax-logging-api-1.8.5.jar
  787. [DEBUG] F8: fmp-dependency: Skipping jar:file:/C:/Users/Aurelien%20Pupier/.m2/repository/org/apache/felix/org.apache.felix.configadmin/1.8.8/org.apache.felix.configadmin-1.8.8.jar!/META-INF/fabric8/openshift.yml: java.io.FileNotFoundException: JAR entry META-INF/fabric8/openshift.yml not found in C:\Users\Aurelien Pupier\.m2\repository\org\apache\felix\org.apache.felix.configadmin\1.8.8\org.apache.felix.configadmin-1.8.8.jar
  788. [DEBUG] F8: fmp-dependency: Skipping jar:file:/C:/Users/Aurelien%20Pupier/.m2/repository/jline/jline/2.14.1/jline-2.14.1.jar!/META-INF/fabric8/openshift.yml: java.io.FileNotFoundException: JAR entry META-INF/fabric8/openshift.yml not found in C:\Users\Aurelien Pupier\.m2\repository\jline\jline\2.14.1\jline-2.14.1.jar
  789. [DEBUG] F8: fmp-dependency: Skipping jar:file:/C:/Users/Aurelien%20Pupier/.m2/repository/org/jledit/core/0.2.1/core-0.2.1.jar!/META-INF/fabric8/openshift.yml: java.io.FileNotFoundException: JAR entry META-INF/fabric8/openshift.yml not found in C:\Users\Aurelien Pupier\.m2\repository\org\jledit\core\0.2.1\core-0.2.1.jar
  790. [DEBUG] F8: fmp-dependency: Skipping jar:file:/C:/Users/Aurelien%20Pupier/.m2/repository/org/ops4j/pax/url/pax-url-aether/2.5.1/pax-url-aether-2.5.1.jar!/META-INF/fabric8/openshift.yml: java.io.FileNotFoundException: JAR entry META-INF/fabric8/openshift.yml not found in C:\Users\Aurelien Pupier\.m2\repository\org\ops4j\pax\url\pax-url-aether\2.5.1\pax-url-aether-2.5.1.jar
  791. [DEBUG] F8: fmp-dependency: Skipping jar:file:/C:/Users/Aurelien%20Pupier/.m2/repository/org/apache/felix/org.apache.felix.fileinstall/3.5.6/org.apache.felix.fileinstall-3.5.6.jar!/META-INF/fabric8/openshift.yml: java.io.FileNotFoundException: JAR entry META-INF/fabric8/openshift.yml not found in C:\Users\Aurelien Pupier\.m2\repository\org\apache\felix\org.apache.felix.fileinstall\3.5.6\org.apache.felix.fileinstall-3.5.6.jar
  792. [DEBUG] F8: fmp-dependency: Skipping jar:file:/C:/Users/Aurelien%20Pupier/.m2/repository/com/sun/xml/bind/jaxb-core/2.2.11/jaxb-core-2.2.11.jar!/META-INF/fabric8/openshift.yml: java.io.FileNotFoundException: JAR entry META-INF/fabric8/openshift.yml not found in C:\Users\Aurelien Pupier\.m2\repository\com\sun\xml\bind\jaxb-core\2.2.11\jaxb-core-2.2.11.jar
  793. [INFO] F8: Starting Build karaf-fis-s2i
  794. [INFO] F8: Waiting for build karaf-fis-s2i-2 to complete...
  795. [INFO] F8: Receiving source from STDIN as archive ...
  796. [INFO] F8: ==================================================================
  797. [INFO] F8: Starting S2I Karaf Build .....
  798. [INFO] F8: S2I binary build detected
  799. [INFO] F8: Copying binaries from /tmp/src/maven to /deployments ...
  800. [INFO] F8: Missing one or more than one assembly archive file *.zip in /tmp/src/maven
  801. [INFO] F8: error: build error: non-zero (13) exit code from fabric8/s2i-karaf:1.3
  802. [DEBUG] WebSocket successfully opened
  803. [ERROR] F8: OpenShift Build karaf-fis-s2i-2 Failed: AssembleFailed
  804. [INFO] ------------------------------------------------------------------------
  805. [INFO] BUILD FAILURE
  806. [INFO] ------------------------------------------------------------------------
  807. [INFO] Total time: 23.824 s
  808. [INFO] Finished at: 2017-10-04T14:29:13+02:00
  809. [INFO] Final Memory: 53M/625M
  810. [INFO] ------------------------------------------------------------------------
  811. [DEBUG] Connection manager is shutting down
  812. [DEBUG] Connection manager shut down
  813. [ERROR] Failed to execute goal io.fabric8:fabric8-maven-plugin:3.2.13:build (build-image) on project karaf-fis: OpenShift Build karaf-fis-s2i-2 Failed: AssembleFailed -> [Help 1]
  814. org.apache.maven.lifecycle.LifecycleExecutionException: Failed to execute goal io.fabric8:fabric8-maven-plugin:3.2.13:build (build-image) on project karaf-fis: OpenShift Build karaf-fis-s2i-2 Failed: AssembleFailed
  815.     at org.apache.maven.lifecycle.internal.MojoExecutor.execute(MojoExecutor.java:212)
  816.     at org.apache.maven.lifecycle.internal.MojoExecutor.execute(MojoExecutor.java:153)
  817.     at org.apache.maven.lifecycle.internal.MojoExecutor.execute(MojoExecutor.java:145)
  818.     at org.apache.maven.lifecycle.internal.LifecycleModuleBuilder.buildProject(LifecycleModuleBuilder.java:116)
  819.     at org.apache.maven.lifecycle.internal.LifecycleModuleBuilder.buildProject(LifecycleModuleBuilder.java:80)
  820.     at org.apache.maven.lifecycle.internal.builder.singlethreaded.SingleThreadedBuilder.build(SingleThreadedBuilder.java:51)
  821.     at org.apache.maven.lifecycle.internal.LifecycleStarter.execute(LifecycleStarter.java:128)
  822.     at org.apache.maven.DefaultMaven.doExecute(DefaultMaven.java:307)
  823.     at org.apache.maven.DefaultMaven.doExecute(DefaultMaven.java:193)
  824.     at org.apache.maven.DefaultMaven.execute(DefaultMaven.java:106)
  825.     at org.apache.maven.cli.MavenCli.execute(MavenCli.java:863)
  826.     at org.apache.maven.cli.MavenCli.doMain(MavenCli.java:288)
  827.     at org.apache.maven.cli.MavenCli.main(MavenCli.java:199)
  828.     at sun.reflect.NativeMethodAccessorImpl.invoke0(Native Method)
  829.     at sun.reflect.NativeMethodAccessorImpl.invoke(NativeMethodAccessorImpl.java:62)
  830.     at sun.reflect.DelegatingMethodAccessorImpl.invoke(DelegatingMethodAccessorImpl.java:43)
  831.     at java.lang.reflect.Method.invoke(Method.java:498)
  832.     at org.codehaus.plexus.classworlds.launcher.Launcher.launchEnhanced(Launcher.java:289)
  833.     at org.codehaus.plexus.classworlds.launcher.Launcher.launch(Launcher.java:229)
  834.     at org.codehaus.plexus.classworlds.launcher.Launcher.mainWithExitCode(Launcher.java:415)
  835.     at org.codehaus.plexus.classworlds.launcher.Launcher.main(Launcher.java:356)
  836. Caused by: org.apache.maven.plugin.MojoExecutionException: OpenShift Build karaf-fis-s2i-2 Failed: AssembleFailed
  837.     at io.fabric8.maven.plugin.mojo.build.BuildMojo.waitForOpenShiftBuildToComplete(BuildMojo.java:396)
  838.     at io.fabric8.maven.plugin.mojo.build.BuildMojo.executeOpenShiftBuild(BuildMojo.java:355)
  839.     at io.fabric8.maven.plugin.mojo.build.BuildMojo.buildAndTag(BuildMojo.java:272)
  840.     at io.fabric8.maven.docker.BuildMojoNoFork.executeInternal(BuildMojoNoFork.java:46)
  841.     at io.fabric8.maven.plugin.mojo.build.BuildMojo.executeInternal(BuildMojo.java:253)
  842.     at io.fabric8.maven.docker.AbstractDockerMojo.execute(AbstractDockerMojo.java:208)
  843.     at io.fabric8.maven.plugin.mojo.build.BuildMojo.execute(BuildMojo.java:236)
  844.     at org.apache.maven.plugin.DefaultBuildPluginManager.executeMojo(DefaultBuildPluginManager.java:134)
  845.     at org.apache.maven.lifecycle.internal.MojoExecutor.execute(MojoExecutor.java:207)
  846.     ... 20 more
  847. [ERROR]
  848. [ERROR]
  849. [ERROR] For more information about the errors and possible solutions, please read the following articles:
  850. [ERROR] [Help 1] http://cwiki.apache.org/confluence/display/MAVEN/MojoExecutionException
RAW Paste Data
We use cookies for various purposes including analytics. By continuing to use Pastebin, you agree to our use of cookies as described in the Cookies Policy. OK, I Understand
 
Top