Advertisement
fire219

linux build fail

Jun 23rd, 2016
162
0
Never
Not a member of Pastebin yet? Sign Up, it unlocks many cool features!
text 2.32 KB | None | 0 0
  1. matthew@matthew-ThinkCentre:~/Pine64dev/linux-a64-v5$ sudo make -j4 ARCH=arm64 CROSS_COMPILE=../aarch64-linux-gnu/bin/aarch64-linux-gnu- Image
  2. CHK include/config/kernel.release
  3. CHK include/generated/uapi/linux/version.h
  4. CHK include/generated/utsrelease.h
  5. CHK include/generated/timeconst.h
  6. CHK include/generated/bounds.h
  7. CHK include/generated/asm-offsets.h
  8. CALL scripts/checksyscalls.sh
  9. CHK include/generated/compile.h
  10. SKIPPED include/generated/compile.h
  11. CHK kernel/config_data.h
  12. make[1]: *** No rule to make target `sound/sound_core.o', needed by `sound/soundcore.o'. Stop.
  13. make: *** [sound] Error 2
  14. make: *** Waiting for unfinished jobs....
  15. LD drivers/acpi/acpi.o
  16. CC drivers/acpi/button.o
  17. CC drivers/acpi/fan.o
  18. make[3]: *** No rule to make target `drivers/acpi/acpica/tbinstal.o', needed by `drivers/acpi/acpica/acpi.o'. Stop.
  19. make[3]: *** Waiting for unfinished jobs....
  20. CC drivers/acpi/acpica/tbfind.o
  21. drivers/acpi/acpica/tbfind.c: In function 'acpi_tb_find_table':
  22. drivers/acpi/acpica/tbfind.c:79:10: error: implicit declaration of function 'acpi_is_valid_signature' [-Werror=implicit-function-declaration]
  23. if (!acpi_is_valid_signature(signature)) {
  24. ^
  25. cc1: some warnings being treated as errors
  26. make[3]: *** [drivers/acpi/acpica/tbfind.o] Error 1
  27. CC drivers/acpi/processor_driver.o
  28. make[2]: *** [drivers/acpi/acpica] Error 2
  29. make[2]: *** Waiting for unfinished jobs....
  30. CC drivers/clocksource/clksrc-probe.o
  31. CC drivers/cpufreq/cpufreq.o
  32. make[1]: *** [drivers/acpi] Error 2
  33. make[1]: *** Waiting for unfinished jobs....
  34. CC drivers/clocksource/mmio.o
  35. CC drivers/clocksource/rockchip_timer.o
  36. CC drivers/clocksource/mtk_timer.o
  37. CC drivers/clocksource/arm_arch_timer.o
  38. CC drivers/clocksource/timer-sp804.o
  39. CC drivers/clocksource/dummy_timer.o
  40. CC drivers/cpufreq/freq_table.o
  41. CC drivers/cpufreq/cpufreq_stats.o
  42. LD drivers/clocksource/built-in.o
  43. CC drivers/cpufreq/cpufreq_performance.o
  44. CC drivers/cpufreq/arm_big_little.o
  45. CC drivers/cpufreq/scpi-cpufreq.o
  46. CC drivers/cpufreq/tegra20-cpufreq.o
  47. LD drivers/cpufreq/built-in.o
  48. make: *** [drivers] Error 2
  49. matthew@matthew-ThinkCentre:~/Pine64dev/linux-a64-v5$
Advertisement
Add Comment
Please, Sign In to add comment
Advertisement