Guest User

Untitled

a guest
Jun 30th, 2021
67
0
Never
Not a member of Pastebin yet? Sign Up, it unlocks many cool features!
text 0.94 KB | None | 0 0
  1. [ERROR] Failed to execute goal org.apache.maven.plugins:maven-antrun-plugin:1.8:run (default) on project VstsReport: An Ant BuildException has occured: Unable to read execution data file /agent/_work/2/s/parameter/CCReport43F6D5EF/jacoco.exec
  2. [ERROR] around Ant part ...<report>... @ 8:11 in /agent/_work/2/s/parameter/target/antrun/build-main.xml: /agent/_work/2/s/parameter/CCReport43F6D5EF/jacoco.exec (No such file or directory)
  3. [ERROR] -> [Help 1]
  4. [ERROR]
  5. [ERROR] To see the full stack trace of the errors, re-run Maven with the -e switch.
  6. [ERROR] Re-run Maven using the -X switch to enable full debug logging.
  7. [ERROR]
  8. [ERROR] For more information about the errors and possible solutions, please read the following articles:
  9. [ERROR] [Help 1] http://cwiki.apache.org/confluence/display/MAVEN/MojoExecutionException
  10. ##[warning]No code coverage found to publish. There might be a build failure resulting in no code coverage or there might be no tests.
  11.  
Advertisement
Add Comment
Please, Sign In to add comment