daily pastebin goal
46%
SHARE
TWEET

Untitled

a guest Mar 25th, 2019 66 Never
Not a member of Pastebin yet? Sign Up, it unlocks many cool features!
  1.  BUILD SUCCESSFUL in 9s
  2.      [exec] 22 actionable tasks: 22 executed
  3.      [exec]
  4.      [exec] > Task :setUpYarn
  5.      [exec] > Task :downloadNode
  6.      [exec]
  7.      [exec] > Task :yarnInstall
  8.      [exec] yarn install v1.13.0
  9.      [exec] [1/4] Resolving packages...
  10.      [exec] [2/4] Fetching packages...
  11.      [exec] info fsevents@1.2.7: The platform "win32" is incompatible with this module.
  12.      [exec] info "fsevents@1.2.7" is an optional dependency and failed compatibility check. Excluding it from installation.
  13.      [exec] [3/4] Linking dependencies...
  14.      [exec] warning "workspace-aggregator-446d7131-a885-48a9-ab5d-c34bab7b881d > frontend-js-web > babel-loader@7.1.5" has unmet peer dependency "babel-core@6".
  15.      [exec] warning "workspace-aggregator-446d7131-a885-48a9-ab5d-c34bab7b881d > segments-web > eslint-plugin-sort-destructure-keys@1.1.0" has incorrect peer dependency "eslint@^3.0.0 || ^4.0.0".
  16.      [exec] warning "workspace-aggregator-446d7131-a885-48a9-ab5d-c34bab7b881d > analytics-client-js > karma-webpack@3.0.5" has incorrect peer dependency "webpack@^2.0.0 || ^3.0.0".
  17.      [exec] warning "workspace-aggregator-446d7131-a885-48a9-ab5d-c34bab7b881d > frontend-editor-alloyeditor-web > alloyeditor > val-loader@1.1.1" has unmet peer dependency "webpack@^2.0.0 || ^3.0.0 || ^4.0.0".
  18.      [exec] [4/4] Building fresh packages...
  19.      [exec] error C:\Users\kresimircoko\Documents\git\ce-7.x\liferay-portal\modules\node_modules\node-sass: Command failed.
  20.      [exec] Exit code: 1
  21.      [exec] Command: node scripts/build.js
  22.      [exec] Arguments:
  23.      [exec] Directory: C:\Users\kresimircoko\Documents\git\ce-7.x\liferay-portal\modules\node_modules\node-sass
  24.      [exec] Output:
  25.      [exec] Building: C:\Users\kresimircoko\Documents\git\ce-7.x\liferay-portal\build\node\node.exe C:\Users\kresimircoko\Documents\git\ce-7.x\liferay-portal\modules\node_modules\node-gyp\bin\node-gyp.js rebuild --verbose --libsass_ext= --libsass_cflags= --libsass_ldflags= --libsass_library=
  26.      [exec] gyp info it worked if it ends with ok
  27.      [exec] gyp verb cli [ 'C:\\Users\\kresimircoko\\Documents\\git\\ce-7.x\\liferay-portal\\build\\node\\node.exe',
  28.      [exec] gyp verb cli   'C:\\Users\\kresimircoko\\Documents\\git\\ce-7.x\\liferay-portal\\modules\\node_modules\\node-gyp\\bin\\node-gyp.js',
  29.      [exec] gyp verb cli   'rebuild',
  30.      [exec] gyp verb cli   '--verbose',
  31.      [exec] gyp verb cli   '--libsass_ext=',
  32.      [exec] gyp verb cli   '--libsass_cflags=',
  33.      [exec] gyp verb cli   '--libsass_ldflags=',
  34.      [exec] gyp verb cli   '--libsass_library=' ]
  35.      [exec] gyp info using node-gyp@3.8.0
  36.      [exec] gyp info using node@10.15.1 | win32 | x64
  37.      [exec] gyp verb command rebuild []
  38.      [exec] gyp verb command clean []
  39.      [exec] gyp verb clean removing "build" directory
  40.      [exec] gyp verb command configure []
  41.      [exec] gyp verb check python checking for Python executable "C:\Users\kresimircoko\.windows-build-tools\python27\python.exe" in the PATH
  42.      [exec] gyp verb `which` succeeded C:\Users\kresimircoko\.windows-build-tools\python27\python.exe C:\Users\kresimircoko\.windows-build-tools\python27\python.exe
  43.      [exec] gyp verb check python version `C:\Users\kresimircoko\.windows-build-tools\python27\python.exe -c "import sys; print "2.7.13
  44.      [exec] gyp verb check python version .%s.%s" % sys.version_info[:3];"` returned: %j
  45.      [exec] gyp verb get node dir no --target version specified, falling back to host node version: 10.15.1
  46.      [exec] gyp verb command install [ '10.15.1' ]
  47.      [exec] gyp verb install input version string "10.15.1"
  48.      [exec] gyp verb install installing version: 10.15.1
  49.      [exec] gyp verb install --ensure was passed, so won't reinstall if already installed
  50.      [exec] gyp verb install version is already installed, need to check "installVersion"
  51.      [exec] gyp verb got "installVersion" 9
  52.      [exec] gyp verb needs "installVersion" 9
  53.      [exec] gyp verb install version is good
  54.      [exec] gyp verb get node dir target node version installed: 10.15.1
  55.      [exec] gyp verb build dir attempting to create "build" dir: C:\Users\kresimircoko\Documents\git\ce-7.x\liferay-portal\modules\node_modules\node-sass\build
  56.      [exec] gyp verb build dir "build" dir needed to be created? C:\Users\kresimircoko\Documents\git\ce-7.x\liferay-portal\modules\node_modules\node-sass\build
  57.      [exec] gyp verb Not using VS2017: Could not use PowerShell to find VS2017
  58.      [exec] gyp verb build/config.gypi creating config file
  59.      [exec] gyp verb build/config.gypi writing out config file: C:\Users\kresimircoko\Documents\git\ce-7.x\liferay-portal\modules\node_modules\node-sass\build\config.gypi
  60.      [exec] gyp verb config.gypi checking for gypi file: C:\Users\kresimircoko\Documents\git\ce-7.x\liferay-portal\modules\node_modules\node-sass\config.gypi
  61.      [exec] gyp verb common.gypi checking for gypi file: C:\Users\kresimircoko\Documents\git\ce-7.x\liferay-portal\modules\node_modules\node-sass\common.gypi
  62.      [exec] gyp verb gyp gyp format was not specified; forcing "msvs"
  63.      [exec] gyp info spawn C:\Users\kresimircoko\.windows-build-tools\python27\python.exe
  64.      [exec] gyp info spawn args [ 'C:\\Users\\kresimircoko\\Documents\\git\\ce-7.x\\liferay-portal\\modules\\node_modules\\node-gyp\\gyp\\gyp_main.py',
  65.      [exec] gyp info spawn args   'binding.gyp',
  66.      [exec] gyp info spawn args   '-f',
  67.      [exec] gyp info spawn args   'msvs',
  68.      [exec] gyp info spawn args   '-G',
  69.      [exec] gyp info spawn args   'msvs_version=auto',
  70.      [exec] gyp info spawn args   '-I',
  71.      [exec] gyp info spawn args   'C:\\Users\\kresimircoko\\Documents\\git\\ce-7.x\\liferay-portal\\modules\\node_modules\\node-sass\\build\\config.gypi',
  72.      [exec] gyp info spawn args   '-I',
  73.      [exec] gyp info spawn args   'C:\\Users\\kresimircoko\\Documents\\git\\ce-7.x\\liferay-portal\\modules\\node_modules\\node-gyp\\addon.gypi',
  74.      [exec] gyp info spawn args   '-I',
  75.      [exec] gyp info spawn args   'C:\\Users\\kresimircoko\\.node-gyp\\10.15.1\\include\\node\\common.gypi',
  76.      [exec] gyp info spawn args   '-Dlibrary=shared_library',
  77.      [exec] gyp info spawn args   '-Dvisibility=default',
  78.      [exec] gyp info spawn args   '-Dnode_root_dir=C:\\Users\\kresimircoko\\.node-gyp\\10.15.1',
  79.      [exec] gyp info spawn args   '-Dnode_gyp_dir=C:\\Users\\kresimircoko\\Documents\\git\\ce-7.x\\liferay-portal\\modules\\node_modules\\node-gyp',
  80.      [exec] gyp info spawn args   '-Dnode_lib_file=C:\\Users\\kresimircoko\\.node-gyp\\10.15.1\\<(target_arch)\\node.lib',
  81.      [exec] gyp info spawn args   '-Dmodule_root_dir=C:\\Users\\kresimircoko\\Documents\\git\\ce-7.x\\liferay-portal\\modules\\node_modules\\node-sass',
  82.      [exec] gyp info spawn args   '-Dnode_engine=v8',
  83.      [exec] gyp info spawn args   '--depth=.',
  84.      [exec] gyp info spawn args   '--no-parallel',
  85.      [exec] gyp info spawn args   '--generator-output',
  86.      [exec] gyp info spawn args   'C:\\Users\\kresimircoko\\Documents\\git\\ce-7.x\\liferay-portal\\modules\\node_modules\\node-sass\\build',
  87.      [exec] gyp info spawn args   '-Goutput_dir=.' ]
  88.      [exec] Warning: unrecognized setting VCCLCompilerTool/MultiProcessorCompilation
  89.      [exec] Warning: unrecognized setting VCCLCompilerTool/MultiProcessorCompilation
  90.      [exec] Warning: unrecognized setting VCCLCompilerTool/MultiProcessorCompilation
  91.      [exec] Warning: unrecognized setting VCCLCompilerTool/MultiProcessorCompilation
  92.      [exec] gyp verb command build []
  93.      [exec] gyp verb build type Release
  94.      [exec] gyp verb architecture x64
  95.      [exec] gyp verb node dev dir C:\Users\kresimircoko\.node-gyp\10.15.1
  96.      [exec] gyp verb found first Solution file build/binding.sln
  97.      [exec] gyp verb could not find "msbuild.exe" in PATH - finding location in registry
  98.      [exec] gyp info spawn C:\Program Files (x86)\MSBuild\14.0\bin\msbuild.exe
  99.      [exec] gyp info spawn args [ 'build/binding.sln',
  100.      [exec] gyp info spawn args   '/nologo',
  101.      [exec] gyp info spawn args   '/p:Configuration=Release;Platform=x64' ]
  102.      [exec] Building the projects in this solution one at a time. To enable parallel build, please add the "/m" switch.
  103.      [exec] Build started 25/03/2019 11:56:35.
  104.      [exec] Project "C:\Users\kresimircoko\Documents\git\ce-7.x\liferay-portal\modules\node_modules\node-sass\build\binding.sln" on node 1 (default targets).
  105.      [exec] ValidateSolutionConfiguration:
  106.      [exec]   Building solution configuration "Release|x64".
  107.      [exec] MSBUILD : error MSB3428: Could not load the Visual C++ component "VCBuild.exe". To fix this, 1) install the .NET Framework 2.0 SDK, 2) install Microsoft Visual Studio 2005 or 3) add the location of the component to the system path if it is installed elsewhere.  [C:\Users\kresimircoko\Documents\git\ce-7.x\liferay-portal\modules\node_modules\node-sass\build\binding.sln]
  108.      [exec] Done Building Project "C:\Users\kresimircoko\Documents\git\ce-7.x\liferay-portal\modules\node_modules\node-sass\build\binding.sln" (default targets) -- FAILED.
  109.      [exec]
  110.      [exec] Build FAILED.
  111.      [exec]
  112.      [exec] "C:\Users\kresimircoko\Documents\git\ce-7.x\liferay-portal\modules\node_modules\node-sass\build\binding.sln" (default target) (1) ->
  113.      [exec] (_src_\libsass target) ->
  114.      [exec]   MSBUILD : error MSB3428: Could not load the Visual C++ component "VCBuild.exe". To fix this, 1) install the .NET Framework 2.0 SDK, 2) install Microsoft Visual Studio 2005 or 3) add the location of the component to the system path if it is installed elsewhere.  [C:\Users\kresimircoko\Documents\git\ce-7.x\liferay-portal\modules\node_modules\node-sass\build\binding.sln]
  115.      [exec]
  116.      [exec]     0 Warning(s)
  117.      [exec]     1 Error(s)
  118.      [exec]
  119.      [exec] Time Elapsed 00:00:00.11
  120.      [exec] gyp ERR! build error
  121.      [exec] gyp ERR! stack Error: `C:\Program Files (x86)\MSBuild\14.0\bin\msbuild.exe` failed with exit code: 1
  122.      [exec] gyp ERR! stack     at ChildProcess.onExit (C:\Users\kresimircoko\Documents\git\ce-7.x\liferay-portal\modules\node_modules\node-gyp\lib\build.js:262:23)
  123.      [exec] gyp ERR! stack     at ChildProcess.emit (events.js:189:13)
  124.      [exec] gyp ERR! stack     at Process.ChildProcess._handle.onexit (internal/child_process.js:248:12)
  125.      [exec] gyp ERR! System Windows_NT 10.0.17134
  126.      [exec] gyp ERR! command "C:\\Users\\kresimircoko\\Documents\\git\\ce-7.x\\liferay-portal\\build\\node\\node.exe" "C:\\Users\\kresimircoko\\Documents\\git\\ce-7.x\\liferay-portal\\modules\\node_modules\\node-gyp\\bin\\node-gyp.js" "rebuild" "--verbose" "--libsass_ext=" "--libsass_cflags=" "--libsass_ldflags=" "--libsass_library="
  127.      [exec] gyp ERR! cwd C:\Users\kresimircoko\Documents\git\ce-7.x\liferay-portal\modules\node_modules\node-sass
  128.      [exec] gyp ERR! node -v v10.15.1
  129.      [exec] gyp ERR! node-gyp -v v3.8.0
  130.      [exec] gyp ERR! not ok
  131.      [exec] Build failed with error code: 1
  132.      [exec] info Visit https://yarnpkg.com/en/docs/cli/install for documentation about this command.
  133.      [exec]
  134.      [exec] > Task :yarnInstall FAILED
  135.      [exec]
  136.      [exec] FAILURE: Build failed with an exception.
  137.      [exec]
  138.      [exec] * What went wrong:
  139.      [exec] Execution failed for task ':yarnInstall'.
  140.      [exec] > java.io.IOException: Process '[cmd, /c, ""C:\Users\kresimircoko\Documents\git\ce-7.x\liferay-portal\build\node\node" "C:/Users/kresimircoko/Documents/git/ce-7.x/liferay-portal/modules/yarn-1.13.0.js" "install" "--frozen-lockfile""]' finished with non-zero exit value 1
  141.      [exec]
  142.      [exec] * Try:
  143.      [exec] Run with --info or --debug option to get more log output. Run with --scan to get full insights.
  144.      [exec]
  145.      [exec] * Exception is:
  146.      [exec] org.gradle.api.tasks.TaskExecutionException: Execution failed for task ':yarnInstall'.
  147.      [exec]     at org.gradle.api.internal.tasks.execution.ExecuteActionsTaskExecuter.executeActions(ExecuteActionsTaskExecuter.java:110)
  148.      [exec]     at org.gradle.api.internal.tasks.execution.ExecuteActionsTaskExecuter.execute(ExecuteActionsTaskExecuter.java:77)
  149.      [exec]     at org.gradle.api.internal.tasks.execution.OutputDirectoryCreatingTaskExecuter.execute(OutputDirectoryCreatingTaskExecuter.java:51)
  150.      [exec]     at org.gradle.api.internal.tasks.execution.SkipUpToDateTaskExecuter.execute(SkipUpToDateTaskExecuter.java:59)
  151.      [exec]     at org.gradle.api.internal.tasks.execution.ResolveTaskOutputCachingStateExecuter.execute(ResolveTaskOutputCachingStateExecuter.java:54)
  152.      [exec]     at org.gradle.api.internal.tasks.execution.ValidatingTaskExecuter.execute(ValidatingTaskExecuter.java:59)
  153.      [exec]     at org.gradle.api.internal.tasks.execution.SkipEmptySourceFilesTaskExecuter.execute(SkipEmptySourceFilesTaskExecuter.java:101)
  154.      [exec]     at org.gradle.api.internal.tasks.execution.FinalizeInputFilePropertiesTaskExecuter.execute(FinalizeInputFilePropertiesTaskExecuter.java:44)
  155.      [exec]     at org.gradle.api.internal.tasks.execution.CleanupStaleOutputsExecuter.execute(CleanupStaleOutputsExecuter.java:91)
  156.      [exec]     at org.gradle.api.internal.tasks.execution.ResolveTaskArtifactStateTaskExecuter.execute(ResolveTaskArtifactStateTaskExecuter.java:62)
  157.      [exec]     at org.gradle.api.internal.tasks.execution.SkipTaskWithNoActionsExecuter.execute(SkipTaskWithNoActionsExecuter.java:59)
  158.      [exec]     at org.gradle.api.internal.tasks.execution.SkipOnlyIfTaskExecuter.execute(SkipOnlyIfTaskExecuter.java:54)
  159.      [exec]     at org.gradle.api.internal.tasks.execution.ExecuteAtMostOnceTaskExecuter.execute(ExecuteAtMostOnceTaskExecuter.java:43)
  160.      [exec]     at org.gradle.api.internal.tasks.execution.CatchExceptionTaskExecuter.execute(CatchExceptionTaskExecuter.java:34)
  161.      [exec]     at org.gradle.api.internal.tasks.execution.EventFiringTaskExecuter$1.run(EventFiringTaskExecuter.java:51)
  162.      [exec]     at org.gradle.internal.operations.DefaultBuildOperationExecutor$RunnableBuildOperationWorker.execute(DefaultBuildOperationExecutor.java:300)
  163.      [exec]     at org.gradle.internal.operations.DefaultBuildOperationExecutor$RunnableBuildOperationWorker.execute(DefaultBuildOperationExecutor.java:292)
  164.      [exec]     at org.gradle.internal.operations.DefaultBuildOperationExecutor.execute(DefaultBuildOperationExecutor.java:174)
  165.      [exec]     at org.gradle.internal.operations.DefaultBuildOperationExecutor.run(DefaultBuildOperationExecutor.java:90)
  166.      [exec]     at org.gradle.internal.operations.DelegatingBuildOperationExecutor.run(DelegatingBuildOperationExecutor.java:31)
  167.      [exec]     at org.gradle.api.internal.tasks.execution.EventFiringTaskExecuter.execute(EventFiringTaskExecuter.java:46)
  168.      [exec]     at org.gradle.execution.taskgraph.LocalTaskInfoExecutor.execute(LocalTaskInfoExecutor.java:42)
  169.      [exec]     at org.gradle.execution.taskgraph.DefaultTaskExecutionGraph$BuildOperationAwareWorkItemExecutor.execute(DefaultTaskExecutionGraph.java:277)
  170.      [exec]     at org.gradle.execution.taskgraph.DefaultTaskExecutionGraph$BuildOperationAwareWorkItemExecutor.execute(DefaultTaskExecutionGraph.java:262)
  171.      [exec]     at org.gradle.execution.taskgraph.DefaultTaskPlanExecutor$ExecutorWorker$1.execute(DefaultTaskPlanExecutor.java:135)
  172.      [exec]     at org.gradle.execution.taskgraph.DefaultTaskPlanExecutor$ExecutorWorker$1.execute(DefaultTaskPlanExecutor.java:130)
  173.      [exec]     at org.gradle.execution.taskgraph.DefaultTaskPlanExecutor$ExecutorWorker.execute(DefaultTaskPlanExecutor.java:200)
  174.      [exec]     at org.gradle.execution.taskgraph.DefaultTaskPlanExecutor$ExecutorWorker.executeWithWork(DefaultTaskPlanExecutor.java:191)
  175.      [exec]     at org.gradle.execution.taskgraph.DefaultTaskPlanExecutor$ExecutorWorker.run(DefaultTaskPlanExecutor.java:130)
  176.      [exec]     at org.gradle.execution.taskgraph.DefaultTaskPlanExecutor.process(DefaultTaskPlanExecutor.java:74)
  177.      [exec]     at org.gradle.execution.taskgraph.DefaultTaskExecutionGraph.execute(DefaultTaskExecutionGraph.java:143)
  178.      [exec]     at org.gradle.execution.SelectedTaskExecutionAction.execute(SelectedTaskExecutionAction.java:40)
  179.      [exec]     at org.gradle.execution.DefaultBuildExecuter.execute(DefaultBuildExecuter.java:40)
  180.      [exec]     at org.gradle.execution.DefaultBuildExecuter.access$000(DefaultBuildExecuter.java:24)
  181.      [exec]     at org.gradle.execution.DefaultBuildExecuter$1.proceed(DefaultBuildExecuter.java:46)
  182.      [exec]     at org.gradle.execution.DryRunBuildExecutionAction.execute(DryRunBuildExecutionAction.java:49)
  183.      [exec]     at org.gradle.execution.DefaultBuildExecuter.execute(DefaultBuildExecuter.java:40)
  184.      [exec]     at org.gradle.execution.DefaultBuildExecuter.execute(DefaultBuildExecuter.java:33)
  185.      [exec]     at org.gradle.initialization.DefaultGradleLauncher$ExecuteTasks.run(DefaultGradleLauncher.java:355)
  186.      [exec]     at org.gradle.internal.operations.DefaultBuildOperationExecutor$RunnableBuildOperationWorker.execute(DefaultBuildOperationExecutor.java:300)
  187.      [exec]     at org.gradle.internal.operations.DefaultBuildOperationExecutor$RunnableBuildOperationWorker.execute(DefaultBuildOperationExecutor.java:292)
  188.      [exec]     at org.gradle.internal.operations.DefaultBuildOperationExecutor.execute(DefaultBuildOperationExecutor.java:174)
  189.      [exec]     at org.gradle.internal.operations.DefaultBuildOperationExecutor.run(DefaultBuildOperationExecutor.java:90)
  190.      [exec]     at org.gradle.internal.operations.DelegatingBuildOperationExecutor.run(DelegatingBuildOperationExecutor.java:31)
  191.      [exec]     at org.gradle.initialization.DefaultGradleLauncher.runTasks(DefaultGradleLauncher.java:219)
  192.      [exec]     at org.gradle.initialization.DefaultGradleLauncher.doBuildStages(DefaultGradleLauncher.java:149)
  193.      [exec]     at org.gradle.initialization.DefaultGradleLauncher.executeTasks(DefaultGradleLauncher.java:124)
  194.      [exec]     at org.gradle.internal.invocation.GradleBuildController$1.call(GradleBuildController.java:77)
  195.      [exec]     at org.gradle.internal.invocation.GradleBuildController$1.call(GradleBuildController.java:74)
  196.      [exec]     at org.gradle.internal.work.DefaultWorkerLeaseService.withLocks(DefaultWorkerLeaseService.java:154)
  197.      [exec]     at org.gradle.internal.work.StopShieldingWorkerLeaseService.withLocks(StopShieldingWorkerLeaseService.java:38)
  198.      [exec]     at org.gradle.internal.invocation.GradleBuildController.doBuild(GradleBuildController.java:96)
  199.      [exec]     at org.gradle.internal.invocation.GradleBuildController.run(GradleBuildController.java:74)
  200.      [exec]     at org.gradle.tooling.internal.provider.ExecuteBuildActionRunner.run(ExecuteBuildActionRunner.java:28)
  201.      [exec]     at org.gradle.launcher.exec.ChainingBuildActionRunner.run(ChainingBuildActionRunner.java:35)
  202.      [exec]     at org.gradle.tooling.internal.provider.ValidatingBuildActionRunner.run(ValidatingBuildActionRunner.java:32)
  203.      [exec]     at org.gradle.launcher.exec.RunAsBuildOperationBuildActionRunner$3.run(RunAsBuildOperationBuildActionRunner.java:50)
  204.      [exec]     at org.gradle.internal.operations.DefaultBuildOperationExecutor$RunnableBuildOperationWorker.execute(DefaultBuildOperationExecutor.java:300)
  205.      [exec]     at org.gradle.internal.operations.DefaultBuildOperationExecutor$RunnableBuildOperationWorker.execute(DefaultBuildOperationExecutor.java:292)
  206.      [exec]     at org.gradle.internal.operations.DefaultBuildOperationExecutor.execute(DefaultBuildOperationExecutor.java:174)
  207.      [exec]     at org.gradle.internal.operations.DefaultBuildOperationExecutor.run(DefaultBuildOperationExecutor.java:90)
  208.      [exec]     at org.gradle.internal.operations.DelegatingBuildOperationExecutor.run(DelegatingBuildOperationExecutor.java:31)
  209.      [exec]     at org.gradle.launcher.exec.RunAsBuildOperationBuildActionRunner.run(RunAsBuildOperationBuildActionRunner.java:45)
  210.      [exec]     at org.gradle.tooling.internal.provider.SubscribableBuildActionRunner.run(SubscribableBuildActionRunner.java:51)
  211.      [exec]     at org.gradle.launcher.exec.InProcessBuildActionExecuter$1.transform(InProcessBuildActionExecuter.java:47)
  212.      [exec]     at org.gradle.launcher.exec.InProcessBuildActionExecuter$1.transform(InProcessBuildActionExecuter.java:44)
  213.      [exec]     at org.gradle.composite.internal.DefaultRootBuildState.run(DefaultRootBuildState.java:79)
  214.      [exec]     at org.gradle.launcher.exec.InProcessBuildActionExecuter.execute(InProcessBuildActionExecuter.java:44)
  215.      [exec]     at org.gradle.launcher.exec.InProcessBuildActionExecuter.execute(InProcessBuildActionExecuter.java:30)
  216.      [exec]     at org.gradle.launcher.exec.BuildTreeScopeBuildActionExecuter.execute(BuildTreeScopeBuildActionExecuter.java:39)
  217.      [exec]     at org.gradle.launcher.exec.BuildTreeScopeBuildActionExecuter.execute(BuildTreeScopeBuildActionExecuter.java:25)
  218.      [exec]     at org.gradle.tooling.internal.provider.ContinuousBuildActionExecuter.execute(ContinuousBuildActionExecuter.java:80)
  219.      [exec]     at org.gradle.tooling.internal.provider.ContinuousBuildActionExecuter.execute(ContinuousBuildActionExecuter.java:53)
  220.      [exec]     at org.gradle.tooling.internal.provider.ServicesSetupBuildActionExecuter.execute(ServicesSetupBuildActionExecuter.java:62)
  221.      [exec]     at org.gradle.tooling.internal.provider.ServicesSetupBuildActionExecuter.execute(ServicesSetupBuildActionExecuter.java:34)
  222.      [exec]     at org.gradle.tooling.internal.provider.GradleThreadBuildActionExecuter.execute(GradleThreadBuildActionExecuter.java:36)
  223.      [exec]     at org.gradle.tooling.internal.provider.GradleThreadBuildActionExecuter.execute(GradleThreadBuildActionExecuter.java:25)
  224.      [exec]     at org.gradle.tooling.internal.provider.ParallelismConfigurationBuildActionExecuter.execute(ParallelismConfigurationBuildActionExecuter.java:43)
  225.      [exec]     at org.gradle.tooling.internal.provider.ParallelismConfigurationBuildActionExecuter.execute(ParallelismConfigurationBuildActionExecuter.java:29)
  226.      [exec]     at org.gradle.tooling.internal.provider.StartParamsValidatingActionExecuter.execute(StartParamsValidatingActionExecuter.java:59)
  227.      [exec]     at org.gradle.tooling.internal.provider.StartParamsValidatingActionExecuter.execute(StartParamsValidatingActionExecuter.java:31)
  228.      [exec]     at org.gradle.tooling.internal.provider.SessionFailureReportingActionExecuter.execute(SessionFailureReportingActionExecuter.java:59)
  229.      [exec]     at org.gradle.tooling.internal.provider.SessionFailureReportingActionExecuter.execute(SessionFailureReportingActionExecuter.java:44)
  230.      [exec]     at org.gradle.tooling.internal.provider.SetupLoggingActionExecuter.execute(SetupLoggingActionExecuter.java:46)
  231.      [exec]     at org.gradle.tooling.internal.provider.SetupLoggingActionExecuter.execute(SetupLoggingActionExecuter.java:30)
  232.      [exec]     at org.gradle.launcher.cli.RunBuildAction.run(RunBuildAction.java:52)
  233.      [exec]     at org.gradle.internal.Actions$RunnableActionAdapter.execute(Actions.java:207)
  234.      [exec]     at org.gradle.launcher.cli.CommandLineActionFactory$ParseAndBuildAction.execute(CommandLineActionFactory.java:402)
  235.      [exec]     at org.gradle.launcher.cli.CommandLineActionFactory$ParseAndBuildAction.execute(CommandLineActionFactory.java:375)
  236.      [exec]     at org.gradle.launcher.cli.ExceptionReportingAction.execute(ExceptionReportingAction.java:37)
  237.      [exec]     at org.gradle.launcher.cli.ExceptionReportingAction.execute(ExceptionReportingAction.java:23)
  238.      [exec]     at org.gradle.launcher.cli.CommandLineActionFactory$WithLogging.execute(CommandLineActionFactory.java:368)
  239.      [exec]     at org.gradle.launcher.cli.CommandLineActionFactory$WithLogging.execute(CommandLineActionFactory.java:298)
  240.      [exec]     at org.gradle.launcher.Main.doAction(Main.java:36)
  241.      [exec] 3 actionable tasks: 3 executed
  242.      [exec]     at org.gradle.launcher.bootstrap.EntryPoint.run(EntryPoint.java:45)
  243.      [exec]     at org.gradle.launcher.bootstrap.ProcessBootstrap.runNoExit(ProcessBootstrap.java:60)
  244.      [exec]     at org.gradle.launcher.bootstrap.ProcessBootstrap.run(ProcessBootstrap.java:37)
  245.      [exec]     at org.gradle.launcher.GradleMain.main(GradleMain.java:23)
  246.      [exec]     at org.gradle.wrapper.BootstrapMainStarter.start(BootstrapMainStarter.java:31)
  247.      [exec]     at org.gradle.wrapper.WrapperExecutor.execute(WrapperExecutor.java:108)
  248.      [exec]     at org.gradle.wrapper.GradleWrapperMain.main(GradleWrapperMain.java:61)
  249.      [exec] Caused by: org.gradle.api.UncheckedIOException: java.io.IOException: Process '[cmd, /c, ""C:\Users\kresimircoko\Documents\git\ce-7.x\liferay-portal\build\node\node" "C:/Users/kresimircoko/Documents/git/ce-7.x/liferay-portal/modules/yarn-1.13.0.js" "install" "--frozen-lockfile""]' finished with non-zero exit value 1
  250.      [exec]     at org.gradle.internal.UncheckedException.throwAsUncheckedException(UncheckedException.java:57)
  251.      [exec]     at org.gradle.internal.UncheckedException.throwAsUncheckedException(UncheckedException.java:40)
  252.      [exec]     at org.gradle.internal.reflect.JavaMethod.invoke(JavaMethod.java:76)
  253.      [exec]     at org.gradle.api.internal.project.taskfactory.StandardTaskAction.doExecute(StandardTaskAction.java:46)
  254.      [exec]     at org.gradle.api.internal.project.taskfactory.StandardTaskAction.execute(StandardTaskAction.java:39)
  255.      [exec]     at org.gradle.api.internal.project.taskfactory.StandardTaskAction.execute(StandardTaskAction.java:26)
  256.      [exec]     at org.gradle.api.internal.AbstractTask$TaskActionWrapper.execute(AbstractTask.java:801)
  257.      [exec]     at org.gradle.api.internal.AbstractTask$TaskActionWrapper.execute(AbstractTask.java:768)
  258.      [exec]     at org.gradle.api.internal.tasks.execution.ExecuteActionsTaskExecuter$1.run(ExecuteActionsTaskExecuter.java:131)
  259.      [exec]     at org.gradle.internal.operations.DefaultBuildOperationExecutor$RunnableBuildOperationWorker.execute(DefaultBuildOperationExecutor.java:300)
  260.      [exec]     at org.gradle.internal.operations.DefaultBuildOperationExecutor$RunnableBuildOperationWorker.execute(DefaultBuildOperationExecutor.java:292)
  261.      [exec]     at org.gradle.internal.operations.DefaultBuildOperationExecutor.execute(DefaultBuildOperationExecutor.java:174)
  262.      [exec]     at org.gradle.internal.operations.DefaultBuildOperationExecutor.run(DefaultBuildOperationExecutor.java:90)
  263.      [exec]     at org.gradle.internal.operations.DelegatingBuildOperationExecutor.run(DelegatingBuildOperationExecutor.java:31)
  264.      [exec]     at org.gradle.api.internal.tasks.execution.ExecuteActionsTaskExecuter.executeAction(ExecuteActionsTaskExecuter.java:120)
  265.      [exec]     at org.gradle.api.internal.tasks.execution.ExecuteActionsTaskExecuter.executeActions(ExecuteActionsTaskExecuter.java:99)
  266.      [exec]     ... 100 more
  267.      [exec] Caused by: java.io.IOException: Process '[cmd, /c, ""C:\Users\kresimircoko\Documents\git\ce-7.x\liferay-portal\build\node\node" "C:/Users/kresimircoko/Documents/git/ce-7.x/liferay-portal/modules/yarn-1.13.0.js" "install" "--frozen-lockfile""]' finished with non-zero exit value 1
  268.      [exec]     at com.liferay.gradle.plugins.node.internal.NodeExecutor._executeProcessBuilder(NodeExecutor.java:216)
  269.      [exec]     at com.liferay.gradle.plugins.node.internal.NodeExecutor.execute(NodeExecutor.java:89)
  270.      [exec]     at com.liferay.gradle.plugins.node.tasks.ExecuteNodeTask.executeNode(ExecuteNodeTask.java:77)
  271.      [exec]     at com.liferay.gradle.plugins.node.tasks.ExecuteNodeScriptTask.executeNode(ExecuteNodeScriptTask.java:40)
  272.      [exec]     at org.gradle.internal.reflect.JavaMethod.invoke(JavaMethod.java:73)
  273.      [exec]     ... 113 more
  274.      [exec]
  275.      [exec]
  276.      [exec] * Get more help at https://help.gradle.org
  277.      [exec]
  278.      [exec] BUILD FAILED in 2m 54s
  279.      [exec]
  280.  
  281. BUILD FAILED
  282. C:\Users\kresimircoko\Documents\git\ce-7.x\liferay-portal\build.xml:116: The following error occurred while executing this line:
  283. C:\Users\kresimircoko\Documents\git\ce-7.x\liferay-portal\build.xml:245: The following error occurred while executing this line:
  284. C:\Users\kresimircoko\Documents\git\ce-7.x\liferay-portal\build-common.xml:1691: The following error occurred while executing this line:
  285. C:\Users\kresimircoko\Documents\git\ce-7.x\liferay-portal\build-common.xml:903: C:\Users\kresimircoko\Documents\git\ce-7.x\liferay-portal\build-common.xml:905: exec returned: 1
  286.  
  287. Total time: 9 minutes 45 seconds
RAW Paste Data
We use cookies for various purposes including analytics. By continuing to use Pastebin, you agree to our use of cookies as described in the Cookies Policy. OK, I Understand
 
Top