Anwar907

Build Failed

May 8th, 2021
1,520
Never
Not a member of Pastebin yet? Sign Up, it unlocks many cool features!
  1. [  +57 ms] Running Xcode build... (completed in 10.1s)
  2. [   +1 ms] Xcode build done.                                           10.2s
  3. [   +4 ms] executing: [/Users/anwar/Documents/lingotalk/mobile/ios/] xcrun xcodebuild -configuration Debug VERBOSE_SCRIPT_LOGGING=YES -workspace Runner.xcworkspace -scheme
  4. Runner BUILD_DIR=/Users/anwar/Documents/lingotalk/mobile/build/ios -sdk iphonesimulator -arch x86_64
  5. SCRIPT_OUTPUT_STREAM_FILE=/var/folders/c_/f3k7z73s2d9_928_18wyb91h0000gp/T/flutter_tools.akoUwK/flutter_build_log_pipe.HwoKt1/pipe_to_stdout FLUTTER_SUPPRESS_ANALYTICS=true
  6. COMPILER_INDEX_STORE_ENABLE=NO -showBuildSettings
  7. [   +1 ms] executing: [/Users/anwar/Documents/lingotalk/mobile/ios/] xcrun xcodebuild -configuration Debug VERBOSE_SCRIPT_LOGGING=YES -workspace Runner.xcworkspace -scheme
  8. Runner BUILD_DIR=/Users/anwar/Documents/lingotalk/mobile/build/ios -sdk iphonesimulator -arch x86_64
  9. SCRIPT_OUTPUT_STREAM_FILE=/var/folders/c_/f3k7z73s2d9_928_18wyb91h0000gp/T/flutter_tools.akoUwK/flutter_build_log_pipe.HwoKt1/pipe_to_stdout FLUTTER_SUPPRESS_ANALYTICS=true
  10. COMPILER_INDEX_STORE_ENABLE=NO -showBuildSettings
  11. [+5597 ms] Command line invocation:
  12.                         /Applications/Xcode.app/Contents/Developer/usr/bin/xcodebuild -configuration Debug VERBOSE_SCRIPT_LOGGING=YES -workspace Runner.xcworkspace -scheme
  13.                         Runner BUILD_DIR=/Users/anwar/Documents/lingotalk/mobile/build/ios -sdk iphonesimulator -arch x86_64
  14.                         SCRIPT_OUTPUT_STREAM_FILE=/var/folders/c_/f3k7z73s2d9_928_18wyb91h0000gp/T/flutter_tools.akoUwK/flutter_build_log_pipe.HwoKt1/pipe_to_stdout
  15.                         FLUTTER_SUPPRESS_ANALYTICS=true COMPILER_INDEX_STORE_ENABLE=NO -showBuildSettings
  16.  
  17.                     Build settings from command line:
  18.                         ARCHS = x86_64
  19.                         BUILD_DIR = /Users/anwar/Documents/lingotalk/mobile/build/ios
  20.                         COMPILER_INDEX_STORE_ENABLE = NO
  21.                         FLUTTER_SUPPRESS_ANALYTICS = true
  22.                         SCRIPT_OUTPUT_STREAM_FILE = /var/folders/c_/f3k7z73s2d9_928_18wyb91h0000gp/T/flutter_tools.akoUwK/flutter_build_log_pipe.HwoKt1/pipe_to_stdout
  23.                         SDKROOT = iphonesimulator14.4
  24.                         VERBOSE_SCRIPT_LOGGING = YES
  25.  
  26.                     Build settings for action build and target Runner:
  27.                         ACTION = build
  28.                         AD_HOC_CODE_SIGNING_ALLOWED = YES
  29.                         ALTERNATE_GROUP = staff
  30.                         ALTERNATE_MODE = u+w,go-w,a+rX
  31.                         ALTERNATE_OWNER = anwar
  32.                         ALWAYS_EMBED_SWIFT_STANDARD_LIBRARIES = YES
  33.                         ALWAYS_SEARCH_USER_PATHS = NO
  34.                         ALWAYS_USE_SEPARATE_HEADERMAPS = NO
  35.                         APPLE_INTERNAL_DEVELOPER_DIR = /AppleInternal/Developer
  36.                         APPLE_INTERNAL_DIR = /AppleInternal
  37.                         APPLE_INTERNAL_DOCUMENTATION_DIR = /AppleInternal/Documentation
  38.                         APPLE_INTERNAL_LIBRARY_DIR = /AppleInternal/Library
  39.                         APPLE_INTERNAL_TOOLS = /AppleInternal/Developer/Tools
  40.                         APPLICATION_EXTENSION_API_ONLY = NO
  41.                         APPLY_RULES_IN_COPY_FILES = NO
  42.                         APPLY_RULES_IN_COPY_HEADERS = NO
  43.                         ARCHS = x86_64
  44.                         ARCHS_STANDARD = arm64 x86_64
  45.                         ARCHS_STANDARD_32_64_BIT = arm64 i386 x86_64
  46.                         ARCHS_STANDARD_32_BIT = i386
  47.                         ARCHS_STANDARD_64_BIT = arm64 x86_64
  48.                         ARCHS_STANDARD_INCLUDING_64_BIT = arm64 x86_64
  49.                         ARCHS_UNIVERSAL_IPHONE_OS = arm64 i386 x86_64
  50.                         ASSETCATALOG_COMPILER_APPICON_NAME = AppIcon
  51.                         AVAILABLE_PLATFORMS = appletvos appletvsimulator iphoneos iphonesimulator macosx watchos watchsimulator
  52.                         BITCODE_GENERATION_MODE = marker
  53.                         BUILD_ACTIVE_RESOURCES_ONLY = NO
  54.                         BUILD_COMPONENTS = headers build
  55.                         BUILD_DIR = /Users/anwar/Documents/lingotalk/mobile/build/ios
  56.                         BUILD_LIBRARY_FOR_DISTRIBUTION = NO
  57.                         BUILD_ROOT = /Users/anwar/Library/Developer/Xcode/DerivedData/Runner-gxcmiqgnvesnbyfwaqpbecsxyzjk/Build/Products
  58.                         BUILD_STYLE =
  59.                         BUILD_VARIANTS = normal
  60.                         BUILT_PRODUCTS_DIR = /Users/anwar/Documents/lingotalk/mobile/build/ios/Debug-iphonesimulator
  61.                         BUNDLE_CONTENTS_FOLDER_PATH_deep = Contents/
  62.                         BUNDLE_EXECUTABLE_FOLDER_NAME_deep = MacOS
  63.                         BUNDLE_FORMAT = shallow
  64.                         BUNDLE_FRAMEWORKS_FOLDER_PATH = Frameworks
  65.                         BUNDLE_PLUGINS_FOLDER_PATH = PlugIns
  66.                         BUNDLE_PRIVATE_HEADERS_FOLDER_PATH = PrivateHeaders
  67.                         BUNDLE_PUBLIC_HEADERS_FOLDER_PATH = Headers
  68.                         CACHE_ROOT = /var/folders/c_/f3k7z73s2d9_928_18wyb91h0000gp/C/com.apple.DeveloperTools/12.4-12D4e/Xcode
  69.                         CCHROOT = /var/folders/c_/f3k7z73s2d9_928_18wyb91h0000gp/C/com.apple.DeveloperTools/12.4-12D4e/Xcode
  70.                         CHMOD = /bin/chmod
  71.                         CHOWN = /usr/sbin/chown
  72.                         CLANG_ANALYZER_NONNULL = YES
  73.                         CLANG_CXX_LANGUAGE_STANDARD = gnu++0x
  74.                         CLANG_CXX_LIBRARY = libc++
  75.                         CLANG_ENABLE_MODULES = YES
  76.                         CLANG_ENABLE_OBJC_ARC = YES
  77.                         CLANG_WARN_BLOCK_CAPTURE_AUTORELEASING = YES
  78.                         CLANG_WARN_BOOL_CONVERSION = YES
  79.                         CLANG_WARN_COMMA = YES
  80.                         CLANG_WARN_CONSTANT_CONVERSION = YES
  81.                         CLANG_WARN_DEPRECATED_OBJC_IMPLEMENTATIONS = YES
  82.                         CLANG_WARN_DIRECT_OBJC_ISA_USAGE = YES_ERROR
  83.                         CLANG_WARN_EMPTY_BODY = YES
  84.                         CLANG_WARN_ENUM_CONVERSION = YES
  85.                         CLANG_WARN_INFINITE_RECURSION = YES
  86.                         CLANG_WARN_INT_CONVERSION = YES
  87.                         CLANG_WARN_NON_LITERAL_NULL_CONVERSION = YES
  88.                         CLANG_WARN_OBJC_IMPLICIT_RETAIN_SELF = YES
  89.                         CLANG_WARN_OBJC_LITERAL_CONVERSION = YES
  90.                         CLANG_WARN_OBJC_ROOT_CLASS = YES_ERROR
  91.                         CLANG_WARN_QUOTED_INCLUDE_IN_FRAMEWORK_HEADER = NO
  92.                         CLANG_WARN_RANGE_LOOP_ANALYSIS = YES
  93.                         CLANG_WARN_STRICT_PROTOTYPES = YES
  94.                         CLANG_WARN_SUSPICIOUS_MOVE = YES
  95.                         CLANG_WARN_UNREACHABLE_CODE = YES
  96.                         CLANG_WARN__DUPLICATE_METHOD_MATCH = YES
  97.                         CLASS_FILE_DIR =
  98.                         /Users/anwar/Library/Developer/Xcode/DerivedData/Runner-gxcmiqgnvesnbyfwaqpbecsxyzjk/Build/Intermediates.noindex/Runner.build/Debug-iphonesimulator/Ru
  99.                         nner.build/JavaClasses
  100.                         CLEAN_PRECOMPS = YES
  101.                         CLONE_HEADERS = NO
  102.                         CODESIGNING_FOLDER_PATH = /Users/anwar/Documents/lingotalk/mobile/build/ios/Debug-iphonesimulator/Runner.app
  103.                         CODE_SIGNING_ALLOWED = YES
  104.                         CODE_SIGNING_REQUIRED = YES
  105.                         CODE_SIGN_CONTEXT_CLASS = XCiPhoneSimulatorCodeSignContext
  106.                         CODE_SIGN_IDENTITY = -
  107.                         CODE_SIGN_INJECT_BASE_ENTITLEMENTS = YES
  108.                         COLOR_DIAGNOSTICS = NO
  109.                         COMBINE_HIDPI_IMAGES = NO
  110.                         COMPILER_INDEX_STORE_ENABLE = NO
  111.                         COMPOSITE_SDK_DIRS = /Users/anwar/Library/Developer/Xcode/DerivedData/Runner-gxcmiqgnvesnbyfwaqpbecsxyzjk/Build/Intermediates.noindex/CompositeSDKs
  112.                         COMPRESS_PNG_FILES = YES
  113.                         CONFIGURATION = Debug
  114.                         CONFIGURATION_BUILD_DIR = /Users/anwar/Documents/lingotalk/mobile/build/ios/Debug-iphonesimulator
  115.                         CONFIGURATION_TEMP_DIR =
  116.                         /Users/anwar/Library/Developer/Xcode/DerivedData/Runner-gxcmiqgnvesnbyfwaqpbecsxyzjk/Build/Intermediates.noindex/Runner.build/Debug-iphonesimulator
  117.                         CONTENTS_FOLDER_PATH = Runner.app
  118.                         COPYING_PRESERVES_HFS_DATA = NO
  119.                         COPY_HEADERS_RUN_UNIFDEF = NO
  120.                         COPY_PHASE_STRIP = NO
  121.                         COPY_RESOURCES_FROM_STATIC_FRAMEWORKS = YES
  122.                         CORRESPONDING_DEVICE_PLATFORM_DIR = /Applications/Xcode.app/Contents/Developer/Platforms/iPhoneOS.platform
  123.                         CORRESPONDING_DEVICE_PLATFORM_NAME = iphoneos
  124.                         CORRESPONDING_DEVICE_SDK_DIR = /Applications/Xcode.app/Contents/Developer/Platforms/iPhoneOS.platform/Developer/SDKs/iPhoneOS14.4.sdk
  125.                         CORRESPONDING_DEVICE_SDK_NAME = iphoneos14.4
  126.                         CP = /bin/cp
  127.                         CREATE_INFOPLIST_SECTION_IN_BINARY = NO
  128.                         CURRENT_ARCH = x86_64
  129.                         CURRENT_PROJECT_VERSION = 1
  130.                         CURRENT_VARIANT = normal
  131.                         DART_OBFUSCATION = false
  132.                         DEAD_CODE_STRIPPING = YES
  133.                         DEBUGGING_SYMBOLS = YES
  134.                         DEBUG_INFORMATION_FORMAT = dwarf
  135.                         DEFAULT_COMPILER = com.apple.compilers.llvm.clang.1_0
  136.                         DEFAULT_DEXT_INSTALL_PATH = /System/Library/DriverExtensions
  137.                         DEFAULT_KEXT_INSTALL_PATH = /System/Library/Extensions
  138.                         DEFINES_MODULE = NO
  139.                         DEPLOYMENT_LOCATION = NO
  140.                         DEPLOYMENT_POSTPROCESSING = NO
  141.                         DEPLOYMENT_TARGET_CLANG_ENV_NAME = IPHONEOS_DEPLOYMENT_TARGET
  142.                         DEPLOYMENT_TARGET_CLANG_FLAG_NAME = mios-simulator-version-min
  143.                         DEPLOYMENT_TARGET_CLANG_FLAG_PREFIX = -mios-simulator-version-min=
  144.                         DEPLOYMENT_TARGET_LD_ENV_NAME = IPHONEOS_DEPLOYMENT_TARGET
  145.                         DEPLOYMENT_TARGET_LD_FLAG_NAME = ios_simulator_version_min
  146.                         DEPLOYMENT_TARGET_SETTING_NAME = IPHONEOS_DEPLOYMENT_TARGET
  147.                         DEPLOYMENT_TARGET_SUGGESTED_VALUES = 9.0 9.2 10.0 10.2 11.0 11.2 11.4 12.1 12.3 13.0 13.2 13.4 13.6 14.1 14.3 14.4
  148.                         DERIVED_FILES_DIR =
  149.                         /Users/anwar/Library/Developer/Xcode/DerivedData/Runner-gxcmiqgnvesnbyfwaqpbecsxyzjk/Build/Intermediates.noindex/Runner.build/Debug-iphonesimulator/Ru
  150.                         nner.build/DerivedSources
  151.                         DERIVED_FILE_DIR =
  152.                         /Users/anwar/Library/Developer/Xcode/DerivedData/Runner-gxcmiqgnvesnbyfwaqpbecsxyzjk/Build/Intermediates.noindex/Runner.build/Debug-iphonesimulator/Ru
  153.                         nner.build/DerivedSources
  154.                         DERIVED_SOURCES_DIR =
  155.                         /Users/anwar/Library/Developer/Xcode/DerivedData/Runner-gxcmiqgnvesnbyfwaqpbecsxyzjk/Build/Intermediates.noindex/Runner.build/Debug-iphonesimulator/Ru
  156.                         nner.build/DerivedSources
  157.                         DEVELOPER_APPLICATIONS_DIR = /Applications/Xcode.app/Contents/Developer/Applications
  158.                         DEVELOPER_BIN_DIR = /Applications/Xcode.app/Contents/Developer/usr/bin
  159.                         DEVELOPER_DIR = /Applications/Xcode.app/Contents/Developer
  160.                         DEVELOPER_FRAMEWORKS_DIR = /Applications/Xcode.app/Contents/Developer/Library/Frameworks
  161.                         DEVELOPER_FRAMEWORKS_DIR_QUOTED = /Applications/Xcode.app/Contents/Developer/Library/Frameworks
  162.                         DEVELOPER_LIBRARY_DIR = /Applications/Xcode.app/Contents/Developer/Library
  163.                         DEVELOPER_SDK_DIR = /Applications/Xcode.app/Contents/Developer/Platforms/MacOSX.platform/Developer/SDKs
  164.                         DEVELOPER_TOOLS_DIR = /Applications/Xcode.app/Contents/Developer/Tools
  165.                         DEVELOPER_USR_DIR = /Applications/Xcode.app/Contents/Developer/usr
  166.                         DEVELOPMENT_LANGUAGE = en
  167.                         DEVELOPMENT_TEAM = U64G259282
  168.                         DOCUMENTATION_FOLDER_PATH = Runner.app/en.lproj/Documentation
  169.                         DONT_GENERATE_INFOPLIST_FILE = NO
  170.                         DO_HEADER_SCANNING_IN_JAM = NO
  171.                         DSTROOT = /tmp/Runner.dst
  172.                         DT_TOOLCHAIN_DIR = /Applications/Xcode.app/Contents/Developer/Toolchains/XcodeDefault.xctoolchain
  173.                         DWARF_DSYM_FILE_NAME = Runner.app.dSYM
  174.                         DWARF_DSYM_FILE_SHOULD_ACCOMPANY_PRODUCT = NO
  175.                         DWARF_DSYM_FOLDER_PATH = /Users/anwar/Documents/lingotalk/mobile/build/ios/Debug-iphonesimulator
  176.                         EFFECTIVE_PLATFORM_NAME = -iphonesimulator
  177.                         EMBEDDED_CONTENT_CONTAINS_SWIFT = NO
  178.                         EMBED_ASSET_PACKS_IN_PRODUCT_BUNDLE = NO
  179.                         ENABLE_BITCODE = NO
  180.                         ENABLE_DEFAULT_HEADER_SEARCH_PATHS = YES
  181.                         ENABLE_HARDENED_RUNTIME = NO
  182.                         ENABLE_HEADER_DEPENDENCIES = YES
  183.                         ENABLE_ON_DEMAND_RESOURCES = YES
  184.                         ENABLE_STRICT_OBJC_MSGSEND = YES
  185.                         ENABLE_TESTABILITY = YES
  186.                         ENABLE_TESTING_SEARCH_PATHS = NO
  187.                         ENTITLEMENTS_DESTINATION = __entitlements
  188.                         ENTITLEMENTS_REQUIRED = YES
  189.                         EXCLUDED_ARCHS = arm64
  190.                         EXCLUDED_INSTALLSRC_SUBDIRECTORY_PATTERNS = .DS_Store .svn .git .hg CVS
  191.                         EXCLUDED_RECURSIVE_SEARCH_PATH_SUBDIRECTORIES = *.nib *.lproj *.framework *.gch *.xcode* *.xcassets (*) .DS_Store CVS .svn .git .hg *.pbproj *.pbxproj
  192.                         EXECUTABLES_FOLDER_PATH = Runner.app/Executables
  193.                         EXECUTABLE_FOLDER_PATH = Runner.app
  194.                         EXECUTABLE_NAME = Runner
  195.                         EXECUTABLE_PATH = Runner.app/Runner
  196.                         EXPANDED_CODE_SIGN_IDENTITY =
  197.                         EXPANDED_CODE_SIGN_IDENTITY_NAME =
  198.                         EXPANDED_PROVISIONING_PROFILE =
  199.                         FILE_LIST =
  200.                         /Users/anwar/Library/Developer/Xcode/DerivedData/Runner-gxcmiqgnvesnbyfwaqpbecsxyzjk/Build/Intermediates.noindex/Runner.build/Debug-iphonesimulator/Ru
  201.                         nner.build/Objects/LinkFileList
  202.                         FIXED_FILES_DIR =
  203.                         /Users/anwar/Library/Developer/Xcode/DerivedData/Runner-gxcmiqgnvesnbyfwaqpbecsxyzjk/Build/Intermediates.noindex/Runner.build/Debug-iphonesimulator/Ru
  204.                         nner.build/FixedFiles
  205.                         FLUTTER_APPLICATION_PATH = /Users/anwar/Documents/lingotalk/mobile
  206.                         FLUTTER_BUILD_DIR = build
  207.                         FLUTTER_BUILD_NAME = 1.0.0
  208.                         FLUTTER_BUILD_NUMBER = 1
  209.                         FLUTTER_ROOT = /Users/anwar/flutter
  210.                         FLUTTER_SUPPRESS_ANALYTICS = true
  211.                         FLUTTER_TARGET = /Users/anwar/Documents/lingotalk/mobile/lib/main.dart
  212.                         FRAMEWORKS_FOLDER_PATH = Runner.app/Frameworks
  213.                         FRAMEWORK_FLAG_PREFIX = -framework
  214.                         FRAMEWORK_SEARCH_PATHS =  "/Users/anwar/Documents/lingotalk/mobile/build/ios/Debug-iphonesimulator/Reachability"
  215.                         "/Users/anwar/Documents/lingotalk/mobile/build/ios/Debug-iphonesimulator/Toast"
  216.                         "/Users/anwar/Documents/lingotalk/mobile/build/ios/Debug-iphonesimulator/connectivity"
  217.                         "/Users/anwar/Documents/lingotalk/mobile/build/ios/Debug-iphonesimulator/fluttertoast"
  218.                         "/Users/anwar/Documents/lingotalk/mobile/build/ios/Debug-iphonesimulator/image_picker"
  219.                         "/Users/anwar/Documents/lingotalk/mobile/build/ios/Debug-iphonesimulator/jitsi_meet"
  220.                         "/Users/anwar/Documents/lingotalk/mobile/build/ios/Debug-iphonesimulator/libPhoneNumber-iOS"
  221.                         "/Users/anwar/Documents/lingotalk/mobile/build/ios/Debug-iphonesimulator/libphonenumber"
  222.                         "/Users/anwar/Documents/lingotalk/mobile/build/ios/Debug-iphonesimulator/libphonenumber_plugin"
  223.                         "/Users/anwar/Documents/lingotalk/mobile/build/ios/Debug-iphonesimulator/path_provider"
  224.                         "/Users/anwar/Documents/lingotalk/mobile/build/ios/Debug-iphonesimulator/shared_preferences"
  225.                         "/Users/anwar/Documents/lingotalk/mobile/build/ios/Debug-iphonesimulator/url_launcher"
  226.                         "/Users/anwar/Documents/lingotalk/mobile/build/ios/Debug-iphonesimulator/webview_flutter"
  227.                         "/Users/anwar/Documents/lingotalk/mobile/ios/Pods/JitsiMeetSDK/Frameworks"
  228.                         "/Users/anwar/Documents/lingotalk/mobile/build/ios/Debug-iphonesimulator/XCFrameworkIntermediates/JitsiMeetSDK"
  229.                         "/Users/anwar/Documents/lingotalk/mobile/build/ios/Debug-iphonesimulator/XCFrameworkIntermediates/WebRTC"
  230.                         /Users/anwar/Documents/lingotalk/mobile/ios/Flutter
  231.                         FRAMEWORK_VERSION = A
  232.                         FULL_PRODUCT_NAME = Runner.app
  233.                         GCC3_VERSION = 3.3
  234.                         GCC_C_LANGUAGE_STANDARD = gnu99
  235.                         GCC_DYNAMIC_NO_PIC = NO
  236.                         GCC_INLINES_ARE_PRIVATE_EXTERN = YES
  237.                         GCC_NO_COMMON_BLOCKS = YES
  238.                         GCC_OBJC_LEGACY_DISPATCH = YES
  239.                         GCC_OPTIMIZATION_LEVEL = 0
  240.                         GCC_PFE_FILE_C_DIALECTS = c objective-c c++ objective-c++
  241.                         GCC_PREPROCESSOR_DEFINITIONS = DEBUG=1  COCOAPODS=1
  242.                         GCC_SYMBOLS_PRIVATE_EXTERN = NO
  243.                         GCC_TREAT_WARNINGS_AS_ERRORS = NO
  244.                         GCC_VERSION = com.apple.compilers.llvm.clang.1_0
  245.                         GCC_VERSION_IDENTIFIER = com_apple_compilers_llvm_clang_1_0
  246.                         GCC_WARN_64_TO_32_BIT_CONVERSION = YES
  247.                         GCC_WARN_ABOUT_RETURN_TYPE = YES_ERROR
  248.                         GCC_WARN_UNDECLARED_SELECTOR = YES
  249.                         GCC_WARN_UNINITIALIZED_AUTOS = YES_AGGRESSIVE
  250.                         GCC_WARN_UNUSED_FUNCTION = YES
  251.                         GCC_WARN_UNUSED_VARIABLE = YES
  252.                         GENERATED_MODULEMAP_DIR =
  253.                         /Users/anwar/Library/Developer/Xcode/DerivedData/Runner-gxcmiqgnvesnbyfwaqpbecsxyzjk/Build/Intermediates.noindex/GeneratedModuleMaps-iphonesimulator
  254.                         GENERATE_MASTER_OBJECT_FILE = NO
  255.                         GENERATE_PKGINFO_FILE = YES
  256.                         GENERATE_PROFILING_CODE = NO
  257.                         GENERATE_TEXT_BASED_STUBS = NO
  258.                         GID = 20
  259.                         GROUP = staff
  260.                         HEADERMAP_INCLUDES_FLAT_ENTRIES_FOR_TARGET_BEING_BUILT = YES
  261.                         HEADERMAP_INCLUDES_FRAMEWORK_ENTRIES_FOR_ALL_PRODUCT_TYPES = YES
  262.                         HEADERMAP_INCLUDES_NONPUBLIC_NONPRIVATE_HEADERS = YES
  263.                         HEADERMAP_INCLUDES_PROJECT_HEADERS = YES
  264.                         HEADERMAP_USES_FRAMEWORK_PREFIX_ENTRIES = YES
  265.                         HEADERMAP_USES_VFS = NO
  266.                         HEADER_SEARCH_PATHS =  "/Users/anwar/Documents/lingotalk/mobile/build/ios/Debug-iphonesimulator/Reachability/Reachability.framework/Headers"
  267.                         "/Users/anwar/Documents/lingotalk/mobile/build/ios/Debug-iphonesimulator/Toast/Toast.framework/Headers"
  268.                         "/Users/anwar/Documents/lingotalk/mobile/build/ios/Debug-iphonesimulator/connectivity/connectivity.framework/Headers"
  269.                         "/Users/anwar/Documents/lingotalk/mobile/build/ios/Debug-iphonesimulator/fluttertoast/fluttertoast.framework/Headers"
  270.                         "/Users/anwar/Documents/lingotalk/mobile/build/ios/Debug-iphonesimulator/image_picker/image_picker.framework/Headers"
  271.                         "/Users/anwar/Documents/lingotalk/mobile/build/ios/Debug-iphonesimulator/jitsi_meet/jitsi_meet.framework/Headers"
  272.                         "/Users/anwar/Documents/lingotalk/mobile/build/ios/Debug-iphonesimulator/libPhoneNumber-iOS/libPhoneNumber_iOS.framework/Headers"
  273.                         "/Users/anwar/Documents/lingotalk/mobile/build/ios/Debug-iphonesimulator/libphonenumber/libphonenumber.framework/Headers"
  274.                         "/Users/anwar/Documents/lingotalk/mobile/build/ios/Debug-iphonesimulator/libphonenumber_plugin/libphonenumber_plugin.framework/Headers"
  275.                         "/Users/anwar/Documents/lingotalk/mobile/build/ios/Debug-iphonesimulator/path_provider/path_provider.framework/Headers"
  276.                         "/Users/anwar/Documents/lingotalk/mobile/build/ios/Debug-iphonesimulator/shared_preferences/shared_preferences.framework/Headers"
  277.                         "/Users/anwar/Documents/lingotalk/mobile/build/ios/Debug-iphonesimulator/url_launcher/url_launcher.framework/Headers"
  278.                         "/Users/anwar/Documents/lingotalk/mobile/build/ios/Debug-iphonesimulator/webview_flutter/webview_flutter.framework/Headers"
  279.                         HIDE_BITCODE_SYMBOLS = YES
  280.                         HOME = /Users/anwar
  281.                         ICONV = /usr/bin/iconv
  282.                         INFOPLIST_EXPAND_BUILD_SETTINGS = YES
  283.                         INFOPLIST_FILE = Runner/Info.plist
  284.                         INFOPLIST_OUTPUT_FORMAT = binary
  285.                         INFOPLIST_PATH = Runner.app/Info.plist
  286.                         INFOPLIST_PREPROCESS = NO
  287.                         INFOSTRINGS_PATH = Runner.app/en.lproj/InfoPlist.strings
  288.                         INLINE_PRIVATE_FRAMEWORKS = NO
  289.                         INSTALLHDRS_COPY_PHASE = NO
  290.                         INSTALLHDRS_SCRIPT_PHASE = NO
  291.                         INSTALL_DIR = /tmp/Runner.dst/Applications
  292.                         INSTALL_GROUP = staff
  293.                         INSTALL_MODE_FLAG = u+w,go-w,a+rX
  294.                         INSTALL_OWNER = anwar
  295.                         INSTALL_PATH = /Applications
  296.                         INSTALL_ROOT = /tmp/Runner.dst
  297.                         IPHONEOS_DEPLOYMENT_TARGET = 11.0
  298.                         JAVAC_DEFAULT_FLAGS = -J-Xms64m -J-XX:NewSize=4M -J-Dfile.encoding=UTF8
  299.                         JAVA_APP_STUB = /System/Library/Frameworks/JavaVM.framework/Resources/MacOS/JavaApplicationStub
  300.                         JAVA_ARCHIVE_CLASSES = YES
  301.                         JAVA_ARCHIVE_TYPE = JAR
  302.                         JAVA_COMPILER = /usr/bin/javac
  303.                         JAVA_FOLDER_PATH = Runner.app/Java
  304.                         JAVA_FRAMEWORK_RESOURCES_DIRS = Resources
  305.                         JAVA_JAR_FLAGS = cv
  306.                         JAVA_SOURCE_SUBDIR = .
  307.                         JAVA_USE_DEPENDENCIES = YES
  308.                         JAVA_ZIP_FLAGS = -urg
  309.                         JIKES_DEFAULT_FLAGS = +E +OLDCSO
  310.                         KEEP_PRIVATE_EXTERNS = NO
  311.                         LD_DEPENDENCY_INFO_FILE =
  312.                         /Users/anwar/Library/Developer/Xcode/DerivedData/Runner-gxcmiqgnvesnbyfwaqpbecsxyzjk/Build/Intermediates.noindex/Runner.build/Debug-iphonesimulator/Ru
  313.                         nner.build/Objects-normal/x86_64/Runner_dependency_info.dat
  314.                         LD_GENERATE_MAP_FILE = NO
  315.                         LD_MAP_FILE_PATH =
  316.                         /Users/anwar/Library/Developer/Xcode/DerivedData/Runner-gxcmiqgnvesnbyfwaqpbecsxyzjk/Build/Intermediates.noindex/Runner.build/Debug-iphonesimulator/Ru
  317.                         nner.build/Runner-LinkMap-normal-x86_64.txt
  318.                         LD_NO_PIE = NO
  319.                         LD_QUOTE_LINKER_ARGUMENTS_FOR_COMPILER_DRIVER = YES
  320.                         LD_RUNPATH_SEARCH_PATHS =  '@executable_path/Frameworks' '@loader_path/Frameworks' @executable_path/Frameworks
  321.                         LEGACY_DEVELOPER_DIR = /Applications/Xcode.app/Contents/PlugIns/Xcode3Core.ideplugin/Contents/SharedSupport/Developer
  322.                         LEX = lex
  323.                         LIBRARY_DEXT_INSTALL_PATH = /Library/DriverExtensions
  324.                         LIBRARY_FLAG_NOSPACE = YES
  325.                         LIBRARY_FLAG_PREFIX = -l
  326.                         LIBRARY_KEXT_INSTALL_PATH = /Library/Extensions
  327.                         LIBRARY_SEARCH_PATHS =  /Users/anwar/Documents/lingotalk/mobile/ios/Flutter
  328.                         LINKER_DISPLAYS_MANGLED_NAMES = NO
  329.                         LINK_FILE_LIST_normal_x86_64 =
  330.                         LINK_WITH_STANDARD_LIBRARIES = YES
  331.                         LLVM_TARGET_TRIPLE_OS_VERSION = ios11.0
  332.                         LLVM_TARGET_TRIPLE_SUFFIX = -simulator
  333.                         LLVM_TARGET_TRIPLE_VENDOR = apple
  334.                         LOCALIZABLE_CONTENT_DIR =
  335.                         LOCALIZED_RESOURCES_FOLDER_PATH = Runner.app/en.lproj
  336.                         LOCALIZED_STRING_MACRO_NAMES = NSLocalizedString CFCopyLocalizedString
  337.                         LOCALIZED_STRING_SWIFTUI_SUPPORT = YES
  338.                         LOCAL_ADMIN_APPS_DIR = /Applications/Utilities
  339.                         LOCAL_APPS_DIR = /Applications
  340.                         LOCAL_DEVELOPER_DIR = /Library/Developer
  341.                         LOCAL_LIBRARY_DIR = /Library
  342.                         LOCROOT =
  343.                         LOCSYMROOT =
  344.                         MACH_O_TYPE = mh_execute
  345.                         MAC_OS_X_PRODUCT_BUILD_VERSION = 20D91
  346.                         MAC_OS_X_VERSION_ACTUAL = 110203
  347.                         MAC_OS_X_VERSION_MAJOR = 110000
  348.                         MAC_OS_X_VERSION_MINOR = 110200
  349.                         METAL_LIBRARY_FILE_BASE = default
  350.                         METAL_LIBRARY_OUTPUT_DIR = /Users/anwar/Documents/lingotalk/mobile/build/ios/Debug-iphonesimulator/Runner.app
  351.                         MODULES_FOLDER_PATH = Runner.app/Modules
  352.                         MODULE_CACHE_DIR = /Users/anwar/Library/Developer/Xcode/DerivedData/ModuleCache.noindex
  353.                         MTL_ENABLE_DEBUG_INFO = YES
  354.                         NATIVE_ARCH = x86_64
  355.                         NATIVE_ARCH_32_BIT = i386
  356.                         NATIVE_ARCH_64_BIT = x86_64
  357.                         NATIVE_ARCH_ACTUAL = x86_64
  358.                         NO_COMMON = YES
  359.                         OBJC_ABI_VERSION = 2
  360.                         OBJECT_FILE_DIR =
  361.                         /Users/anwar/Library/Developer/Xcode/DerivedData/Runner-gxcmiqgnvesnbyfwaqpbecsxyzjk/Build/Intermediates.noindex/Runner.build/Debug-iphonesimulator/Ru
  362.                         nner.build/Objects
  363.                         OBJECT_FILE_DIR_normal =
  364.                         /Users/anwar/Library/Developer/Xcode/DerivedData/Runner-gxcmiqgnvesnbyfwaqpbecsxyzjk/Build/Intermediates.noindex/Runner.build/Debug-iphonesimulator/Ru
  365.                         nner.build/Objects-normal
  366.                         OBJROOT = /Users/anwar/Library/Developer/Xcode/DerivedData/Runner-gxcmiqgnvesnbyfwaqpbecsxyzjk/Build/Intermediates.noindex
  367.                         ONLY_ACTIVE_ARCH = YES
  368.                         OS = MACOS
  369.                         OSAC = /usr/bin/osacompile
  370.                         OTHER_LDFLAGS =  -l"z" -framework "CoreTelephony" -framework "JitsiMeetSDK" -framework "QuartzCore" -framework "Reachability" -framework
  371.                         "SystemConfiguration" -framework "Toast" -framework "WebRTC" -framework "connectivity" -framework "fluttertoast" -framework "image_picker" -framework
  372.                         "jitsi_meet" -framework "libPhoneNumber_iOS" -framework "libphonenumber" -framework "libphonenumber_plugin" -framework "path_provider" -framework
  373.                         "shared_preferences" -framework "url_launcher" -framework "webview_flutter"
  374.                         OTHER_SWIFT_FLAGS =  -D COCOAPODS
  375.                         PACKAGE_CONFIG = /Users/anwar/Documents/lingotalk/mobile/.dart_tool/package_config.json
  376.                         PACKAGE_TYPE = com.apple.package-type.wrapper.application
  377.                         PASCAL_STRINGS = YES
  378.                         PATH =
  379.                         /Applications/Xcode.app/Contents/Developer/usr/bin:/usr/local/opt/openjdk/bin:/Users/anwar/Library/Android/ndk-build:/Users/anwar/Library/Android/Sdk/
  380.                         tools:/Users/anwar/Library/Android/Sdk/platform-tools:/Users/anwar/Library/Android/Sdk:/Users/anwar/flutter/bin:/usr/local/bin:/usr/bin:/bin:/usr/sbin
  381.                         :/sbin:/usr/local/share/android-sdk/tools/bin:export ANDROID_HOME=/home/{user}/Android/Sdk:/Library/Apple/usr/bin:/Users/anwar/aplikasi/Visual Studio
  382.                         Code.app/Contents/Resources/app/bin
  383.                         PATH_PREFIXES_EXCLUDED_FROM_HEADER_DEPENDENCIES = /usr/include /usr/local/include /System/Library/Frameworks /System/Library/PrivateFrameworks
  384.                         /Applications/Xcode.app/Contents/Developer/Headers /Applications/Xcode.app/Contents/Developer/SDKs
  385.                         /Applications/Xcode.app/Contents/Developer/Platforms
  386.                         PBDEVELOPMENTPLIST_PATH = Runner.app/pbdevelopment.plist
  387.                         PFE_FILE_C_DIALECTS = objective-c
  388.                         PKGINFO_FILE_PATH =
  389.                         /Users/anwar/Library/Developer/Xcode/DerivedData/Runner-gxcmiqgnvesnbyfwaqpbecsxyzjk/Build/Intermediates.noindex/Runner.build/Debug-iphonesimulator/Ru
  390.                         nner.build/PkgInfo
  391.                         PKGINFO_PATH = Runner.app/PkgInfo
  392.                         PLATFORM_DEVELOPER_APPLICATIONS_DIR = /Applications/Xcode.app/Contents/Developer/Platforms/iPhoneSimulator.platform/Developer/Applications
  393.                         PLATFORM_DEVELOPER_BIN_DIR = /Applications/Xcode.app/Contents/Developer/Platforms/iPhoneSimulator.platform/Developer/usr/bin
  394.                         PLATFORM_DEVELOPER_LIBRARY_DIR = /Applications/Xcode.app/Contents/PlugIns/Xcode3Core.ideplugin/Contents/SharedSupport/Developer/Library
  395.                         PLATFORM_DEVELOPER_SDK_DIR = /Applications/Xcode.app/Contents/Developer/Platforms/iPhoneSimulator.platform/Developer/SDKs
  396.                         PLATFORM_DEVELOPER_TOOLS_DIR = /Applications/Xcode.app/Contents/Developer/Platforms/iPhoneSimulator.platform/Developer/Tools
  397.                         PLATFORM_DEVELOPER_USR_DIR = /Applications/Xcode.app/Contents/Developer/Platforms/iPhoneSimulator.platform/Developer/usr
  398.                         PLATFORM_DIR = /Applications/Xcode.app/Contents/Developer/Platforms/iPhoneSimulator.platform
  399.                         PLATFORM_DISPLAY_NAME = iOS Simulator
  400.                         PLATFORM_NAME = iphonesimulator
  401.                         PLATFORM_PREFERRED_ARCH = x86_64
  402.                         PLATFORM_PRODUCT_BUILD_VERSION = 18D46
  403.                         PLIST_FILE_OUTPUT_FORMAT = binary
  404.                         PLUGINS_FOLDER_PATH = Runner.app/PlugIns
  405.                         PODS_BUILD_DIR = /Users/anwar/Documents/lingotalk/mobile/build/ios
  406.                         PODS_CONFIGURATION_BUILD_DIR = /Users/anwar/Documents/lingotalk/mobile/build/ios/Debug-iphonesimulator
  407.                         PODS_PODFILE_DIR_PATH = /Users/anwar/Documents/lingotalk/mobile/ios/.
  408.                         PODS_ROOT = /Users/anwar/Documents/lingotalk/mobile/ios/Pods
  409.                         PODS_XCFRAMEWORKS_BUILD_DIR = /Users/anwar/Documents/lingotalk/mobile/build/ios/Debug-iphonesimulator/XCFrameworkIntermediates
  410.                         PRECOMPS_INCLUDE_HEADERS_FROM_BUILT_PRODUCTS_DIR = YES
  411.                         PRECOMP_DESTINATION_DIR =
  412.                         /Users/anwar/Library/Developer/Xcode/DerivedData/Runner-gxcmiqgnvesnbyfwaqpbecsxyzjk/Build/Intermediates.noindex/Runner.build/Debug-iphonesimulator/Ru
  413.                         nner.build/PrefixHeaders
  414.                         PRESERVE_DEAD_CODE_INITS_AND_TERMS = NO
  415.                         PRIVATE_HEADERS_FOLDER_PATH = Runner.app/PrivateHeaders
  416.                         PRODUCT_BUNDLE_IDENTIFIER = co.lingotalk
  417.                         PRODUCT_BUNDLE_PACKAGE_TYPE = APPL
  418.                         PRODUCT_MODULE_NAME = Runner
  419.                         PRODUCT_NAME = Runner
  420.                         PRODUCT_SETTINGS_PATH = /Users/anwar/Documents/lingotalk/mobile/ios/Runner/Info.plist
  421.                         PRODUCT_TYPE = com.apple.product-type.application
  422.                         PROFILING_CODE = NO
  423.                         PROJECT = Runner
  424.                         PROJECT_DERIVED_FILE_DIR =
  425.                         /Users/anwar/Library/Developer/Xcode/DerivedData/Runner-gxcmiqgnvesnbyfwaqpbecsxyzjk/Build/Intermediates.noindex/Runner.build/DerivedSources
  426.                         PROJECT_DIR = /Users/anwar/Documents/lingotalk/mobile/ios
  427.                         PROJECT_FILE_PATH = /Users/anwar/Documents/lingotalk/mobile/ios/Runner.xcodeproj
  428.                         PROJECT_NAME = Runner
  429.                         PROJECT_TEMP_DIR = /Users/anwar/Library/Developer/Xcode/DerivedData/Runner-gxcmiqgnvesnbyfwaqpbecsxyzjk/Build/Intermediates.noindex/Runner.build
  430.                         PROJECT_TEMP_ROOT = /Users/anwar/Library/Developer/Xcode/DerivedData/Runner-gxcmiqgnvesnbyfwaqpbecsxyzjk/Build/Intermediates.noindex
  431.                         PUBLIC_HEADERS_FOLDER_PATH = Runner.app/Headers
  432.                         RECURSIVE_SEARCH_PATHS_FOLLOW_SYMLINKS = YES
  433.                         REMOVE_CVS_FROM_RESOURCES = YES
  434.                         REMOVE_GIT_FROM_RESOURCES = YES
  435.                         REMOVE_HEADERS_FROM_EMBEDDED_BUNDLES = YES
  436.                         REMOVE_HG_FROM_RESOURCES = YES
  437.                         REMOVE_SVN_FROM_RESOURCES = YES
  438.                         REZ_COLLECTOR_DIR =
  439.                         /Users/anwar/Library/Developer/Xcode/DerivedData/Runner-gxcmiqgnvesnbyfwaqpbecsxyzjk/Build/Intermediates.noindex/Runner.build/Debug-iphonesimulator/Ru
  440.                         nner.build/ResourceManagerResources
  441.                         REZ_OBJECTS_DIR =
  442.                         /Users/anwar/Library/Developer/Xcode/DerivedData/Runner-gxcmiqgnvesnbyfwaqpbecsxyzjk/Build/Intermediates.noindex/Runner.build/Debug-iphonesimulator/Ru
  443.                         nner.build/ResourceManagerResources/Objects
  444.                         SCAN_ALL_SOURCE_FILES_FOR_INCLUDES = NO
  445.                         SCRIPTS_FOLDER_PATH = Runner.app/Scripts
  446.                         SCRIPT_OUTPUT_STREAM_FILE = /var/folders/c_/f3k7z73s2d9_928_18wyb91h0000gp/T/flutter_tools.akoUwK/flutter_build_log_pipe.HwoKt1/pipe_to_stdout
  447.                         SDKROOT = /Applications/Xcode.app/Contents/Developer/Platforms/iPhoneSimulator.platform/Developer/SDKs/iPhoneSimulator14.4.sdk
  448.                         SDK_DIR = /Applications/Xcode.app/Contents/Developer/Platforms/iPhoneSimulator.platform/Developer/SDKs/iPhoneSimulator14.4.sdk
  449.                         SDK_DIR_iphonesimulator14_4 = /Applications/Xcode.app/Contents/Developer/Platforms/iPhoneSimulator.platform/Developer/SDKs/iPhoneSimulator14.4.sdk
  450.                         SDK_NAME = iphonesimulator14.4
  451.                         SDK_NAMES = iphonesimulator14.4
  452.                         SDK_PRODUCT_BUILD_VERSION = 18D46
  453.                         SDK_VERSION = 14.4
  454.                         SDK_VERSION_ACTUAL = 140400
  455.                         SDK_VERSION_MAJOR = 140000
  456.                         SDK_VERSION_MINOR = 140400
  457.                         SED = /usr/bin/sed
  458.                         SEPARATE_STRIP = NO
  459.                         SEPARATE_SYMBOL_EDIT = NO
  460.                         SET_DIR_MODE_OWNER_GROUP = YES
  461.                         SET_FILE_MODE_OWNER_GROUP = NO
  462.                         SHALLOW_BUNDLE = YES
  463.                         SHARED_DERIVED_FILE_DIR = /Users/anwar/Documents/lingotalk/mobile/build/ios/Debug-iphonesimulator/DerivedSources
  464.                         SHARED_FRAMEWORKS_FOLDER_PATH = Runner.app/SharedFrameworks
  465.                         SHARED_PRECOMPS_DIR =
  466.                         /Users/anwar/Library/Developer/Xcode/DerivedData/Runner-gxcmiqgnvesnbyfwaqpbecsxyzjk/Build/Intermediates.noindex/PrecompiledHeaders
  467.                         SHARED_SUPPORT_FOLDER_PATH = Runner.app/SharedSupport
  468.                         SKIP_INSTALL = NO
  469.                         SOURCE_ROOT = /Users/anwar/Documents/lingotalk/mobile/ios
  470.                         SRCROOT = /Users/anwar/Documents/lingotalk/mobile/ios
  471.                         STRINGS_FILE_OUTPUT_ENCODING = binary
  472.                         STRIP_BITCODE_FROM_COPIED_FILES = NO
  473.                         STRIP_INSTALLED_PRODUCT = YES
  474.                         STRIP_STYLE = all
  475.                         STRIP_SWIFT_SYMBOLS = YES
  476.                         SUPPORTED_DEVICE_FAMILIES = 1,2
  477.                         SUPPORTED_PLATFORMS = iphonesimulator iphoneos
  478.                         SUPPORTS_TEXT_BASED_API = NO
  479.                         SWIFT_OBJC_BRIDGING_HEADER = Runner/Runner-Bridging-Header.h
  480.                         SWIFT_OPTIMIZATION_LEVEL = -Onone
  481.                         SWIFT_PLATFORM_TARGET_PREFIX = ios
  482.                         SWIFT_VERSION = 5.0
  483.                         SYMROOT = /Users/anwar/Library/Developer/Xcode/DerivedData/Runner-gxcmiqgnvesnbyfwaqpbecsxyzjk/Build/Products
  484.                         SYSTEM_ADMIN_APPS_DIR = /Applications/Utilities
  485.                         SYSTEM_APPS_DIR = /Applications
  486.                         SYSTEM_CORE_SERVICES_DIR = /System/Library/CoreServices
  487.                         SYSTEM_DEMOS_DIR = /Applications/Extras
  488.                         SYSTEM_DEVELOPER_APPS_DIR = /Applications/Xcode.app/Contents/Developer/Applications
  489.                         SYSTEM_DEVELOPER_BIN_DIR = /Applications/Xcode.app/Contents/Developer/usr/bin
  490.                         SYSTEM_DEVELOPER_DEMOS_DIR = /Applications/Xcode.app/Contents/Developer/Applications/Utilities/Built Examples
  491.                         SYSTEM_DEVELOPER_DIR = /Applications/Xcode.app/Contents/Developer
  492.                         SYSTEM_DEVELOPER_DOC_DIR = /Applications/Xcode.app/Contents/Developer/ADC Reference Library
  493.                         SYSTEM_DEVELOPER_GRAPHICS_TOOLS_DIR = /Applications/Xcode.app/Contents/Developer/Applications/Graphics Tools
  494.                         SYSTEM_DEVELOPER_JAVA_TOOLS_DIR = /Applications/Xcode.app/Contents/Developer/Applications/Java Tools
  495.                         SYSTEM_DEVELOPER_PERFORMANCE_TOOLS_DIR = /Applications/Xcode.app/Contents/Developer/Applications/Performance Tools
  496.                         SYSTEM_DEVELOPER_RELEASENOTES_DIR = /Applications/Xcode.app/Contents/Developer/ADC Reference Library/releasenotes
  497.                         SYSTEM_DEVELOPER_TOOLS = /Applications/Xcode.app/Contents/Developer/Tools
  498.                         SYSTEM_DEVELOPER_TOOLS_DOC_DIR = /Applications/Xcode.app/Contents/Developer/ADC Reference Library/documentation/DeveloperTools
  499.                         SYSTEM_DEVELOPER_TOOLS_RELEASENOTES_DIR = /Applications/Xcode.app/Contents/Developer/ADC Reference Library/releasenotes/DeveloperTools
  500.                         SYSTEM_DEVELOPER_USR_DIR = /Applications/Xcode.app/Contents/Developer/usr
  501.                         SYSTEM_DEVELOPER_UTILITIES_DIR = /Applications/Xcode.app/Contents/Developer/Applications/Utilities
  502.                         SYSTEM_DEXT_INSTALL_PATH = /System/Library/DriverExtensions
  503.                         SYSTEM_DOCUMENTATION_DIR = /Library/Documentation
  504.                         SYSTEM_KEXT_INSTALL_PATH = /System/Library/Extensions
  505.                         SYSTEM_LIBRARY_DIR = /System/Library
  506.                         TAPI_VERIFY_MODE = ErrorsOnly
  507.                         TARGETED_DEVICE_FAMILY = 1,2
  508.                         TARGETNAME = Runner
  509.                         TARGET_BUILD_DIR = /Users/anwar/Documents/lingotalk/mobile/build/ios/Debug-iphonesimulator
  510.                         TARGET_NAME = Runner
  511.                         TARGET_TEMP_DIR =
  512.                         /Users/anwar/Library/Developer/Xcode/DerivedData/Runner-gxcmiqgnvesnbyfwaqpbecsxyzjk/Build/Intermediates.noindex/Runner.build/Debug-iphonesimulator/Ru
  513.                         nner.build
  514.                         TEMP_DIR =
  515.                         /Users/anwar/Library/Developer/Xcode/DerivedData/Runner-gxcmiqgnvesnbyfwaqpbecsxyzjk/Build/Intermediates.noindex/Runner.build/Debug-iphonesimulator/Ru
  516.                         nner.build
  517.                         TEMP_FILES_DIR =
  518.                         /Users/anwar/Library/Developer/Xcode/DerivedData/Runner-gxcmiqgnvesnbyfwaqpbecsxyzjk/Build/Intermediates.noindex/Runner.build/Debug-iphonesimulator/Ru
  519.                         nner.build
  520.                         TEMP_FILE_DIR =
  521.                         /Users/anwar/Library/Developer/Xcode/DerivedData/Runner-gxcmiqgnvesnbyfwaqpbecsxyzjk/Build/Intermediates.noindex/Runner.build/Debug-iphonesimulator/Ru
  522.                         nner.build
  523.                         TEMP_ROOT = /Users/anwar/Library/Developer/Xcode/DerivedData/Runner-gxcmiqgnvesnbyfwaqpbecsxyzjk/Build/Intermediates.noindex
  524.                         TEST_FRAMEWORK_SEARCH_PATHS =  /Applications/Xcode.app/Contents/Developer/Platforms/iPhoneSimulator.platform/Developer/Library/Frameworks
  525.                         /Applications/Xcode.app/Contents/Developer/Platforms/iPhoneSimulator.platform/Developer/SDKs/iPhoneSimulator14.4.sdk/Developer/Library/Frameworks
  526.                         TEST_LIBRARY_SEARCH_PATHS =  /Applications/Xcode.app/Contents/Developer/Platforms/iPhoneSimulator.platform/Developer/usr/lib
  527.                         TOOLCHAIN_DIR = /Applications/Xcode.app/Contents/Developer/Toolchains/XcodeDefault.xctoolchain
  528.                         TRACK_WIDGET_CREATION = true
  529.                         TREAT_MISSING_BASELINES_AS_TEST_FAILURES = NO
  530.                         TREE_SHAKE_ICONS = false
  531.                         UID = 502
  532.                         UNLOCALIZED_RESOURCES_FOLDER_PATH = Runner.app
  533.                         UNSTRIPPED_PRODUCT = NO
  534.                         USER = anwar
  535.                         USER_APPS_DIR = /Users/anwar/Applications
  536.                         USER_LIBRARY_DIR = /Users/anwar/Library
  537.                         USE_DYNAMIC_NO_PIC = YES
  538.                         USE_HEADERMAP = YES
  539.                         USE_HEADER_SYMLINKS = NO
  540.                         USE_LLVM_TARGET_TRIPLES = YES
  541.                         USE_LLVM_TARGET_TRIPLES_FOR_CLANG = YES
  542.                         USE_LLVM_TARGET_TRIPLES_FOR_LD = YES
  543.                         USE_LLVM_TARGET_TRIPLES_FOR_TAPI = YES
  544.                         USE_RECURSIVE_SCRIPT_INPUTS_IN_SCRIPT_PHASES = YES
  545.                         VALIDATE_PRODUCT = NO
  546.                         VALIDATE_WORKSPACE = NO
  547.                         VALID_ARCHS = arm64 arm64e i386 x86_64
  548.                         VERBOSE_PBXCP = NO
  549.                         VERBOSE_SCRIPT_LOGGING = YES
  550.                         VERSIONING_SYSTEM = apple-generic
  551.                         VERSIONPLIST_PATH = Runner.app/version.plist
  552.                         VERSION_INFO_BUILDER = anwar
  553.                         VERSION_INFO_FILE = Runner_vers.c
  554.                         VERSION_INFO_STRING = "@(#)PROGRAM:Runner  PROJECT:Runner-1"
  555.                         WRAPPER_EXTENSION = app
  556.                         WRAPPER_NAME = Runner.app
  557.                         WRAPPER_SUFFIX = .app
  558.                         WRAP_ASSET_PACKS_IN_SEPARATE_DIRECTORIES = NO
  559.                         XCODE_APP_SUPPORT_DIR = /Applications/Xcode.app/Contents/Developer/Library/Xcode
  560.                         XCODE_PRODUCT_BUILD_VERSION = 12D4e
  561.                         XCODE_VERSION_ACTUAL = 1240
  562.                         XCODE_VERSION_MAJOR = 1200
  563.                         XCODE_VERSION_MINOR = 1240
  564.                         XPCSERVICES_FOLDER_PATH = Runner.app/XPCServices
  565.                         YACC = yacc
  566.                         arch = x86_64
  567.                         variant = normal
  568. [  +12 ms] Failed to build iOS app
  569. [   +2 ms] Error output from Xcode build:
  570.            ↳
  571. [   +3 ms]     ** BUILD FAILED **
  572.            
  573.            
  574.                The following build commands failed:
  575.                 PhaseScriptExecution [CP]\ Copy\ XCFrameworks
  576.  
  577. /Users/anwar/Library/Developer/Xcode/DerivedData/Runner-gxcmiqgnvesnbyfwaqpbecsxyzjk/Build/Intermediates.noindex/Pods.build/Debug-iphonesimulator/JitsiMeetSDK.build/Scri
  578.                 pt-AFB6AC3AB7F6110018285A3849F51D06.sh
  579.                 CompileC
  580.  
  581. /Users/anwar/Library/Developer/Xcode/DerivedData/Runner-gxcmiqgnvesnbyfwaqpbecsxyzjk/Build/Intermediates.noindex/Pods.build/Debug-iphonesimulator/webview_flutter.build/O
  582.                 bjects-normal/x86_64/JavaScriptChannelHandler.o
  583. /Users/anwar/flutter/.pub-cache/hosted/pub.dartlang.org/webview_flutter-2.0.4/ios/Classes/JavaScriptChannelHandler.m
  584.                 normal x86_64 objective-c com.apple.compilers.llvm.clang.1_0.compiler
  585.                 CompileC
  586.  
  587. /Users/anwar/Library/Developer/Xcode/DerivedData/Runner-gxcmiqgnvesnbyfwaqpbecsxyzjk/Build/Intermediates.noindex/Pods.build/Debug-iphonesimulator/webview_flutter.build/O
  588.                 bjects-normal/x86_64/FlutterWebView.o /Users/anwar/flutter/.pub-cache/hosted/pub.dartlang.org/webview_flutter-2.0.4/ios/Classes/FlutterWebView.m normal x86_64
  589.                 objective-c com.apple.compilers.llvm.clang.1_0.compiler
  590.                 CompileC
  591.  
  592. /Users/anwar/Library/Developer/Xcode/DerivedData/Runner-gxcmiqgnvesnbyfwaqpbecsxyzjk/Build/Intermediates.noindex/Pods.build/Debug-iphonesimulator/webview_flutter.build/O
  593.                 bjects-normal/x86_64/FLTWebViewFlutterPlugin.o
  594. /Users/anwar/flutter/.pub-cache/hosted/pub.dartlang.org/webview_flutter-2.0.4/ios/Classes/FLTWebViewFlutterPlugin.m normal
  595.                 x86_64 objective-c com.apple.compilers.llvm.clang.1_0.compiler
  596.                (4 failures)
  597.            
  598. [   +2 ms] Xcode's output:
  599.           ↳
  600. [  +23 ms]     Command line invocation:
  601.                   /Applications/Xcode.app/Contents/Developer/usr/bin/xcodebuild -configuration Debug VERBOSE_SCRIPT_LOGGING=YES -workspace Runner.xcworkspace -scheme Runner
  602.                   BUILD_DIR=/Users/anwar/Documents/lingotalk/mobile/build/ios -sdk iphonesimulator -arch x86_64
  603.                   SCRIPT_OUTPUT_STREAM_FILE=/var/folders/c_/f3k7z73s2d9_928_18wyb91h0000gp/T/flutter_tools.akoUwK/flutter_build_log_pipe.HwoKt1/pipe_to_stdout
  604.                   FLUTTER_SUPPRESS_ANALYTICS=true COMPILER_INDEX_STORE_ENABLE=NO
  605.          
  606.               Build settings from command line:
  607.                   ARCHS = x86_64
  608.                   BUILD_DIR = /Users/anwar/Documents/lingotalk/mobile/build/ios
  609.                   COMPILER_INDEX_STORE_ENABLE = NO
  610.                   FLUTTER_SUPPRESS_ANALYTICS = true
  611.                   SCRIPT_OUTPUT_STREAM_FILE = /var/folders/c_/f3k7z73s2d9_928_18wyb91h0000gp/T/flutter_tools.akoUwK/flutter_build_log_pipe.HwoKt1/pipe_to_stdout
  612.                   SDKROOT = iphonesimulator14.4
  613.                   VERBOSE_SCRIPT_LOGGING = YES
  614.          
  615.               note: Using new build system
  616.               note: Building targets in parallel
  617.               note: Planning build
  618.               note: Constructing build description
  619.               WriteAuxiliaryFile
  620.  
  621. /Users/anwar/Library/Developer/Xcode/DerivedData/Runner-gxcmiqgnvesnbyfwaqpbecsxyzjk/Build/Intermediates.noindex/Pods.build/Debug-iphonesimulator/shared_preferences.build
  622.               /shared_preferences-all-target-headers.hmap (in target 'shared_preferences' from project 'Pods')
  623.                   cd /Users/anwar/Documents/lingotalk/mobile/ios/Pods
  624.                   write-file
  625.  
  626. /Users/anwar/Library/Developer/Xcode/DerivedData/Runner-gxcmiqgnvesnbyfwaqpbecsxyzjk/Build/Intermediates.noindex/Pods.build/Debug-iphonesimulator/shared_preferences.b
  627.                   uild/shared_preferences-all-target-headers.hmap
  628.          
  629.               WriteAuxiliaryFile
  630.  
  631. /Users/anwar/Library/Developer/Xcode/DerivedData/Runner-gxcmiqgnvesnbyfwaqpbecsxyzjk/Build/Intermediates.noindex/Pods.build/Debug-iphonesimulator/webview_flutter.build/we
  632.               bview_flutter-all-target-headers.hmap (in target 'webview_flutter' from project 'Pods')
  633.                   cd /Users/anwar/Documents/lingotalk/mobile/ios/Pods
  634.                   write-file
  635.  
  636. /Users/anwar/Library/Developer/Xcode/DerivedData/Runner-gxcmiqgnvesnbyfwaqpbecsxyzjk/Build/Intermediates.noindex/Pods.build/Debug-iphonesimulator/webview_flutter.buil
  637.                   d/webview_flutter-all-target-headers.hmap
  638.          
  639.               WriteAuxiliaryFile
  640.  
  641. /Users/anwar/Library/Developer/Xcode/DerivedData/Runner-gxcmiqgnvesnbyfwaqpbecsxyzjk/Build/Intermediates.noindex/Pods.build/Debug-iphonesimulator/libPhoneNumber-iOS.build
  642.               /libPhoneNumber_iOS-all-target-headers.hmap (in target 'libPhoneNumber-iOS' from project 'Pods')
  643.                   cd /Users/anwar/Documents/lingotalk/mobile/ios/Pods
  644.                   write-file
  645.  
  646. /Users/anwar/Library/Developer/Xcode/DerivedData/Runner-gxcmiqgnvesnbyfwaqpbecsxyzjk/Build/Intermediates.noindex/Pods.build/Debug-iphonesimulator/libPhoneNumber-iOS.b
  647.                   uild/libPhoneNumber_iOS-all-target-headers.hmap
  648.          
  649.               WriteAuxiliaryFile
  650.  
  651. /Users/anwar/Library/Developer/Xcode/DerivedData/Runner-gxcmiqgnvesnbyfwaqpbecsxyzjk/Build/Intermediates.noindex/Pods.build/Debug-iphonesimulator/path_provider.build/path
  652.               _provider-all-target-headers.hmap (in target 'path_provider' from project 'Pods')
  653.                   cd /Users/anwar/Documents/lingotalk/mobile/ios/Pods
  654.                   write-file
  655.  
  656. /Users/anwar/Library/Developer/Xcode/DerivedData/Runner-gxcmiqgnvesnbyfwaqpbecsxyzjk/Build/Intermediates.noindex/Pods.build/Debug-iphonesimulator/path_provider.build/
  657.                   path_provider-all-target-headers.hmap
  658.          
  659.               WriteAuxiliaryFile
  660.  
  661. /Users/anwar/Library/Developer/Xcode/DerivedData/Runner-gxcmiqgnvesnbyfwaqpbecsxyzjk/Build/Intermediates.noindex/Pods.build/Debug-iphonesimulator/image_picker.build/image
  662.               _picker-all-target-headers.hmap (in target 'image_picker' from project 'Pods')
  663.                   cd /Users/anwar/Documents/lingotalk/mobile/ios/Pods
  664.                   write-file
  665.  
  666. /Users/anwar/Library/Developer/Xcode/DerivedData/Runner-gxcmiqgnvesnbyfwaqpbecsxyzjk/Build/Intermediates.noindex/Pods.build/Debug-iphonesimulator/image_picker.build/i
  667.                   mage_picker-all-target-headers.hmap
  668.          
  669.               WriteAuxiliaryFile
  670.  
  671. /Users/anwar/Library/Developer/Xcode/DerivedData/Runner-gxcmiqgnvesnbyfwaqpbecsxyzjk/Build/Intermediates.noindex/Pods.build/Debug-iphonesimulator/Toast.build/Toast-all-ta
  672.               rget-headers.hmap (in target 'Toast' from project 'Pods')
  673.                   cd /Users/anwar/Documents/lingotalk/mobile/ios/Pods
  674.                   write-file
  675.  
  676. /Users/anwar/Library/Developer/Xcode/DerivedData/Runner-gxcmiqgnvesnbyfwaqpbecsxyzjk/Build/Intermediates.noindex/Pods.build/Debug-iphonesimulator/Toast.build/Toast-al
  677.                   l-target-headers.hmap
  678.          
  679.               WriteAuxiliaryFile
  680.  
  681. /Users/anwar/Library/Developer/Xcode/DerivedData/Runner-gxcmiqgnvesnbyfwaqpbecsxyzjk/Build/Intermediates.noindex/Pods.build/Debug-iphonesimulator/Reachability.build/Reach
  682.               ability-all-target-headers.hmap (in target 'Reachability' from project 'Pods')
  683.                   cd /Users/anwar/Documents/lingotalk/mobile/ios/Pods
  684.                   write-file
  685.  
  686. /Users/anwar/Library/Developer/Xcode/DerivedData/Runner-gxcmiqgnvesnbyfwaqpbecsxyzjk/Build/Intermediates.noindex/Pods.build/Debug-iphonesimulator/Reachability.build/R
  687.                   eachability-all-target-headers.hmap
  688.          
  689.               PhaseScriptExecution [CP]\ Copy\ XCFrameworks
  690.  
  691. /Users/anwar/Library/Developer/Xcode/DerivedData/Runner-gxcmiqgnvesnbyfwaqpbecsxyzjk/Build/Intermediates.noindex/Pods.build/Debug-iphonesimulator/JitsiMeetSDK.build/Scrip
  692.               t-AFB6AC3AB7F6110018285A3849F51D06.sh (in target 'JitsiMeetSDK' from project 'Pods')
  693.                   cd /Users/anwar/Documents/lingotalk/mobile/ios/Pods
  694.                   /bin/sh -c
  695.  
  696. /Users/anwar/Library/Developer/Xcode/DerivedData/Runner-gxcmiqgnvesnbyfwaqpbecsxyzjk/Build/Intermediates.noindex/Pods.build/Debug-iphonesimulator/JitsiMeetSDK.build/S
  697.                   cript-AFB6AC3AB7F6110018285A3849F51D06.sh
  698.               Selected xcframework slice ios-x86_64-simulator
  699.               rsync --delete -av --filter P .*.?????? --links --filter "- CVS/" --filter "- .svn/" --filter "- .git/" --filter "- .hg/"
  700.               "/Users/anwar/Documents/lingotalk/mobile/ios/Pods/JitsiMeetSDK/Frameworks/JitsiMeetSDK.xcframework/ios-x86_64-simulator/"
  701.               "/Users/anwar/Documents/lingotalk/mobile/build/ios/Debug-iphonesimulator/XCFrameworkIntermediates/JitsiMeetSDK"
  702.               building file list ... done
  703.               ./
  704.               JitsiMeetSDK.framework/
  705.               JitsiMeetSDK.framework/CallKitIcon.png
  706.               JitsiMeetSDK.framework/Info.plist
  707.               JitsiMeetSDK.framework/JitsiMeetSDK
  708.               JitsiMeetSDK.framework/image-resize@2x.png
  709.               JitsiMeetSDK.framework/image-resize@3x.png
  710.               JitsiMeetSDK.framework/incomingMessage.wav
  711.               JitsiMeetSDK.framework/joined.wav
  712.               JitsiMeetSDK.framework/left.wav
  713.               JitsiMeetSDK.framework/liveStreamingOff.mp3
  714.               JitsiMeetSDK.framework/liveStreamingOn.mp3
  715.               JitsiMeetSDK.framework/main.jsbundle
  716.               JitsiMeetSDK.framework/outgoingRinging.wav
  717.               JitsiMeetSDK.framework/outgoingStart.wav
  718.               JitsiMeetSDK.framework/recordingOff.mp3
  719.               JitsiMeetSDK.framework/recordingOn.mp3
  720.               JitsiMeetSDK.framework/rejected.wav
  721.               JitsiMeetSDK.framework/GoogleSignIn.bundle/
  722.               JitsiMeetSDK.framework/GoogleSignIn.bundle/Info.plist
  723.               JitsiMeetSDK.framework/GoogleSignIn.bundle/Roboto-Bold.ttf
  724.               JitsiMeetSDK.framework/GoogleSignIn.bundle/google.png
  725.               JitsiMeetSDK.framework/GoogleSignIn.bundle/google@2x.png
  726.               JitsiMeetSDK.framework/GoogleSignIn.bundle/google@3x.png
  727.               JitsiMeetSDK.framework/GoogleSignIn.bundle/ar.lproj/
  728.               JitsiMeetSDK.framework/GoogleSignIn.bundle/ar.lproj/GoogleSignIn.strings
  729.               JitsiMeetSDK.framework/GoogleSignIn.bundle/ca.lproj/
  730.               JitsiMeetSDK.framework/GoogleSignIn.bundle/ca.lproj/GoogleSignIn.strings
  731.               JitsiMeetSDK.framework/GoogleSignIn.bundle/cs.lproj/
  732.               JitsiMeetSDK.framework/GoogleSignIn.bundle/cs.lproj/GoogleSignIn.strings
  733.               JitsiMeetSDK.framework/GoogleSignIn.bundle/da.lproj/
  734.               JitsiMeetSDK.framework/GoogleSignIn.bundle/da.lproj/GoogleSignIn.strings
  735.               JitsiMeetSDK.framework/GoogleSignIn.bundle/de.lproj/
  736.               JitsiMeetSDK.framework/GoogleSignIn.bundle/de.lproj/GoogleSignIn.strings
  737.               JitsiMeetSDK.framework/GoogleSignIn.bundle/el.lproj/
  738.               JitsiMeetSDK.framework/GoogleSignIn.bundle/el.lproj/GoogleSignIn.strings
  739.               JitsiMeetSDK.framework/GoogleSignIn.bundle/en.lproj/
  740.               JitsiMeetSDK.framework/GoogleSignIn.bundle/en.lproj/GoogleSignIn.strings
  741.               JitsiMeetSDK.framework/GoogleSignIn.bundle/en_GB.lproj/
  742.               JitsiMeetSDK.framework/GoogleSignIn.bundle/en_GB.lproj/GoogleSignIn.strings
  743.               JitsiMeetSDK.framework/GoogleSignIn.bundle/es.lproj/
  744.               JitsiMeetSDK.framework/GoogleSignIn.bundle/es.lproj/GoogleSignIn.strings
  745.               JitsiMeetSDK.framework/GoogleSignIn.bundle/es_MX.lproj/
  746.               JitsiMeetSDK.framework/GoogleSignIn.bundle/es_MX.lproj/GoogleSignIn.strings
  747.               JitsiMeetSDK.framework/GoogleSignIn.bundle/fi.lproj/
  748.               JitsiMeetSDK.framework/GoogleSignIn.bundle/fi.lproj/GoogleSignIn.strings
  749.               JitsiMeetSDK.framework/GoogleSignIn.bundle/fr.lproj/
  750.               JitsiMeetSDK.framework/GoogleSignIn.bundle/fr.lproj/GoogleSignIn.strings
  751.               JitsiMeetSDK.framework/GoogleSignIn.bundle/fr_CA.lproj/
  752.               JitsiMeetSDK.framework/GoogleSignIn.bundle/fr_CA.lproj/GoogleSignIn.strings
  753.               JitsiMeetSDK.framework/GoogleSignIn.bundle/he.lproj/
  754.               JitsiMeetSDK.framework/GoogleSignIn.bundle/he.lproj/GoogleSignIn.strings
  755.               JitsiMeetSDK.framework/GoogleSignIn.bundle/hi.lproj/
  756.               JitsiMeetSDK.framework/GoogleSignIn.bundle/hi.lproj/GoogleSignIn.strings
  757.               JitsiMeetSDK.framework/GoogleSignIn.bundle/hr.lproj/
  758.               JitsiMeetSDK.framework/GoogleSignIn.bundle/hr.lproj/GoogleSignIn.strings
  759.               JitsiMeetSDK.framework/GoogleSignIn.bundle/hu.lproj/
  760.               JitsiMeetSDK.framework/GoogleSignIn.bundle/hu.lproj/GoogleSignIn.strings
  761.               JitsiMeetSDK.framework/GoogleSignIn.bundle/id.lproj/
  762.               JitsiMeetSDK.framework/GoogleSignIn.bundle/id.lproj/GoogleSignIn.strings
  763.               JitsiMeetSDK.framework/GoogleSignIn.bundle/it.lproj/
  764.               JitsiMeetSDK.framework/GoogleSignIn.bundle/it.lproj/GoogleSignIn.strings
  765.               JitsiMeetSDK.framework/GoogleSignIn.bundle/ja.lproj/
  766.               JitsiMeetSDK.framework/GoogleSignIn.bundle/ja.lproj/GoogleSignIn.strings
  767.               JitsiMeetSDK.framework/GoogleSignIn.bundle/ko.lproj/
  768.               JitsiMeetSDK.framework/GoogleSignIn.bundle/ko.lproj/GoogleSignIn.strings
  769.               JitsiMeetSDK.framework/GoogleSignIn.bundle/ms.lproj/
  770.               JitsiMeetSDK.framework/GoogleSignIn.bundle/ms.lproj/GoogleSignIn.strings
  771.               JitsiMeetSDK.framework/GoogleSignIn.bundle/nb.lproj/
  772.               JitsiMeetSDK.framework/GoogleSignIn.bundle/nb.lproj/GoogleSignIn.strings
  773.               JitsiMeetSDK.framework/GoogleSignIn.bundle/nl.lproj/
  774.               JitsiMeetSDK.framework/GoogleSignIn.bundle/nl.lproj/GoogleSignIn.strings
  775.               JitsiMeetSDK.framework/GoogleSignIn.bundle/pl.lproj/
  776.               JitsiMeetSDK.framework/GoogleSignIn.bundle/pl.lproj/GoogleSignIn.strings
  777.               JitsiMeetSDK.framework/GoogleSignIn.bundle/pt.lproj/
  778.               JitsiMeetSDK.framework/GoogleSignIn.bundle/pt.lproj/GoogleSignIn.strings
  779.               JitsiMeetSDK.framework/GoogleSignIn.bundle/pt_BR.lproj/
  780.               JitsiMeetSDK.framework/GoogleSignIn.bundle/pt_BR.lproj/GoogleSignIn.strings
  781.               JitsiMeetSDK.framework/GoogleSignIn.bundle/pt_PT.lproj/
  782.               JitsiMeetSDK.framework/GoogleSignIn.bundle/pt_PT.lproj/GoogleSignIn.strings
  783.               JitsiMeetSDK.framework/GoogleSignIn.bundle/ro.lproj/
  784.               JitsiMeetSDK.framework/GoogleSignIn.bundle/ro.lproj/GoogleSignIn.strings
  785.               JitsiMeetSDK.framework/GoogleSignIn.bundle/ru.lproj/
  786.               JitsiMeetSDK.framework/GoogleSignIn.bundle/ru.lproj/GoogleSignIn.strings
  787.               JitsiMeetSDK.framework/GoogleSignIn.bundle/sk.lproj/
  788.               JitsiMeetSDK.framework/GoogleSignIn.bundle/sk.lproj/GoogleSignIn.strings
  789.               JitsiMeetSDK.framework/GoogleSignIn.bundle/sv.lproj/
  790.               JitsiMeetSDK.framework/GoogleSignIn.bundle/sv.lproj/GoogleSignIn.strings
  791.               JitsiMeetSDK.framework/GoogleSignIn.bundle/th.lproj/
  792.               JitsiMeetSDK.framework/GoogleSignIn.bundle/th.lproj/GoogleSignIn.strings
  793.               JitsiMeetSDK.framework/GoogleSignIn.bundle/tr.lproj/
  794.               JitsiMeetSDK.framework/GoogleSignIn.bundle/tr.lproj/GoogleSignIn.strings
  795.               JitsiMeetSDK.framework/GoogleSignIn.bundle/uk.lproj/
  796.               JitsiMeetSDK.framework/GoogleSignIn.bundle/uk.lproj/GoogleSignIn.strings
  797.               JitsiMeetSDK.framework/GoogleSignIn.bundle/vi.lproj/
  798.               JitsiMeetSDK.framework/GoogleSignIn.bundle/vi.lproj/GoogleSignIn.strings
  799.               JitsiMeetSDK.framework/GoogleSignIn.bundle/zh_CN.lproj/
  800.               JitsiMeetSDK.framework/GoogleSignIn.bundle/zh_CN.lproj/GoogleSignIn.strings
  801.               JitsiMeetSDK.framework/GoogleSignIn.bundle/zh_TW.lproj/
  802.               JitsiMeetSDK.framework/GoogleSignIn.bundle/zh_TW.lproj/GoogleSignIn.strings
  803.               JitsiMeetSDK.framework/Headers/
  804.               JitsiMeetSDK.framework/Headers/InfoPlistUtil.h
  805.               JitsiMeetSDK.framework/Headers/JitsiMeet.h
  806.               JitsiMeetSDK.framework/Headers/JitsiMeetBaseLogHandler.h
  807.               JitsiMeetSDK.framework/Headers/JitsiMeetConferenceOptions.h
  808.               JitsiMeetSDK.framework/Headers/JitsiMeetLogger.h
  809.               JitsiMeetSDK.framework/Headers/JitsiMeetSDK-Swift.h
  810.               JitsiMeetSDK.framework/Headers/JitsiMeetSDK.h
  811.               JitsiMeetSDK.framework/Headers/JitsiMeetUserInfo.h
  812.               JitsiMeetSDK.framework/Headers/JitsiMeetView.h
  813.               JitsiMeetSDK.framework/Headers/JitsiMeetViewDelegate.h
  814.               JitsiMeetSDK.framework/Modules/
  815.               JitsiMeetSDK.framework/Modules/module.modulemap
  816.               JitsiMeetSDK.framework/Modules/JitsiMeetSDK.swiftmodule/
  817.               JitsiMeetSDK.framework/Modules/JitsiMeetSDK.swiftmodule/x86_64-apple-ios-simulator.swiftdoc
  818.               JitsiMeetSDK.framework/Modules/JitsiMeetSDK.swiftmodule/x86_64-apple-ios-simulator.swiftinterface
  819.               JitsiMeetSDK.framework/Modules/JitsiMeetSDK.swiftmodule/x86_64.swiftdoc
  820.               JitsiMeetSDK.framework/Modules/JitsiMeetSDK.swiftmodule/x86_64.swiftinterface
  821.               JitsiMeetSDK.framework/_CodeSignature/
  822.               JitsiMeetSDK.framework/_CodeSignature/CodeResources
  823.               JitsiMeetSDK.framework/assets/
  824.               JitsiMeetSDK.framework/assets/images/
  825.               JitsiMeetSDK.framework/assets/images/avatar.png
  826.               JitsiMeetSDK.framework/assets/images/btn_google_signin_dark_normal.png
  827.               JitsiMeetSDK.framework/assets/images/dropboxLogo_square.png
  828.               JitsiMeetSDK.framework/assets/images/icon-users.png
  829.               JitsiMeetSDK.framework/assets/images/jitsiLogo_square.png
  830.               JitsiMeetSDK.framework/assets/lang/
  831.               JitsiMeetSDK.framework/assets/lang/languages-af.json
  832.               JitsiMeetSDK.framework/assets/lang/languages-ar.json
  833.               JitsiMeetSDK.framework/assets/lang/languages-bg.json
  834.               JitsiMeetSDK.framework/assets/lang/languages-ca.json
  835.               JitsiMeetSDK.framework/assets/lang/languages-de.json
  836.               JitsiMeetSDK.framework/assets/lang/languages-enGB.json
  837.               JitsiMeetSDK.framework/assets/lang/languages-eo.json
  838.               JitsiMeetSDK.framework/assets/lang/languages-es.json
  839.               JitsiMeetSDK.framework/assets/lang/languages-esUS.json
  840.               JitsiMeetSDK.framework/assets/lang/languages-et.json
  841.               JitsiMeetSDK.framework/assets/lang/languages-fa.json
  842.               JitsiMeetSDK.framework/assets/lang/languages-fi.json
  843.               JitsiMeetSDK.framework/assets/lang/languages-fr.json
  844.               JitsiMeetSDK.framework/assets/lang/languages-frCA.json
  845.               JitsiMeetSDK.framework/assets/lang/languages-hr.json
  846.               JitsiMeetSDK.framework/assets/lang/languages-hu.json
  847.               JitsiMeetSDK.framework/assets/lang/languages-it.json
  848.               JitsiMeetSDK.framework/assets/lang/languages-ja.json
  849.               JitsiMeetSDK.framework/assets/lang/languages-ko.json
  850.               JitsiMeetSDK.framework/assets/lang/languages-mn.json
  851.               JitsiMeetSDK.framework/assets/lang/languages-nl.json
  852.               JitsiMeetSDK.framework/assets/lang/languages-oc.json
  853.               JitsiMeetSDK.framework/assets/lang/languages-pl.json
  854.               JitsiMeetSDK.framework/assets/lang/languages-ptBR.json
  855.               JitsiMeetSDK.framework/assets/lang/languages-ro.json
  856.               JitsiMeetSDK.framework/assets/lang/languages-ru.json
  857.               JitsiMeetSDK.framework/assets/lang/languages-sc.json
  858.               JitsiMeetSDK.framework/assets/lang/languages-sk.json
  859.               JitsiMeetSDK.framework/assets/lang/languages-sl.json
  860.               JitsiMeetSDK.framework/assets/lang/languages-sv.json
  861.               JitsiMeetSDK.framework/assets/lang/languages-tr.json
  862.               JitsiMeetSDK.framework/assets/lang/languages-vi.json
  863.               JitsiMeetSDK.framework/assets/lang/languages-zhCN.json
  864.               rsync error: received SIGINT, SIGTERM, or SIGHUP (code 20) at /AppleInternal/BuildRoot/Library/Caches/com.apple.xbs/Sources/rsync/rsync-55/rsync/rsync.c(244)
  865.               [sender=2.6.9]
  866.               Command PhaseScriptExecution failed with a nonzero exit code
  867.          
  868.               ProcessInfoPlistFile /Users/anwar/Documents/lingotalk/mobile/build/ios/Debug-iphonesimulator/webview_flutter/webview_flutter.framework/Info.plist
  869.               /Users/anwar/Documents/lingotalk/mobile/ios/Pods/Target\ Support\ Files/webview_flutter/webview_flutter-Info.plist (in target 'webview_flutter' from project
  870. 'Pods')
  871.                   cd /Users/anwar/Documents/lingotalk/mobile/ios/Pods
  872.                   builtin-infoPlistUtility /Users/anwar/Documents/lingotalk/mobile/ios/Pods/Target\ Support\ Files/webview_flutter/webview_flutter-Info.plist -producttype
  873.                   com.apple.product-type.framework -expandbuildsettings -format binary -platform iphonesimulator -o
  874.                   /Users/anwar/Documents/lingotalk/mobile/build/ios/Debug-iphonesimulator/webview_flutter/webview_flutter.framework/Info.plist
  875.          
  876.               CompileC
  877.  
  878. /Users/anwar/Library/Developer/Xcode/DerivedData/Runner-gxcmiqgnvesnbyfwaqpbecsxyzjk/Build/Intermediates.noindex/Pods.build/Debug-iphonesimulator/webview_flutter.build/Ob
  879.               jects-normal/x86_64/JavaScriptChannelHandler.o
  880. /Users/anwar/flutter/.pub-cache/hosted/pub.dartlang.org/webview_flutter-2.0.4/ios/Classes/JavaScriptChannelHandler.m normal
  881.               x86_64 objective-c com.apple.compilers.llvm.clang.1_0.compiler (in target 'webview_flutter' from project 'Pods')
  882.                   cd /Users/anwar/Documents/lingotalk/mobile/ios/Pods
  883.                   export LANG\=en_US.US-ASCII
  884.                   /Applications/Xcode.app/Contents/Developer/Toolchains/XcodeDefault.xctoolchain/usr/bin/clang -x objective-c -target x86_64-apple-ios11.0-simulator
  885. -fmessage-length\=0
  886.                   -fdiagnostics-show-note-include-stack -fmacro-backtrace-limit\=0 -std\=gnu11 -fobjc-arc -fobjc-weak -fmodules -gmodules
  887.                   -fmodules-cache-path\=/Users/anwar/Library/Developer/Xcode/DerivedData/ModuleCache.noindex -fmodules-prune-interval\=86400 -fmodules-prune-after\=345600
  888.                   -fbuild-session-file\=/Users/anwar/Library/Developer/Xcode/DerivedData/ModuleCache.noindex/Session.modulevalidation
  889. -fmodules-validate-once-per-build-session
  890.                   -Wnon-modular-include-in-framework-module -Werror\=non-modular-include-in-framework-module -fmodule-name\=webview_flutter -Wno-trigraphs -fpascal-strings
  891. -O0
  892.                   -fno-common -Wno-missing-field-initializers -Wno-missing-prototypes -Werror\=return-type -Wdocumentation -Wunreachable-code -Wno-implicit-atomic-properties
  893.                   -Werror\=deprecated-objc-isa-usage -Wno-objc-interface-ivars -Werror\=objc-root-class -Wno-arc-repeated-use-of-weak -Wimplicit-retain-self
  894. -Wduplicate-method-match
  895.                   -Wno-missing-braces -Wparentheses -Wswitch -Wunused-function -Wno-unused-label -Wno-unused-parameter -Wunused-variable -Wunused-value -Wempty-body
  896. -Wuninitialized
  897.                   -Wconditional-uninitialized -Wno-unknown-pragmas -Wno-shadow -Wno-four-char-constants -Wno-conversion -Wconstant-conversion -Wint-conversion
  898. -Wbool-conversion
  899.                   -Wenum-conversion -Wno-float-conversion -Wnon-literal-null-conversion -Wobjc-literal-conversion -Wshorten-64-to-32 -Wpointer-sign -Wno-newline-eof
  900. -Wno-selector
  901.                   -Wno-strict-selector-match -Wundeclared-selector -Wdeprecated-implementations -DPOD_CONFIGURATION_DEBUG\=1 -DDEBUG\=1 -DCOCOAPODS\=1
  902. -DOBJC_OLD_DISPATCH_PROTOTYPES\=0
  903.                   -isysroot /Applications/Xcode.app/Contents/Developer/Platforms/iPhoneSimulator.platform/Developer/SDKs/iPhoneSimulator14.4.sdk -fasm-blocks
  904. -fstrict-aliasing
  905.                   -Wprotocol -Wdeprecated-declarations -g -Wno-sign-conversion -Winfinite-recursion -Wcomma -Wblock-capture-autoreleasing -Wstrict-prototypes
  906.                   -Wno-semicolon-before-method-body -Wunguarded-availability -fobjc-abi-version\=2 -fobjc-legacy-dispatch -iquote
  907.  
  908. /Users/anwar/Library/Developer/Xcode/DerivedData/Runner-gxcmiqgnvesnbyfwaqpbecsxyzjk/Build/Intermediates.noindex/Pods.build/Debug-iphonesimulator/webview_flutter.buil
  909.                   d/webview_flutter-generated-files.hmap
  910.  
  911. -I/Users/anwar/Library/Developer/Xcode/DerivedData/Runner-gxcmiqgnvesnbyfwaqpbecsxyzjk/Build/Intermediates.noindex/Pods.build/Debug-iphonesimulator/webview_flutter.bu
  912.                   ild/webview_flutter-own-target-headers.hmap
  913.  
  914. -I/Users/anwar/Library/Developer/Xcode/DerivedData/Runner-gxcmiqgnvesnbyfwaqpbecsxyzjk/Build/Intermediates.noindex/Pods.build/Debug-iphonesimulator/webview_flutter.bu
  915.                   ild/webview_flutter-all-non-framework-target-headers.hmap -ivfsoverlay
  916.  
  917. /Users/anwar/Library/Developer/Xcode/DerivedData/Runner-gxcmiqgnvesnbyfwaqpbecsxyzjk/Build/Intermediates.noindex/Pods.build/Debug-iphonesimulator/webview_flutter.buil
  918.                   d/all-product-headers.yaml -iquote
  919.  
  920. /Users/anwar/Library/Developer/Xcode/DerivedData/Runner-gxcmiqgnvesnbyfwaqpbecsxyzjk/Build/Intermediates.noindex/Pods.build/Debug-iphonesimulator/webview_flutter.buil
  921.                   d/webview_flutter-project-headers.hmap -I/Users/anwar/Documents/lingotalk/mobile/build/ios/Debug-iphonesimulator/webview_flutter/include
  922.  
  923. -I/Users/anwar/Library/Developer/Xcode/DerivedData/Runner-gxcmiqgnvesnbyfwaqpbecsxyzjk/Build/Intermediates.noindex/Pods.build/Debug-iphonesimulator/webview_flutter.bu
  924.                   ild/DerivedSources-normal/x86_64
  925.  
  926. -I/Users/anwar/Library/Developer/Xcode/DerivedData/Runner-gxcmiqgnvesnbyfwaqpbecsxyzjk/Build/Intermediates.noindex/Pods.build/Debug-iphonesimulator/webview_flutter.bu
  927.                   ild/DerivedSources/x86_64
  928.  
  929. -I/Users/anwar/Library/Developer/Xcode/DerivedData/Runner-gxcmiqgnvesnbyfwaqpbecsxyzjk/Build/Intermediates.noindex/Pods.build/Debug-iphonesimulator/webview_flutter.bu
  930.                   ild/DerivedSources -F/Users/anwar/Documents/lingotalk/mobile/build/ios/Debug-iphonesimulator/webview_flutter -include
  931.                   /Users/anwar/Documents/lingotalk/mobile/ios/Pods/Target\ Support\ Files/webview_flutter/webview_flutter-prefix.pch -MMD -MT dependencies -MF
  932.  
  933. /Users/anwar/Library/Developer/Xcode/DerivedData/Runner-gxcmiqgnvesnbyfwaqpbecsxyzjk/Build/Intermediates.noindex/Pods.build/Debug-iphonesimulator/webview_flutter.buil
  934.                   d/Objects-normal/x86_64/JavaScriptChannelHandler.d --serialize-diagnostics
  935.  
  936. /Users/anwar/Library/Developer/Xcode/DerivedData/Runner-gxcmiqgnvesnbyfwaqpbecsxyzjk/Build/Intermediates.noindex/Pods.build/Debug-iphonesimulator/webview_flutter.buil
  937.                   d/Objects-normal/x86_64/JavaScriptChannelHandler.dia -c
  938.                   /Users/anwar/flutter/.pub-cache/hosted/pub.dartlang.org/webview_flutter-2.0.4/ios/Classes/JavaScriptChannelHandler.m -o
  939.  
  940. /Users/anwar/Library/Developer/Xcode/DerivedData/Runner-gxcmiqgnvesnbyfwaqpbecsxyzjk/Build/Intermediates.noindex/Pods.build/Debug-iphonesimulator/webview_flutter.buil
  941.                   d/Objects-normal/x86_64/JavaScriptChannelHandler.o
  942.               In file included from /Users/anwar/flutter/.pub-cache/hosted/pub.dartlang.org/webview_flutter-2.0.4/ios/Classes/JavaScriptChannelHandler.m:5:
  943.               /Users/anwar/flutter/.pub-cache/hosted/pub.dartlang.org/webview_flutter-2.0.4/ios/Classes/JavaScriptChannelHandler.h:5:9: fatal error: 'Flutter/Flutter.h' file
  944. not found
  945.               #import <Flutter/Flutter.h>
  946.                       ^~~~~~~~~~~~~~~~~~~
  947.               1 error generated.
  948.          
  949.               CompileC
  950.  
  951. /Users/anwar/Library/Developer/Xcode/DerivedData/Runner-gxcmiqgnvesnbyfwaqpbecsxyzjk/Build/Intermediates.noindex/Pods.build/Debug-iphonesimulator/webview_flutter.build/Ob
  952.               jects-normal/x86_64/FlutterWebView.o /Users/anwar/flutter/.pub-cache/hosted/pub.dartlang.org/webview_flutter-2.0.4/ios/Classes/FlutterWebView.m normal x86_64
  953. objective-c
  954.               com.apple.compilers.llvm.clang.1_0.compiler (in target 'webview_flutter' from project 'Pods')
  955.                   cd /Users/anwar/Documents/lingotalk/mobile/ios/Pods
  956.                   export LANG\=en_US.US-ASCII
  957.                   /Applications/Xcode.app/Contents/Developer/Toolchains/XcodeDefault.xctoolchain/usr/bin/clang -x objective-c -target x86_64-apple-ios11.0-simulator
  958. -fmessage-length\=0
  959.                   -fdiagnostics-show-note-include-stack -fmacro-backtrace-limit\=0 -std\=gnu11 -fobjc-arc -fobjc-weak -fmodules -gmodules
  960.                   -fmodules-cache-path\=/Users/anwar/Library/Developer/Xcode/DerivedData/ModuleCache.noindex -fmodules-prune-interval\=86400 -fmodules-prune-after\=345600
  961.                   -fbuild-session-file\=/Users/anwar/Library/Developer/Xcode/DerivedData/ModuleCache.noindex/Session.modulevalidation
  962. -fmodules-validate-once-per-build-session
  963.                   -Wnon-modular-include-in-framework-module -Werror\=non-modular-include-in-framework-module -fmodule-name\=webview_flutter -Wno-trigraphs -fpascal-strings
  964. -O0
  965.                   -fno-common -Wno-missing-field-initializers -Wno-missing-prototypes -Werror\=return-type -Wdocumentation -Wunreachable-code -Wno-implicit-atomic-properties
  966.                   -Werror\=deprecated-objc-isa-usage -Wno-objc-interface-ivars -Werror\=objc-root-class -Wno-arc-repeated-use-of-weak -Wimplicit-retain-self
  967. -Wduplicate-method-match
  968.                   -Wno-missing-braces -Wparentheses -Wswitch -Wunused-function -Wno-unused-label -Wno-unused-parameter -Wunused-variable -Wunused-value -Wempty-body
  969. -Wuninitialized
  970.                   -Wconditional-uninitialized -Wno-unknown-pragmas -Wno-shadow -Wno-four-char-constants -Wno-conversion -Wconstant-conversion -Wint-conversion
  971. -Wbool-conversion
  972.                   -Wenum-conversion -Wno-float-conversion -Wnon-literal-null-conversion -Wobjc-literal-conversion -Wshorten-64-to-32 -Wpointer-sign -Wno-newline-eof
  973. -Wno-selector
  974.                   -Wno-strict-selector-match -Wundeclared-selector -Wdeprecated-implementations -DPOD_CONFIGURATION_DEBUG\=1 -DDEBUG\=1 -DCOCOAPODS\=1
  975. -DOBJC_OLD_DISPATCH_PROTOTYPES\=0
  976.                   -isysroot /Applications/Xcode.app/Contents/Developer/Platforms/iPhoneSimulator.platform/Developer/SDKs/iPhoneSimulator14.4.sdk -fasm-blocks
  977. -fstrict-aliasing
  978.                   -Wprotocol -Wdeprecated-declarations -g -Wno-sign-conversion -Winfinite-recursion -Wcomma -Wblock-capture-autoreleasing -Wstrict-prototypes
  979.                   -Wno-semicolon-before-method-body -Wunguarded-availability -fobjc-abi-version\=2 -fobjc-legacy-dispatch -iquote
  980.  
  981. /Users/anwar/Library/Developer/Xcode/DerivedData/Runner-gxcmiqgnvesnbyfwaqpbecsxyzjk/Build/Intermediates.noindex/Pods.build/Debug-iphonesimulator/webview_flutter.buil
  982.                   d/webview_flutter-generated-files.hmap
  983.  
  984. -I/Users/anwar/Library/Developer/Xcode/DerivedData/Runner-gxcmiqgnvesnbyfwaqpbecsxyzjk/Build/Intermediates.noindex/Pods.build/Debug-iphonesimulator/webview_flutter.bu
  985.                   ild/webview_flutter-own-target-headers.hmap
  986.  
  987. -I/Users/anwar/Library/Developer/Xcode/DerivedData/Runner-gxcmiqgnvesnbyfwaqpbecsxyzjk/Build/Intermediates.noindex/Pods.build/Debug-iphonesimulator/webview_flutter.bu
  988.                   ild/webview_flutter-all-non-framework-target-headers.hmap -ivfsoverlay
  989.  
  990. /Users/anwar/Library/Developer/Xcode/DerivedData/Runner-gxcmiqgnvesnbyfwaqpbecsxyzjk/Build/Intermediates.noindex/Pods.build/Debug-iphonesimulator/webview_flutter.buil
  991.                   d/all-product-headers.yaml -iquote
  992.  
  993. /Users/anwar/Library/Developer/Xcode/DerivedData/Runner-gxcmiqgnvesnbyfwaqpbecsxyzjk/Build/Intermediates.noindex/Pods.build/Debug-iphonesimulator/webview_flutter.buil
  994.                   d/webview_flutter-project-headers.hmap -I/Users/anwar/Documents/lingotalk/mobile/build/ios/Debug-iphonesimulator/webview_flutter/include
  995.  
  996. -I/Users/anwar/Library/Developer/Xcode/DerivedData/Runner-gxcmiqgnvesnbyfwaqpbecsxyzjk/Build/Intermediates.noindex/Pods.build/Debug-iphonesimulator/webview_flutter.bu
  997.                   ild/DerivedSources-normal/x86_64
  998.  
  999. -I/Users/anwar/Library/Developer/Xcode/DerivedData/Runner-gxcmiqgnvesnbyfwaqpbecsxyzjk/Build/Intermediates.noindex/Pods.build/Debug-iphonesimulator/webview_flutter.bu
  1000.                   ild/DerivedSources/x86_64
  1001.  
  1002. -I/Users/anwar/Library/Developer/Xcode/DerivedData/Runner-gxcmiqgnvesnbyfwaqpbecsxyzjk/Build/Intermediates.noindex/Pods.build/Debug-iphonesimulator/webview_flutter.bu
  1003.                   ild/DerivedSources -F/Users/anwar/Documents/lingotalk/mobile/build/ios/Debug-iphonesimulator/webview_flutter -include
  1004.                   /Users/anwar/Documents/lingotalk/mobile/ios/Pods/Target\ Support\ Files/webview_flutter/webview_flutter-prefix.pch -MMD -MT dependencies -MF
  1005.  
  1006. /Users/anwar/Library/Developer/Xcode/DerivedData/Runner-gxcmiqgnvesnbyfwaqpbecsxyzjk/Build/Intermediates.noindex/Pods.build/Debug-iphonesimulator/webview_flutter.buil
  1007.                   d/Objects-normal/x86_64/FlutterWebView.d --serialize-diagnostics
  1008.  
  1009. /Users/anwar/Library/Developer/Xcode/DerivedData/Runner-gxcmiqgnvesnbyfwaqpbecsxyzjk/Build/Intermediates.noindex/Pods.build/Debug-iphonesimulator/webview_flutter.buil
  1010.                   d/Objects-normal/x86_64/FlutterWebView.dia -c /Users/anwar/flutter/.pub-cache/hosted/pub.dartlang.org/webview_flutter-2.0.4/ios/Classes/FlutterWebView.m -o
  1011.  
  1012. /Users/anwar/Library/Developer/Xcode/DerivedData/Runner-gxcmiqgnvesnbyfwaqpbecsxyzjk/Build/Intermediates.noindex/Pods.build/Debug-iphonesimulator/webview_flutter.buil
  1013.                   d/Objects-normal/x86_64/FlutterWebView.o
  1014.               In file included from /Users/anwar/flutter/.pub-cache/hosted/pub.dartlang.org/webview_flutter-2.0.4/ios/Classes/FlutterWebView.m:5:
  1015.               /Users/anwar/flutter/.pub-cache/hosted/pub.dartlang.org/webview_flutter-2.0.4/ios/Classes/FlutterWebView.h:5:9: fatal error: 'Flutter/Flutter.h' file not found
  1016.               #import <Flutter/Flutter.h>
  1017.                       ^~~~~~~~~~~~~~~~~~~
  1018.               1 error generated.
  1019.          
  1020.               CompileC
  1021.  
  1022. /Users/anwar/Library/Developer/Xcode/DerivedData/Runner-gxcmiqgnvesnbyfwaqpbecsxyzjk/Build/Intermediates.noindex/Pods.build/Debug-iphonesimulator/webview_flutter.build/Ob
  1023.               jects-normal/x86_64/FLTWebViewFlutterPlugin.o
  1024. /Users/anwar/flutter/.pub-cache/hosted/pub.dartlang.org/webview_flutter-2.0.4/ios/Classes/FLTWebViewFlutterPlugin.m normal
  1025.               x86_64 objective-c com.apple.compilers.llvm.clang.1_0.compiler (in target 'webview_flutter' from project 'Pods')
  1026.                   cd /Users/anwar/Documents/lingotalk/mobile/ios/Pods
  1027.                   export LANG\=en_US.US-ASCII
  1028.                   /Applications/Xcode.app/Contents/Developer/Toolchains/XcodeDefault.xctoolchain/usr/bin/clang -x objective-c -target x86_64-apple-ios11.0-simulator
  1029. -fmessage-length\=0
  1030.                   -fdiagnostics-show-note-include-stack -fmacro-backtrace-limit\=0 -std\=gnu11 -fobjc-arc -fobjc-weak -fmodules -gmodules
  1031.                   -fmodules-cache-path\=/Users/anwar/Library/Developer/Xcode/DerivedData/ModuleCache.noindex -fmodules-prune-interval\=86400 -fmodules-prune-after\=345600
  1032.                   -fbuild-session-file\=/Users/anwar/Library/Developer/Xcode/DerivedData/ModuleCache.noindex/Session.modulevalidation
  1033. -fmodules-validate-once-per-build-session
  1034.                   -Wnon-modular-include-in-framework-module -Werror\=non-modular-include-in-framework-module -fmodule-name\=webview_flutter -Wno-trigraphs -fpascal-strings
  1035. -O0
  1036.                   -fno-common -Wno-missing-field-initializers -Wno-missing-prototypes -Werror\=return-type -Wdocumentation -Wunreachable-code -Wno-implicit-atomic-properties
  1037.                   -Werror\=deprecated-objc-isa-usage -Wno-objc-interface-ivars -Werror\=objc-root-class -Wno-arc-repeated-use-of-weak -Wimplicit-retain-self
  1038. -Wduplicate-method-match
  1039.                   -Wno-missing-braces -Wparentheses -Wswitch -Wunused-function -Wno-unused-label -Wno-unused-parameter -Wunused-variable -Wunused-value -Wempty-body
  1040. -Wuninitialized
  1041.                   -Wconditional-uninitialized -Wno-unknown-pragmas -Wno-shadow -Wno-four-char-constants -Wno-conversion -Wconstant-conversion -Wint-conversion
  1042. -Wbool-conversion
  1043.                   -Wenum-conversion -Wno-float-conversion -Wnon-literal-null-conversion -Wobjc-literal-conversion -Wshorten-64-to-32 -Wpointer-sign -Wno-newline-eof
  1044. -Wno-selector
  1045.                   -Wno-strict-selector-match -Wundeclared-selector -Wdeprecated-implementations -DPOD_CONFIGURATION_DEBUG\=1 -DDEBUG\=1 -DCOCOAPODS\=1
  1046. -DOBJC_OLD_DISPATCH_PROTOTYPES\=0
  1047.                   -isysroot /Applications/Xcode.app/Contents/Developer/Platforms/iPhoneSimulator.platform/Developer/SDKs/iPhoneSimulator14.4.sdk -fasm-blocks
  1048. -fstrict-aliasing
  1049.                   -Wprotocol -Wdeprecated-declarations -g -Wno-sign-conversion -Winfinite-recursion -Wcomma -Wblock-capture-autoreleasing -Wstrict-prototypes
  1050.                   -Wno-semicolon-before-method-body -Wunguarded-availability -fobjc-abi-version\=2 -fobjc-legacy-dispatch -iquote
  1051.  
  1052. /Users/anwar/Library/Developer/Xcode/DerivedData/Runner-gxcmiqgnvesnbyfwaqpbecsxyzjk/Build/Intermediates.noindex/Pods.build/Debug-iphonesimulator/webview_flutter.buil
  1053.                   d/webview_flutter-generated-files.hmap
  1054.  
  1055. -I/Users/anwar/Library/Developer/Xcode/DerivedData/Runner-gxcmiqgnvesnbyfwaqpbecsxyzjk/Build/Intermediates.noindex/Pods.build/Debug-iphonesimulator/webview_flutter.bu
  1056.                   ild/webview_flutter-own-target-headers.hmap
  1057.  
  1058. -I/Users/anwar/Library/Developer/Xcode/DerivedData/Runner-gxcmiqgnvesnbyfwaqpbecsxyzjk/Build/Intermediates.noindex/Pods.build/Debug-iphonesimulator/webview_flutter.bu
  1059.                   ild/webview_flutter-all-non-framework-target-headers.hmap -ivfsoverlay
  1060.  
  1061. /Users/anwar/Library/Developer/Xcode/DerivedData/Runner-gxcmiqgnvesnbyfwaqpbecsxyzjk/Build/Intermediates.noindex/Pods.build/Debug-iphonesimulator/webview_flutter.buil
  1062.                   d/all-product-headers.yaml -iquote
  1063.  
  1064. /Users/anwar/Library/Developer/Xcode/DerivedData/Runner-gxcmiqgnvesnbyfwaqpbecsxyzjk/Build/Intermediates.noindex/Pods.build/Debug-iphonesimulator/webview_flutter.buil
  1065.                   d/webview_flutter-project-headers.hmap -I/Users/anwar/Documents/lingotalk/mobile/build/ios/Debug-iphonesimulator/webview_flutter/include
  1066.  
  1067. -I/Users/anwar/Library/Developer/Xcode/DerivedData/Runner-gxcmiqgnvesnbyfwaqpbecsxyzjk/Build/Intermediates.noindex/Pods.build/Debug-iphonesimulator/webview_flutter.bu
  1068.                   ild/DerivedSources-normal/x86_64
  1069.  
  1070. -I/Users/anwar/Library/Developer/Xcode/DerivedData/Runner-gxcmiqgnvesnbyfwaqpbecsxyzjk/Build/Intermediates.noindex/Pods.build/Debug-iphonesimulator/webview_flutter.bu
  1071.                   ild/DerivedSources/x86_64
  1072.  
  1073. -I/Users/anwar/Library/Developer/Xcode/DerivedData/Runner-gxcmiqgnvesnbyfwaqpbecsxyzjk/Build/Intermediates.noindex/Pods.build/Debug-iphonesimulator/webview_flutter.bu
  1074.                   ild/DerivedSources -F/Users/anwar/Documents/lingotalk/mobile/build/ios/Debug-iphonesimulator/webview_flutter -include
  1075.                   /Users/anwar/Documents/lingotalk/mobile/ios/Pods/Target\ Support\ Files/webview_flutter/webview_flutter-prefix.pch -MMD -MT dependencies -MF
  1076.  
  1077. /Users/anwar/Library/Developer/Xcode/DerivedData/Runner-gxcmiqgnvesnbyfwaqpbecsxyzjk/Build/Intermediates.noindex/Pods.build/Debug-iphonesimulator/webview_flutter.buil
  1078.                   d/Objects-normal/x86_64/FLTWebViewFlutterPlugin.d --serialize-diagnostics
  1079.  
  1080. /Users/anwar/Library/Developer/Xcode/DerivedData/Runner-gxcmiqgnvesnbyfwaqpbecsxyzjk/Build/Intermediates.noindex/Pods.build/Debug-iphonesimulator/webview_flutter.buil
  1081.                   d/Objects-normal/x86_64/FLTWebViewFlutterPlugin.dia -c
  1082.                   /Users/anwar/flutter/.pub-cache/hosted/pub.dartlang.org/webview_flutter-2.0.4/ios/Classes/FLTWebViewFlutterPlugin.m -o
  1083.  
  1084. /Users/anwar/Library/Developer/Xcode/DerivedData/Runner-gxcmiqgnvesnbyfwaqpbecsxyzjk/Build/Intermediates.noindex/Pods.build/Debug-iphonesimulator/webview_flutter.buil
  1085.                   d/Objects-normal/x86_64/FLTWebViewFlutterPlugin.o
  1086.               In file included from /Users/anwar/flutter/.pub-cache/hosted/pub.dartlang.org/webview_flutter-2.0.4/ios/Classes/FLTWebViewFlutterPlugin.m:5:
  1087.               /Users/anwar/flutter/.pub-cache/hosted/pub.dartlang.org/webview_flutter-2.0.4/ios/Classes/FLTWebViewFlutterPlugin.h:5:9: fatal error: 'Flutter/Flutter.h' file
  1088. not found
  1089.               #import <Flutter/Flutter.h>
  1090.                       ^~~~~~~~~~~~~~~~~~~
  1091.               1 error generated.
  1092.          
  1093.          
  1094. [  +27 ms] Could not build the application for the simulator.
  1095. [   +2 ms] Error launching application on iPhone 8.
  1096. [   +6 ms] "flutter run" took 28,101ms.
  1097. [  +10 ms]
  1098.           #0      throwToolExit (package:flutter_tools/src/base/common.dart:10:3)
  1099.           #1      RunCommand.runCommand (package:flutter_tools/src/commands/run.dart:644:9)
  1100.           <asynchronous suspension>
  1101.           #2      FlutterCommand.verifyThenRunCommand (package:flutter_tools/src/runner/flutter_command.dart:1157:12)
  1102.           <asynchronous suspension>
  1103.           #3      FlutterCommand.run.<anonymous closure> (package:flutter_tools/src/runner/flutter_command.dart:1009:27)
  1104.  
RAW Paste Data