Not a member of Pastebin yet?
Sign Up,
it unlocks many cool features!
- python setup.py build
- running build
- running build_py
- [...]
- building 'jcc' extension
- error: None
- python setup.py install
- running install
- [...]
- copying jccconfig.py -> buildlib.win32-2.6jcc
- copying jccclassesorgosafoundationjccPythonException.class -> buildlib.win32-2.6jccclassesorgosafoundationjcc
- running build_ext
- building 'jcc' extension
- error: None
- make
- /cygdrive/f/Python26//python.exe -m jcc --shared --jar lucene-java-2.4.0/build/lucene-core-2.4.0.jar
- [...]
- 'doc:(I)Lorg/apache/lucene/document/Document;' --version 2.4.0 --files 2 --build
- f:Python26python.exe: No module named jcc
- make: *** [compile] Error 1
- make
- [...]
- f:Python26python.exe: jcc is a package and cannot be directly executed
- make: *** [compile] Error 1
- $ make /cygdrive/f/Python26//python.exe -m jcc.__main__ --shared --jar lucene-java-2.4. 0/build/lucene-core-2.4.0.jar
- [...]
- --version 2.4.0 --files 2 --build
- f:Python26python.exe: No module named _jcc
- make: *** [compile] Error 1
Add Comment
Please, Sign In to add comment