SHARE
TWEET

Untitled

a guest Jul 17th, 2017 52 Never
Not a member of Pastebin yet? Sign Up, it unlocks many cool features!
  1. -------------------------------------------------------------------------------
  2. Test set: org.openmrs.hl7.HL7ServiceTest
  3. -------------------------------------------------------------------------------
  4. Tests run: 23, Failures: 1, Errors: 0, Skipped: 0, Time elapsed: 4.849 sec <<< FAILURE!
  5. resolvePersonFromIdentifiers_shouldFindAPersonBasedOnAPatientIdentifier(org.openmrs.hl7.HL7ServiceTest)  Time elapsed: 0.216 sec  <<< FAILURE!
  6. java.lang.AssertionError: should have found a person
  7.     at org.junit.Assert.fail(Assert.java:91)
  8.     at org.junit.Assert.assertTrue(Assert.java:43)
  9.     at org.junit.Assert.assertNotNull(Assert.java:524)
  10.     at org.openmrs.hl7.HL7ServiceTest.resolvePersonFromIdentifiers_shouldFindAPersonBasedOnAPatientIdentifier(HL7ServiceTest.java:291)
  11.     at sun.reflect.NativeMethodAccessorImpl.invoke0(Native Method)
  12.     at sun.reflect.NativeMethodAccessorImpl.invoke(NativeMethodAccessorImpl.java:39)
  13.     at sun.reflect.DelegatingMethodAccessorImpl.invoke(DelegatingMethodAccessorImpl.java:25)
  14.     at java.lang.reflect.Method.invoke(Method.java:597)
  15.     at org.junit.runners.model.FrameworkMethod$1.runReflectiveCall(FrameworkMethod.java:44)
  16.     at org.junit.internal.runners.model.ReflectiveCallable.run(ReflectiveCallable.java:15)
  17.     at org.junit.runners.model.FrameworkMethod.invokeExplosively(FrameworkMethod.java:41)
  18.     at org.junit.internal.runners.statements.InvokeMethod.evaluate(InvokeMethod.java:20)
  19.     at org.junit.internal.runners.statements.RunBefores.evaluate(RunBefores.java:28)
  20.     at org.springframework.test.context.junit4.statements.RunBeforeTestMethodCallbacks.evaluate(RunBeforeTestMethodCallbacks.java:74)
  21.     at org.junit.internal.runners.statements.RunAfters.evaluate(RunAfters.java:31)
  22.     at org.springframework.test.context.junit4.statements.RunAfterTestMethodCallbacks.evaluate(RunAfterTestMethodCallbacks.java:82)
  23.     at org.springframework.test.context.junit4.statements.SpringRepeat.evaluate(SpringRepeat.java:72)
  24.     at org.springframework.test.context.junit4.SpringJUnit4ClassRunner.runChild(SpringJUnit4ClassRunner.java:240)
  25.     at org.junit.runners.BlockJUnit4ClassRunner.runChild(BlockJUnit4ClassRunner.java:50)
  26.     at org.junit.runners.ParentRunner$3.run(ParentRunner.java:193)
  27.     at org.junit.runners.ParentRunner$1.schedule(ParentRunner.java:52)
  28.     at org.junit.runners.ParentRunner.runChildren(ParentRunner.java:191)
  29.     at org.junit.runners.ParentRunner.access$000(ParentRunner.java:42)
  30.     at org.junit.runners.ParentRunner$2.evaluate(ParentRunner.java:184)
  31.     at org.springframework.test.context.junit4.statements.RunBeforeTestClassCallbacks.evaluate(RunBeforeTestClassCallbacks.java:61)
  32.     at org.junit.internal.runners.statements.RunAfters.evaluate(RunAfters.java:31)
  33.     at org.springframework.test.context.junit4.statements.RunAfterTestClassCallbacks.evaluate(RunAfterTestClassCallbacks.java:70)
  34.     at org.junit.runners.ParentRunner.run(ParentRunner.java:236)
  35.     at org.springframework.test.context.junit4.SpringJUnit4ClassRunner.run(SpringJUnit4ClassRunner.java:180)
  36.     at org.apache.maven.surefire.junit4.JUnit4TestSet.execute(JUnit4TestSet.java:62)
  37.     at org.apache.maven.surefire.suite.AbstractDirectoryTestSuite.executeTestSet(AbstractDirectoryTestSuite.java:140)
  38.     at org.apache.maven.surefire.suite.AbstractDirectoryTestSuite.execute(AbstractDirectoryTestSuite.java:127)
  39.     at org.apache.maven.surefire.Surefire.run(Surefire.java:177)
  40.     at sun.reflect.NativeMethodAccessorImpl.invoke0(Native Method)
  41.     at sun.reflect.NativeMethodAccessorImpl.invoke(NativeMethodAccessorImpl.java:39)
  42.     at sun.reflect.DelegatingMethodAccessorImpl.invoke(DelegatingMethodAccessorImpl.java:25)
  43.     at java.lang.reflect.Method.invoke(Method.java:597)
  44.     at org.apache.maven.surefire.booter.SurefireBooter.runSuitesInProcess(SurefireBooter.java:345)
  45.     at org.apache.maven.surefire.booter.SurefireBooter.main(SurefireBooter.java:1009)
RAW Paste Data
Pastebin PRO Summer Special!
Get 60% OFF on Pastebin PRO accounts!
Top