daily pastebin goal
51%
SHARE
TWEET

Untitled

a guest Apr 2nd, 2016 53 Never
Not a member of Pastebin yet? Sign Up, it unlocks many cool features!
  1. -------------------------------------------------------------------------------
  2. Test set: org.languagetool.commandline.MainTest
  3. -------------------------------------------------------------------------------
  4. Tests run: 41, Failures: 0, Errors: 2, Skipped: 0, Time elapsed: 6.375 sec <<< FAILURE! - in org.languagetool.commandline.MainTest
  5. testEnglishFileAutoDetect(org.languagetool.commandline.MainTest)  Time elapsed: 0.087 sec  <<< ERROR!
  6. java.lang.RuntimeException: Could not set up language identifier
  7.     at org.languagetool.language.LanguageIdentifier.<init>(LanguageIdentifier.java:71)
  8.     at org.languagetool.commandline.Main.detectLanguageOfString(Main.java:480)
  9.     at org.languagetool.commandline.Main.runOnFile(Main.java:166)
  10.     at org.languagetool.commandline.Main.main(Main.java:462)
  11.     at org.languagetool.commandline.MainTest.testEnglishFileAutoDetect(MainTest.java:179)
  12.     at sun.reflect.NativeMethodAccessorImpl.invoke0(Native Method)
  13.     at sun.reflect.NativeMethodAccessorImpl.invoke(NativeMethodAccessorImpl.java:62)
  14.     at sun.reflect.DelegatingMethodAccessorImpl.invoke(DelegatingMethodAccessorImpl.java:43)
  15.     at java.lang.reflect.Method.invoke(Method.java:497)
  16.     at junit.framework.TestCase.runTest(TestCase.java:176)
  17.     at junit.framework.TestCase.runBare(TestCase.java:141)
  18.     at junit.framework.TestResult$1.protect(TestResult.java:122)
  19.     at junit.framework.TestResult.runProtected(TestResult.java:142)
  20.     at junit.framework.TestResult.run(TestResult.java:125)
  21.     at junit.framework.TestCase.run(TestCase.java:129)
  22.     at junit.framework.TestSuite.runTest(TestSuite.java:252)
  23.     at junit.framework.TestSuite.run(TestSuite.java:247)
  24.     at org.junit.internal.runners.JUnit38ClassRunner.run(JUnit38ClassRunner.java:86)
  25.     at org.apache.maven.surefire.junit4.JUnit4Provider.execute(JUnit4Provider.java:367)
  26.     at org.apache.maven.surefire.junit4.JUnit4Provider.executeWithRerun(JUnit4Provider.java:274)
  27.     at org.apache.maven.surefire.junit4.JUnit4Provider.executeTestSet(JUnit4Provider.java:238)
  28.     at org.apache.maven.surefire.junit4.JUnit4Provider.invoke(JUnit4Provider.java:161)
  29.     at org.apache.maven.surefire.booter.ForkedBooter.invokeProviderInSameClassLoader(ForkedBooter.java:290)
  30.     at org.apache.maven.surefire.booter.ForkedBooter.runSuitesInProcess(ForkedBooter.java:242)
  31.     at org.apache.maven.surefire.booter.ForkedBooter.main(ForkedBooter.java:121)
  32. Caused by: java.io.IOException: No language file available named nb at languages/nb!
  33.     at com.optimaize.langdetect.profiles.LanguageProfileReader.read(LanguageProfileReader.java:53)
  34.     at com.optimaize.langdetect.profiles.LanguageProfileReader.read(LanguageProfileReader.java:78)
  35.     at org.languagetool.language.LanguageIdentifier.loadProfiles(LanguageIdentifier.java:95)
  36.     at org.languagetool.language.LanguageIdentifier.<init>(LanguageIdentifier.java:64)
  37.     ... 24 more
  38.  
  39. testEnglishStdInAutoDetect(org.languagetool.commandline.MainTest)  Time elapsed: 0.057 sec  <<< ERROR!
  40. java.lang.RuntimeException: Could not set up language identifier
  41.     at org.languagetool.language.LanguageIdentifier.<init>(LanguageIdentifier.java:71)
  42.     at org.languagetool.commandline.Main.detectLanguageOfString(Main.java:480)
  43.     at org.languagetool.commandline.Main.runOnFile(Main.java:166)
  44.     at org.languagetool.commandline.Main.main(Main.java:462)
  45.     at org.languagetool.commandline.MainTest.testEnglishStdInAutoDetect(MainTest.java:192)
  46.     at sun.reflect.NativeMethodAccessorImpl.invoke0(Native Method)
  47.     at sun.reflect.NativeMethodAccessorImpl.invoke(NativeMethodAccessorImpl.java:62)
  48.     at sun.reflect.DelegatingMethodAccessorImpl.invoke(DelegatingMethodAccessorImpl.java:43)
  49.     at java.lang.reflect.Method.invoke(Method.java:497)
  50.     at junit.framework.TestCase.runTest(TestCase.java:176)
  51.     at junit.framework.TestCase.runBare(TestCase.java:141)
  52.     at junit.framework.TestResult$1.protect(TestResult.java:122)
  53.     at junit.framework.TestResult.runProtected(TestResult.java:142)
  54.     at junit.framework.TestResult.run(TestResult.java:125)
  55.     at junit.framework.TestCase.run(TestCase.java:129)
  56.     at junit.framework.TestSuite.runTest(TestSuite.java:252)
  57.     at junit.framework.TestSuite.run(TestSuite.java:247)
  58.     at org.junit.internal.runners.JUnit38ClassRunner.run(JUnit38ClassRunner.java:86)
  59.     at org.apache.maven.surefire.junit4.JUnit4Provider.execute(JUnit4Provider.java:367)
  60.     at org.apache.maven.surefire.junit4.JUnit4Provider.executeWithRerun(JUnit4Provider.java:274)
  61.     at org.apache.maven.surefire.junit4.JUnit4Provider.executeTestSet(JUnit4Provider.java:238)
  62.     at org.apache.maven.surefire.junit4.JUnit4Provider.invoke(JUnit4Provider.java:161)
  63.     at org.apache.maven.surefire.booter.ForkedBooter.invokeProviderInSameClassLoader(ForkedBooter.java:290)
  64.     at org.apache.maven.surefire.booter.ForkedBooter.runSuitesInProcess(ForkedBooter.java:242)
  65.     at org.apache.maven.surefire.booter.ForkedBooter.main(ForkedBooter.java:121)
  66. Caused by: java.io.IOException: No language file available named nb at languages/nb!
  67.     at com.optimaize.langdetect.profiles.LanguageProfileReader.read(LanguageProfileReader.java:53)
  68.     at com.optimaize.langdetect.profiles.LanguageProfileReader.read(LanguageProfileReader.java:78)
  69.     at org.languagetool.language.LanguageIdentifier.loadProfiles(LanguageIdentifier.java:95)
  70.     at org.languagetool.language.LanguageIdentifier.<init>(LanguageIdentifier.java:64)
  71.     ... 24 more
RAW Paste Data
We use cookies for various purposes including analytics. By continuing to use Pastebin, you agree to our use of cookies as described in the Cookies Policy. OK, I Understand
 
Top