Advertisement
Guest User

Untitled

a guest
Jun 4th, 2013
108
0
Never
Not a member of Pastebin yet? Sign Up, it unlocks many cool features!
text 27.81 KB | None | 0 0
  1. Making all in hello.cxx
  2. make[3]: Entering directory `/root/lttng-ust/tests/hello.cxx'
  3. CXX hello.o
  4. CXX tp.o
  5. In file included from ../../include/lttng/ust-tracepoint-event.h:206:0,
  6. from ../../include/lttng/tracepoint-event.h:62,
  7. from ust_tests_hello.h:64,
  8. from tp.cpp:26:
  9. ././ust_tests_hello.h:31:1: error: expected primary-expression before '.' token
  10. ././ust_tests_hello.h:31:1: error: expected primary-expression before '.' token
  11. ././ust_tests_hello.h:31:1: error: expected primary-expression before '.' token
  12. ././ust_tests_hello.h:31:1: error: expected primary-expression before '.' token
  13. ././ust_tests_hello.h:31:1: error: expected primary-expression before '.' token
  14. ././ust_tests_hello.h:31:1: error: expected primary-expression before '.' token
  15. ././ust_tests_hello.h:31:1: error: expected primary-expression before '.' token
  16. ././ust_tests_hello.h:31:1: error: expected primary-expression before '.' token
  17. ././ust_tests_hello.h:31:1: error: expected primary-expression before '.' token
  18. ././ust_tests_hello.h:31:1: error: expected primary-expression before '.' token
  19. ././ust_tests_hello.h:31:1: error: expected primary-expression before '.' token
  20. ././ust_tests_hello.h:31:1: error: expected primary-expression before '.' token
  21. ././ust_tests_hello.h:31:1: warning: extended initializer lists only available with -std=c++0x or -std=gnu++0x [enabled by default]
  22. ././ust_tests_hello.h:31:1: warning: extended initializer lists only available with -std=c++0x or -std=gnu++0x [enabled by default]
  23. ././ust_tests_hello.h:31:1: warning: extended initializer lists only available with -std=c++0x or -std=gnu++0x [enabled by default]
  24. ././ust_tests_hello.h:31:1: warning: extended initializer lists only available with -std=c++0x or -std=gnu++0x [enabled by default]
  25. ././ust_tests_hello.h:31:1: error: expected primary-expression before '.' token
  26. ././ust_tests_hello.h:31:1: error: expected primary-expression before '.' token
  27. ././ust_tests_hello.h:31:1: error: expected primary-expression before '.' token
  28. ././ust_tests_hello.h:31:1: error: expected primary-expression before '.' token
  29. ././ust_tests_hello.h:31:1: error: expected primary-expression before '.' token
  30. ././ust_tests_hello.h:31:1: error: expected primary-expression before '.' token
  31. ././ust_tests_hello.h:31:1: error: expected primary-expression before '.' token
  32. ././ust_tests_hello.h:31:1: error: expected primary-expression before '.' token
  33. ././ust_tests_hello.h:31:1: error: expected primary-expression before '.' token
  34. ././ust_tests_hello.h:31:1: error: expected primary-expression before '.' token
  35. ././ust_tests_hello.h:31:1: error: expected primary-expression before '.' token
  36. ././ust_tests_hello.h:31:1: error: expected primary-expression before '.' token
  37. ././ust_tests_hello.h:31:1: error: expected primary-expression before '.' token
  38. ././ust_tests_hello.h:31:1: warning: extended initializer lists only available with -std=c++0x or -std=gnu++0x [enabled by default]
  39. ././ust_tests_hello.h:31:1: warning: extended initializer lists only available with -std=c++0x or -std=gnu++0x [enabled by default]
  40. ././ust_tests_hello.h:31:1: warning: extended initializer lists only available with -std=c++0x or -std=gnu++0x [enabled by default]
  41. ././ust_tests_hello.h:31:1: warning: extended initializer lists only available with -std=c++0x or -std=gnu++0x [enabled by default]
  42. ././ust_tests_hello.h:31:1: error: expected primary-expression before '.' token
  43. ././ust_tests_hello.h:31:1: error: expected primary-expression before '.' token
  44. ././ust_tests_hello.h:31:1: error: expected primary-expression before '.' token
  45. ././ust_tests_hello.h:31:1: error: expected primary-expression before '.' token
  46. ././ust_tests_hello.h:31:1: error: expected primary-expression before '.' token
  47. ././ust_tests_hello.h:31:1: error: expected primary-expression before '.' token
  48. ././ust_tests_hello.h:31:1: error: expected primary-expression before '.' token
  49. ././ust_tests_hello.h:31:1: error: expected primary-expression before '.' token
  50. ././ust_tests_hello.h:31:1: error: expected primary-expression before '.' token
  51. ././ust_tests_hello.h:31:1: error: expected primary-expression before '.' token
  52. ././ust_tests_hello.h:31:1: error: expected primary-expression before '.' token
  53. ././ust_tests_hello.h:31:1: error: expected primary-expression before '.' token
  54. ././ust_tests_hello.h:31:1: error: expected primary-expression before '.' token
  55. ././ust_tests_hello.h:31:1: warning: extended initializer lists only available with -std=c++0x or -std=gnu++0x [enabled by default]
  56. ././ust_tests_hello.h:31:1: warning: extended initializer lists only available with -std=c++0x or -std=gnu++0x [enabled by default]
  57. ././ust_tests_hello.h:31:1: warning: extended initializer lists only available with -std=c++0x or -std=gnu++0x [enabled by default]
  58. ././ust_tests_hello.h:31:1: warning: extended initializer lists only available with -std=c++0x or -std=gnu++0x [enabled by default]
  59. ././ust_tests_hello.h:31:1: error: expected primary-expression before '.' token
  60. ././ust_tests_hello.h:31:1: error: expected primary-expression before '.' token
  61. ././ust_tests_hello.h:31:1: error: expected primary-expression before '.' token
  62. ././ust_tests_hello.h:31:1: error: expected primary-expression before '.' token
  63. ././ust_tests_hello.h:31:1: error: expected primary-expression before '.' token
  64. ././ust_tests_hello.h:31:1: error: expected primary-expression before '.' token
  65. ././ust_tests_hello.h:31:1: error: expected primary-expression before '.' token
  66. ././ust_tests_hello.h:31:1: error: expected primary-expression before '.' token
  67. ././ust_tests_hello.h:31:1: error: expected primary-expression before '.' token
  68. ././ust_tests_hello.h:31:1: error: expected primary-expression before '.' token
  69. ././ust_tests_hello.h:31:1: error: expected primary-expression before '.' token
  70. ././ust_tests_hello.h:31:1: error: expected primary-expression before '.' token
  71. ././ust_tests_hello.h:31:1: error: expected primary-expression before '.' token
  72. ././ust_tests_hello.h:31:1: warning: extended initializer lists only available with -std=c++0x or -std=gnu++0x [enabled by default]
  73. ././ust_tests_hello.h:31:1: warning: extended initializer lists only available with -std=c++0x or -std=gnu++0x [enabled by default]
  74. ././ust_tests_hello.h:31:1: warning: extended initializer lists only available with -std=c++0x or -std=gnu++0x [enabled by default]
  75. ././ust_tests_hello.h:31:1: warning: extended initializer lists only available with -std=c++0x or -std=gnu++0x [enabled by default]
  76. ././ust_tests_hello.h:31:1: error: expected primary-expression before '.' token
  77. ././ust_tests_hello.h:31:1: error: expected primary-expression before '.' token
  78. ././ust_tests_hello.h:31:1: error: expected primary-expression before '.' token
  79. ././ust_tests_hello.h:31:1: error: expected primary-expression before '.' token
  80. ././ust_tests_hello.h:31:1: error: expected primary-expression before '.' token
  81. ././ust_tests_hello.h:31:1: error: expected primary-expression before '.' token
  82. ././ust_tests_hello.h:31:1: error: expected primary-expression before '.' token
  83. ././ust_tests_hello.h:31:1: error: expected primary-expression before '.' token
  84. ././ust_tests_hello.h:31:1: error: expected primary-expression before '.' token
  85. ././ust_tests_hello.h:31:1: error: expected primary-expression before '.' token
  86. ././ust_tests_hello.h:31:1: error: expected primary-expression before '.' token
  87. ././ust_tests_hello.h:31:1: error: expected primary-expression before '.' token
  88. ././ust_tests_hello.h:31:1: error: expected primary-expression before '.' token
  89. ././ust_tests_hello.h:31:1: warning: extended initializer lists only available with -std=c++0x or -std=gnu++0x [enabled by default]
  90. ././ust_tests_hello.h:31:1: warning: extended initializer lists only available with -std=c++0x or -std=gnu++0x [enabled by default]
  91. ././ust_tests_hello.h:31:1: warning: extended initializer lists only available with -std=c++0x or -std=gnu++0x [enabled by default]
  92. ././ust_tests_hello.h:31:1: warning: extended initializer lists only available with -std=c++0x or -std=gnu++0x [enabled by default]
  93. ././ust_tests_hello.h:31:1: error: expected primary-expression before '.' token
  94. ././ust_tests_hello.h:31:1: error: expected primary-expression before '.' token
  95. ././ust_tests_hello.h:31:1: error: expected primary-expression before '.' token
  96. ././ust_tests_hello.h:31:1: error: expected primary-expression before '.' token
  97. ././ust_tests_hello.h:31:1: error: expected primary-expression before '.' token
  98. ././ust_tests_hello.h:31:1: error: expected primary-expression before '.' token
  99. ././ust_tests_hello.h:31:1: error: expected primary-expression before '.' token
  100. ././ust_tests_hello.h:31:1: error: expected primary-expression before '.' token
  101. ././ust_tests_hello.h:31:1: error: expected primary-expression before '.' token
  102. ././ust_tests_hello.h:31:1: error: expected primary-expression before '.' token
  103. ././ust_tests_hello.h:31:1: error: expected primary-expression before '.' token
  104. ././ust_tests_hello.h:31:1: error: expected primary-expression before '.' token
  105. ././ust_tests_hello.h:31:1: error: expected primary-expression before '.' token
  106. ././ust_tests_hello.h:31:1: error: expected primary-expression before '.' token
  107. ././ust_tests_hello.h:31:1: error: expected primary-expression before '.' token
  108. ././ust_tests_hello.h:31:1: error: expected primary-expression before '.' token
  109. ././ust_tests_hello.h:31:1: error: expected primary-expression before '.' token
  110. ././ust_tests_hello.h:31:1: warning: extended initializer lists only available with -std=c++0x or -std=gnu++0x [enabled by default]
  111. ././ust_tests_hello.h:31:1: warning: extended initializer lists only available with -std=c++0x or -std=gnu++0x [enabled by default]
  112. ././ust_tests_hello.h:31:1: warning: extended initializer lists only available with -std=c++0x or -std=gnu++0x [enabled by default]
  113. ././ust_tests_hello.h:31:1: warning: extended initializer lists only available with -std=c++0x or -std=gnu++0x [enabled by default]
  114. ././ust_tests_hello.h:31:1: error: expected primary-expression before '.' token
  115. ././ust_tests_hello.h:31:1: warning: extended initializer lists only available with -std=c++0x or -std=gnu++0x [enabled by default]
  116. ././ust_tests_hello.h:31:1: warning: extended initializer lists only available with -std=c++0x or -std=gnu++0x [enabled by default]
  117. ././ust_tests_hello.h:31:1: warning: extended initializer lists only available with -std=c++0x or -std=gnu++0x [enabled by default]
  118. ././ust_tests_hello.h:31:1: error: expected primary-expression before '.' token
  119. ././ust_tests_hello.h:31:1: error: expected primary-expression before '.' token
  120. ././ust_tests_hello.h:31:1: error: expected primary-expression before '.' token
  121. ././ust_tests_hello.h:31:1: error: expected primary-expression before '.' token
  122. ././ust_tests_hello.h:31:1: error: expected primary-expression before '.' token
  123. ././ust_tests_hello.h:31:1: error: expected primary-expression before '.' token
  124. ././ust_tests_hello.h:31:1: error: expected primary-expression before '.' token
  125. ././ust_tests_hello.h:31:1: error: expected primary-expression before '.' token
  126. ././ust_tests_hello.h:31:1: error: expected primary-expression before '.' token
  127. ././ust_tests_hello.h:31:1: error: expected primary-expression before '.' token
  128. ././ust_tests_hello.h:31:1: error: expected primary-expression before '.' token
  129. ././ust_tests_hello.h:31:1: error: expected primary-expression before '.' token
  130. ././ust_tests_hello.h:31:1: error: expected primary-expression before '.' token
  131. ././ust_tests_hello.h:31:1: error: expected primary-expression before '.' token
  132. ././ust_tests_hello.h:31:1: error: expected primary-expression before '.' token
  133. ././ust_tests_hello.h:31:1: error: expected primary-expression before '.' token
  134. ././ust_tests_hello.h:31:1: error: expected primary-expression before '.' token
  135. ././ust_tests_hello.h:31:1: warning: extended initializer lists only available with -std=c++0x or -std=gnu++0x [enabled by default]
  136. ././ust_tests_hello.h:31:1: warning: extended initializer lists only available with -std=c++0x or -std=gnu++0x [enabled by default]
  137. ././ust_tests_hello.h:31:1: warning: extended initializer lists only available with -std=c++0x or -std=gnu++0x [enabled by default]
  138. ././ust_tests_hello.h:31:1: warning: extended initializer lists only available with -std=c++0x or -std=gnu++0x [enabled by default]
  139. ././ust_tests_hello.h:31:1: error: expected primary-expression before '.' token
  140. ././ust_tests_hello.h:31:1: warning: extended initializer lists only available with -std=c++0x or -std=gnu++0x [enabled by default]
  141. ././ust_tests_hello.h:31:1: warning: extended initializer lists only available with -std=c++0x or -std=gnu++0x [enabled by default]
  142. ././ust_tests_hello.h:31:1: warning: extended initializer lists only available with -std=c++0x or -std=gnu++0x [enabled by default]
  143. ././ust_tests_hello.h:31:1: error: expected primary-expression before '.' token
  144. ././ust_tests_hello.h:31:1: error: expected primary-expression before '.' token
  145. ././ust_tests_hello.h:31:1: error: expected primary-expression before '.' token
  146. ././ust_tests_hello.h:31:1: error: expected primary-expression before '.' token
  147. ././ust_tests_hello.h:31:1: error: expected primary-expression before '.' token
  148. ././ust_tests_hello.h:31:1: error: expected primary-expression before '.' token
  149. ././ust_tests_hello.h:31:1: error: expected primary-expression before '.' token
  150. ././ust_tests_hello.h:31:1: error: expected primary-expression before '.' token
  151. ././ust_tests_hello.h:31:1: error: expected primary-expression before '.' token
  152. ././ust_tests_hello.h:31:1: error: expected primary-expression before '.' token
  153. ././ust_tests_hello.h:31:1: error: expected primary-expression before '.' token
  154. ././ust_tests_hello.h:31:1: error: expected primary-expression before '.' token
  155. ././ust_tests_hello.h:31:1: error: expected primary-expression before '.' token
  156. ././ust_tests_hello.h:31:1: error: expected primary-expression before '.' token
  157. ././ust_tests_hello.h:31:1: error: expected primary-expression before '.' token
  158. ././ust_tests_hello.h:31:1: error: expected primary-expression before '.' token
  159. ././ust_tests_hello.h:31:1: error: expected primary-expression before '.' token
  160. ././ust_tests_hello.h:31:1: warning: extended initializer lists only available with -std=c++0x or -std=gnu++0x [enabled by default]
  161. ././ust_tests_hello.h:31:1: warning: extended initializer lists only available with -std=c++0x or -std=gnu++0x [enabled by default]
  162. ././ust_tests_hello.h:31:1: warning: extended initializer lists only available with -std=c++0x or -std=gnu++0x [enabled by default]
  163. ././ust_tests_hello.h:31:1: warning: extended initializer lists only available with -std=c++0x or -std=gnu++0x [enabled by default]
  164. ././ust_tests_hello.h:31:1: error: expected primary-expression before '.' token
  165. ././ust_tests_hello.h:31:1: error: expected primary-expression before '.' token
  166. ././ust_tests_hello.h:31:1: error: expected primary-expression before '.' token
  167. ././ust_tests_hello.h:31:1: error: expected primary-expression before '.' token
  168. ././ust_tests_hello.h:31:1: error: expected primary-expression before '.' token
  169. ././ust_tests_hello.h:31:1: error: expected primary-expression before '.' token
  170. ././ust_tests_hello.h:31:1: error: expected primary-expression before '.' token
  171. ././ust_tests_hello.h:31:1: error: expected primary-expression before '.' token
  172. ././ust_tests_hello.h:31:1: error: expected primary-expression before '.' token
  173. ././ust_tests_hello.h:31:1: error: expected primary-expression before '.' token
  174. ././ust_tests_hello.h:31:1: error: expected primary-expression before '.' token
  175. ././ust_tests_hello.h:31:1: warning: extended initializer lists only available with -std=c++0x or -std=gnu++0x [enabled by default]
  176. ././ust_tests_hello.h:31:1: warning: extended initializer lists only available with -std=c++0x or -std=gnu++0x [enabled by default]
  177. ././ust_tests_hello.h:31:1: warning: extended initializer lists only available with -std=c++0x or -std=gnu++0x [enabled by default]
  178. ././ust_tests_hello.h:31:1: warning: extended initializer lists only available with -std=c++0x or -std=gnu++0x [enabled by default]
  179. ././ust_tests_hello.h:31:1: warning: extended initializer lists only available with -std=c++0x or -std=gnu++0x [enabled by default]
  180. ././ust_tests_hello.h:31:1: warning: extended initializer lists only available with -std=c++0x or -std=gnu++0x [enabled by default]
  181. ././ust_tests_hello.h:31:1: warning: extended initializer lists only available with -std=c++0x or -std=gnu++0x [enabled by default]
  182. ././ust_tests_hello.h:31:1: error: expected primary-expression before '.' token
  183. ././ust_tests_hello.h:31:1: error: expected primary-expression before '.' token
  184. ././ust_tests_hello.h:31:1: error: expected primary-expression before '.' token
  185. ././ust_tests_hello.h:31:1: error: expected primary-expression before '.' token
  186. ././ust_tests_hello.h:31:1: error: expected primary-expression before '.' token
  187. ././ust_tests_hello.h:31:1: error: expected primary-expression before '.' token
  188. ././ust_tests_hello.h:31:1: error: expected primary-expression before '.' token
  189. ././ust_tests_hello.h:31:1: error: expected primary-expression before '.' token
  190. ././ust_tests_hello.h:31:1: error: expected primary-expression before '.' token
  191. ././ust_tests_hello.h:31:1: error: expected primary-expression before '.' token
  192. ././ust_tests_hello.h:31:1: error: expected primary-expression before '.' token
  193. ././ust_tests_hello.h:31:1: error: expected primary-expression before '.' token
  194. ././ust_tests_hello.h:31:1: error: expected primary-expression before '.' token
  195. ././ust_tests_hello.h:31:1: error: expected primary-expression before '.' token
  196. ././ust_tests_hello.h:31:1: error: expected primary-expression before '.' token
  197. ././ust_tests_hello.h:31:1: error: expected primary-expression before '.' token
  198. ././ust_tests_hello.h:31:1: error: expected primary-expression before '.' token
  199. ././ust_tests_hello.h:31:1: warning: extended initializer lists only available with -std=c++0x or -std=gnu++0x [enabled by default]
  200. ././ust_tests_hello.h:31:1: warning: extended initializer lists only available with -std=c++0x or -std=gnu++0x [enabled by default]
  201. ././ust_tests_hello.h:31:1: warning: extended initializer lists only available with -std=c++0x or -std=gnu++0x [enabled by default]
  202. ././ust_tests_hello.h:31:1: warning: extended initializer lists only available with -std=c++0x or -std=gnu++0x [enabled by default]
  203. ././ust_tests_hello.h:31:1: error: expected primary-expression before '.' token
  204. ././ust_tests_hello.h:31:1: error: expected primary-expression before '.' token
  205. ././ust_tests_hello.h:31:1: error: expected primary-expression before '.' token
  206. ././ust_tests_hello.h:31:1: error: expected primary-expression before '.' token
  207. ././ust_tests_hello.h:31:1: error: expected primary-expression before '.' token
  208. ././ust_tests_hello.h:31:1: error: expected primary-expression before '.' token
  209. ././ust_tests_hello.h:31:1: error: expected primary-expression before '.' token
  210. ././ust_tests_hello.h:31:1: error: expected primary-expression before '.' token
  211. ././ust_tests_hello.h:31:1: error: expected primary-expression before '.' token
  212. ././ust_tests_hello.h:31:1: error: expected primary-expression before '.' token
  213. ././ust_tests_hello.h:31:1: error: expected primary-expression before '.' token
  214. ././ust_tests_hello.h:31:1: warning: extended initializer lists only available with -std=c++0x or -std=gnu++0x [enabled by default]
  215. ././ust_tests_hello.h:31:1: warning: extended initializer lists only available with -std=c++0x or -std=gnu++0x [enabled by default]
  216. ././ust_tests_hello.h:31:1: warning: extended initializer lists only available with -std=c++0x or -std=gnu++0x [enabled by default]
  217. ././ust_tests_hello.h:31:1: warning: extended initializer lists only available with -std=c++0x or -std=gnu++0x [enabled by default]
  218. ././ust_tests_hello.h:31:1: warning: extended initializer lists only available with -std=c++0x or -std=gnu++0x [enabled by default]
  219. ././ust_tests_hello.h:31:1: warning: extended initializer lists only available with -std=c++0x or -std=gnu++0x [enabled by default]
  220. ././ust_tests_hello.h:31:1: warning: extended initializer lists only available with -std=c++0x or -std=gnu++0x [enabled by default]
  221. ././ust_tests_hello.h:31:1: error: expected primary-expression before '.' token
  222. ././ust_tests_hello.h:31:1: error: expected primary-expression before '.' token
  223. ././ust_tests_hello.h:31:1: error: expected primary-expression before '.' token
  224. ././ust_tests_hello.h:31:1: error: expected primary-expression before '.' token
  225. ././ust_tests_hello.h:31:1: error: expected primary-expression before '.' token
  226. ././ust_tests_hello.h:31:1: error: expected primary-expression before '.' token
  227. ././ust_tests_hello.h:31:1: error: expected primary-expression before '.' token
  228. ././ust_tests_hello.h:31:1: error: expected primary-expression before '.' token
  229. ././ust_tests_hello.h:31:1: warning: extended initializer lists only available with -std=c++0x or -std=gnu++0x [enabled by default]
  230. ././ust_tests_hello.h:31:1: warning: extended initializer lists only available with -std=c++0x or -std=gnu++0x [enabled by default]
  231. ././ust_tests_hello.h:31:1: warning: extended initializer lists only available with -std=c++0x or -std=gnu++0x [enabled by default]
  232. ././ust_tests_hello.h:31:1: warning: extended initializer lists only available with -std=c++0x or -std=gnu++0x [enabled by default]
  233. ././ust_tests_hello.h:31:1: error: expected primary-expression before '.' token
  234. ././ust_tests_hello.h:31:1: error: expected primary-expression before '.' token
  235. ././ust_tests_hello.h:31:1: error: expected primary-expression before '.' token
  236. ././ust_tests_hello.h:31:1: error: expected primary-expression before '.' token
  237. ././ust_tests_hello.h:31:1: error: expected primary-expression before '.' token
  238. ././ust_tests_hello.h:31:1: error: expected primary-expression before '.' token
  239. ././ust_tests_hello.h:31:1: error: expected primary-expression before '.' token
  240. ././ust_tests_hello.h:31:1: error: expected primary-expression before '.' token
  241. ././ust_tests_hello.h:31:1: error: expected primary-expression before '.' token
  242. ././ust_tests_hello.h:31:1: error: expected primary-expression before '.' token
  243. ././ust_tests_hello.h:31:1: error: expected primary-expression before '.' token
  244. ././ust_tests_hello.h:31:1: warning: extended initializer lists only available with -std=c++0x or -std=gnu++0x [enabled by default]
  245. ././ust_tests_hello.h:31:1: warning: extended initializer lists only available with -std=c++0x or -std=gnu++0x [enabled by default]
  246. ././ust_tests_hello.h:31:1: warning: extended initializer lists only available with -std=c++0x or -std=gnu++0x [enabled by default]
  247. ././ust_tests_hello.h:31:1: warning: extended initializer lists only available with -std=c++0x or -std=gnu++0x [enabled by default]
  248. ././ust_tests_hello.h:31:1: error: expected primary-expression before '.' token
  249. ././ust_tests_hello.h:31:1: error: expected primary-expression before '.' token
  250. ././ust_tests_hello.h:31:1: error: expected primary-expression before '.' token
  251. ././ust_tests_hello.h:31:1: error: expected primary-expression before '.' token
  252. ././ust_tests_hello.h:31:1: error: expected primary-expression before '.' token
  253. ././ust_tests_hello.h:31:1: error: expected primary-expression before '.' token
  254. ././ust_tests_hello.h:31:1: error: expected primary-expression before '.' token
  255. ././ust_tests_hello.h:31:1: error: expected primary-expression before '.' token
  256. ././ust_tests_hello.h:31:1: error: expected primary-expression before '.' token
  257. ././ust_tests_hello.h:31:1: error: expected primary-expression before '.' token
  258. ././ust_tests_hello.h:31:1: error: expected primary-expression before '.' token
  259. ././ust_tests_hello.h:31:1: warning: extended initializer lists only available with -std=c++0x or -std=gnu++0x [enabled by default]
  260. ././ust_tests_hello.h:31:1: warning: extended initializer lists only available with -std=c++0x or -std=gnu++0x [enabled by default]
  261. ././ust_tests_hello.h:31:1: warning: extended initializer lists only available with -std=c++0x or -std=gnu++0x [enabled by default]
  262. ././ust_tests_hello.h:31:1: warning: extended initializer lists only available with -std=c++0x or -std=gnu++0x [enabled by default]
  263. ././ust_tests_hello.h:31:1: error: expected primary-expression before '.' token
  264. In file included from ../../include/lttng/ust-tracepoint-event.h:634:0,
  265. from ../../include/lttng/tracepoint-event.h:62,
  266. from ust_tests_hello.h:64,
  267. from tp.cpp:26:
  268. ././ust_tests_hello.h:31:1: error: expected primary-expression before '.' token
  269. ././ust_tests_hello.h:31:1: error: expected primary-expression before '.' token
  270. ././ust_tests_hello.h:31:1: error: expected primary-expression before '.' token
  271. ././ust_tests_hello.h:31:1: error: expected primary-expression before '.' token
  272. ././ust_tests_hello.h:31:1: error: expected primary-expression before '.' token
  273. ././ust_tests_hello.h:31:1: error: expected primary-expression before '.' token
  274. ././ust_tests_hello.h:31:1: error: expected primary-expression before '.' token
  275. ././ust_tests_hello.h:31:1: error: expected primary-expression before '.' token
  276. ././ust_tests_hello.h:31:1: error: expected primary-expression before '.' token
  277. ././ust_tests_hello.h:31:1: error: expected primary-expression before '.' token
  278. ././ust_tests_hello.h:31:1: warning: extended initializer lists only available with -std=c++0x or -std=gnu++0x [enabled by default]
  279. ././ust_tests_hello.h:31:1: warning: extended initializer lists only available with -std=c++0x or -std=gnu++0x [enabled by default]
  280. ././ust_tests_hello.h:53:1: error: expected primary-expression before '.' token
  281. ././ust_tests_hello.h:53:1: error: expected primary-expression before '.' token
  282. ././ust_tests_hello.h:53:1: error: expected primary-expression before '.' token
  283. ././ust_tests_hello.h:53:1: error: expected primary-expression before '.' token
  284. ././ust_tests_hello.h:53:1: error: expected primary-expression before '.' token
  285. ././ust_tests_hello.h:53:1: error: expected primary-expression before '.' token
  286. ././ust_tests_hello.h:53:1: error: expected primary-expression before '.' token
  287. ././ust_tests_hello.h:53:1: error: expected primary-expression before '.' token
  288. ././ust_tests_hello.h:53:1: error: expected primary-expression before '.' token
  289. ././ust_tests_hello.h:53:1: error: expected primary-expression before '.' token
  290. ././ust_tests_hello.h:53:1: warning: extended initializer lists only available with -std=c++0x or -std=gnu++0x [enabled by default]
  291. ././ust_tests_hello.h:53:1: warning: extended initializer lists only available with -std=c++0x or -std=gnu++0x [enabled by default]
  292. In file included from ../../include/lttng/tracepoint-event.h:62:0,
  293. from ust_tests_hello.h:64,
  294. from tp.cpp:26:
  295. ../../include/lttng/ust-tracepoint-event.h:662:2: error: expected primary-expression before '.' token
  296. ../../include/lttng/ust-tracepoint-event.h:663:2: error: expected primary-expression before '.' token
  297. ../../include/lttng/ust-tracepoint-event.h:664:2: error: expected primary-expression before '.' token
  298. ../../include/lttng/ust-tracepoint-event.h:665:2: error: expected primary-expression before '.' token
  299. ../../include/lttng/ust-tracepoint-event.h:665:23: warning: extended initializer lists only available with -std=c++0x or -std=gnu++0x [enabled by default]
  300. ../../include/lttng/ust-tracepoint-event.h:666:2: error: expected primary-expression before '.' token
  301. ../../include/lttng/ust-tracepoint-event.h:666:33: warning: extended initializer lists only available with -std=c++0x or -std=gnu++0x [enabled by default]
  302. ../../include/lttng/ust-tracepoint-event.h:667:2: error: expected primary-expression before '.' token
  303. ../../include/lttng/ust-tracepoint-event.h:668:2: error: expected primary-expression before '.' token
  304. ../../include/lttng/ust-tracepoint-event.h:669:2: error: expected primary-expression before '.' token
  305. make[3]: *** [tp.o] Error 1
  306. make[3]: Leaving directory `/root/lttng-ust/tests/hello.cxx'
  307. make[2]: *** [all-recursive] Error 1
  308. make[2]: Leaving directory `/root/lttng-ust/tests'
  309. make[1]: *** [all-recursive] Error 1
  310. make[1]: Leaving directory `/root/lttng-ust'
  311. make: *** [all] Error 2
Advertisement
Add Comment
Please, Sign In to add comment
Advertisement