Advertisement
Guest User

Logs

a guest
Jun 10th, 2022
67
0
Never
Not a member of Pastebin yet? Sign Up, it unlocks many cool features!
text 7.00 KB | None | 0 0
  1. Date: Thu Jun 9 01:48:26 PM CDT 2022
  2. Test set: default
  3. Kernel: 5.18.3-200.fc36.x86_64
  4. Release: Fedora release 36 (Thirty Six)
  5. Result: WARN
  6. Failed Tests: None
  7. Warned Tests: ./thirdparty/nvidia-module
  8. ============================================================
  9. Starting test ./default/cachedrop
  10. 100+0 records in
  11. 100+0 records out
  12. 104857600 bytes (105 MB, 100 MiB) copied, 0.0247329 s, 4.2 GB/s
  13. 10+0 records in
  14. 10+0 records out
  15. 10485760 bytes (10 MB, 10 MiB) copied, 0.00428911 s, 2.4 GB/s
  16. TestPASS: /proc/sys/vm/drop_caches PASS
  17. Starting test ./default/insert_leap_second
  18. Setting time to speed up testing
  19. Running for 1 iterations. Press ctrl-c to stop
  20.  
  21. Setting time to Thu Jun 9 18:59:50 2022
  22. Scheduling leap second for Thu Jun 9 19:00:00 2022
  23. Thu Jun 9 18:59:57 2022 + 323 us (37) TIME_INS
  24. Thu Jun 9 18:59:57 2022 + 500675 us (37) TIME_INS
  25. Thu Jun 9 18:59:58 2022 + 1018 us (37) TIME_INS
  26. Thu Jun 9 18:59:58 2022 + 501357 us (37) TIME_INS
  27. Thu Jun 9 18:59:59 2022 + 1705 us (37) TIME_INS
  28. Thu Jun 9 18:59:59 2022 + 502046 us (37) TIME_INS
  29. Thu Jun 9 18:59:59 2022 + 2167 us (38) TIME_OOP
  30. Thu Jun 9 18:59:59 2022 + 502513 us (38) TIME_OOP
  31. Thu Jun 9 19:00:00 2022 + 2862 us (38) TIME_WAIT
  32. Thu Jun 9 19:00:00 2022 + 503172 us (38) TIME_WAIT
  33. Thu Jun 9 19:00:01 2022 + 3484 us (38) TIME_WAIT
  34. Thu Jun 9 19:00:01 2022 + 503795 us (38) TIME_WAIT
  35. Thu Jun 9 19:00:02 2022 + 4115 us (38) TIME_WAIT
  36. Leap complete
  37.  
  38. Starting test ./default/libhugetlbfs
  39. Starting test ./default/memfd
  40. memfd_test.c: In function ‘mfd_assert_get_seals’:
  41. memfd_test.c:67:13: warning: implicit declaration of function ‘fcntl’ [-Wimplicit-function-declaration]
  42. 67 | r = fcntl(fd, F_GET_SEALS);
  43. | ^~~~~
  44. memfd_test.c: In function ‘mfd_assert_open’:
  45. memfd_test.c:190:13: warning: implicit declaration of function ‘open’; did you mean ‘popen’? [-Wimplicit-function-declaration]
  46. 190 | r = open(buf, flags, mode);
  47. | ^~~~
  48. | popen
  49. memfd_test.c: In function ‘mfd_assert_write’:
  50. memfd_test.c:315:13: warning: implicit declaration of function ‘fallocate’; did you mean ‘alloca’? [-Wimplicit-function-declaration]
  51. 315 | r = fallocate(fd,
  52. | ^~~~~~~~~
  53. | alloca
  54. memfd: CREATE
  55. memfd: BASIC
  56. memfd: SEAL-WRITE
  57. memfd: SEAL-SHRINK
  58. memfd: SEAL-GROW
  59. memfd: SEAL-RESIZE
  60. memfd: SHARE-DUP
  61. memfd: SHARE-MMAP
  62. memfd: SHARE-OPEN
  63. memfd: SHARE-FORK
  64. memfd: SHARE-DUP (shared file-table)
  65. memfd: SHARE-MMAP (shared file-table)
  66. memfd: SHARE-OPEN (shared file-table)
  67. memfd: SHARE-FORK (shared file-table)
  68. memfd: DONE
  69. Starting test ./default/modsign
  70. Successfully loaded signed module
  71. Successfully loaded unsigned module
  72. Starting test ./default/mq-memory-corruption
  73. Test PASSED
  74. Test PASSED
  75. Test PASSED
  76. Test PASSED
  77. Test PASSED
  78. Test PASSED
  79. Test PASSED
  80. Test PASSED
  81. Test PASSED
  82. Test PASSED
  83. Starting test ./default/paxtest
  84. Starting test ./default/posix_timers
  85. Testing posix timers. False negative may happen on CPU execution
  86. based timers if other threads run on the CPU...
  87. Check itimer virtual... [OK]
  88. Check itimer prof... [OK]
  89. Check itimer real... [OK]
  90. Check timer_create() per thread... [OK]
  91. Check timer_create() per process... [OK]
  92. Starting test ./default/selinux-dac-controls
  93. <no matches>
  94. Starting test ./default/stack-randomness
  95. Starting test ./default/sysfs-perms
  96. Starting test ./default/timer-overhead
  97. cc timer-test.o -o timer-test
  98. Starting test ./thirdparty/nvidia-module
  99. curl-7.82.0-5.fc36.x86_64
  100. kernel-devel-5.17.12-300.fc36.x86_64
  101. kernel-devel-5.18.3-200.fc36.x86_64
  102. elfutils-libelf-devel-0.187-4.fc36.x86_64
  103. % Total % Received % Xferd Average Speed Time Time Time Current
  104. Dload Upload Total Spent Left Speed
  105.  
  106. 0 0 0 0 0 0 0 0 --:--:-- --:--:-- --:--:-- 0
  107. 0 0 0 0 0 0 0 0 --:--:-- --:--:-- --:--:-- 0
  108. 100 54 100 54 0 0 227 0 --:--:-- --:--:-- --:--:-- 226
  109. % Total % Received % Xferd Average Speed Time Time Time Current
  110. Dload Upload Total Spent Left Speed
  111.  
  112. 0 0 0 0 0 0 0 0 --:--:-- --:--:-- --:--:-- 0
  113. 9 313M 9 28.4M 0 0 32.8M 0 0:00:09 --:--:-- 0:00:09 32.8M
  114. 23 313M 23 73.8M 0 0 39.6M 0 0:00:07 0:00:01 0:00:06 39.5M
  115. 37 313M 37 119M 0 0 41.5M 0 0:00:07 0:00:02 0:00:05 41.5M
  116. 52 313M 52 164M 0 0 42.6M 0 0:00:07 0:00:03 0:00:04 42.6M
  117. 67 313M 67 210M 0 0 43.1M 0 0:00:07 0:00:04 0:00:03 43.1M
  118. 81 313M 81 254M 0 0 43.4M 0 0:00:07 0:00:05 0:00:02 45.2M
  119. 95 313M 95 300M 0 0 43.7M 0 0:00:07 0:00:06 0:00:01 45.2M
  120. 100 313M 100 313M 0 0 43.7M 0 0:00:07 0:00:07 --:--:-- 45.2M
  121. Creating directory tmp
  122. Verifying archive integrity... OK
  123. Uncompressing NVIDIA Accelerated Graphics Driver for Linux-x86_64 510.47.03..........................................................................................................................................................................................................................................................................................................................................................................................................................................................................................................................................................................................................
  124. /home/schuyler/kernel-tests/thirdparty/nvidia-module/tmp/kernel /home/schuyler/kernel-tests/thirdparty/nvidia-module
  125. warning: the compiler differs from the one used to build the kernel
  126. The kernel was built by: gcc (GCC) 12.1.1 20220507 (Red Hat 12.1.1-1)
  127. You are using: cc (GCC) 12.1.1 20220507 (Red Hat 12.1.1-1)
  128. /home/schuyler/kernel-tests/thirdparty/nvidia-module/tmp/kernel/nvidia/nv.c: In function ‘nv_set_dma_address_size’:
  129. /home/schuyler/kernel-tests/thirdparty/nvidia-module/tmp/kernel/nvidia/nv.c:2768:9: error: implicit declaration of function ‘pci_set_dma_mask’; did you mean ‘ipi_send_mask’? [-Werror=implicit-function-declaration]
  130. 2768 | pci_set_dma_mask(nvl->pci_dev, new_mask);
  131. | ^~~~~~~~~~~~~~~~
  132. | ipi_send_mask
  133. /home/schuyler/kernel-tests/thirdparty/nvidia-module/tmp/kernel/nvidia/nv.c:2774:9: error: implicit declaration of function ‘pci_set_consistent_dma_mask’ [-Werror=implicit-function-declaration]
  134. 2774 | pci_set_consistent_dma_mask(nvl->pci_dev, new_mask);
  135. | ^~~~~~~~~~~~~~~~~~~~~~~~~~~
  136. cc1: some warnings being treated as errors
  137. make[2]: *** [scripts/Makefile.build:288: /home/schuyler/kernel-tests/thirdparty/nvidia-module/tmp/kernel/nvidia/nv.o] Error 1
  138. make[1]: *** [Makefile:1838: /home/schuyler/kernel-tests/thirdparty/nvidia-module/tmp/kernel] Error 2
  139. make: *** [Makefile:82: modules] Error 2
Advertisement
Add Comment
Please, Sign In to add comment
Advertisement