Advertisement
damian101

aomenc vmaf build -DBUILD_SHARED_LIBS=0

Jul 19th, 2023
1,590
0
Never
Not a member of Pastebin yet? Sign Up, it unlocks many cool features!
Make 2.52 KB | None | 0 0
  1. [ 98%] Linking CXX executable resize_util
  2. /usr/bin/ld: cannot find -lvmaf: No such file or directory
  3. /usr/bin/ld: cannot find -lvmaf: No such file or directory
  4. /usr/bin/ld: cannot find -lvmaf: No such file or directory
  5. /usr/bin/ld: cannot find -lvmaf: No such file or directory
  6. /usr/bin/ld: cannot find -lvmaf: No such file or directory
  7. /usr/bin/ld: cannot find -lvmaf: No such file or directory
  8. /usr/bin/ld: cannot find -lvmaf: No such file or directory
  9. /usr/bin/ld: cannot find -lvmaf: No such file or directory
  10. /usr/bin/ld: cannot find -lvmaf: No such file or directory
  11. /usr/bin/ld: cannot find -lvmaf: No such file or directory
  12. /usr/bin/ld: cannot find -lvmaf: No such file or directory
  13. /usr/bin/ld: cannot find -lvmaf: No such file or directory
  14. [ 98%] Linking CXX executable aomenc
  15. /usr/bin/ld: cannot find -lvmaf: No such file or directory
  16. /usr/bin/ld: cannot find -lvmaf: No such file or directory
  17. [ 98%] Linking CXX static library libaom_av1_rc.a
  18. collect2: error: ld returned 1 exit status
  19. make[2]: *** [CMakeFiles/set_maps.dir/build.make:178: examples/set_maps] Error 1
  20. collect2: error: ld returned 1 exit status
  21. make[1]: *** [CMakeFiles/Makefile2:1442: CMakeFiles/set_maps.dir/all] Error 2
  22. make[1]: *** Waiting for unfinished jobs....
  23. collect2: error: ld returned 1 exit status
  24. collect2: error: ld returned 1 exit status
  25. collect2: error: ld returned 1 exit status
  26. collect2: error: ld returned 1 exit status
  27. make[2]: *** [CMakeFiles/aomenc.dir/build.make:182: aomenc] Error 1
  28. make[1]: *** [CMakeFiles/Makefile2:1382: CMakeFiles/aomenc.dir/all] Error 2
  29. make[2]: *** [CMakeFiles/lossless_encoder.dir/build.make:178: examples/lossless_encoder] Error 1
  30. make[1]: *** [CMakeFiles/Makefile2:1412: CMakeFiles/lossless_encoder.dir/all] Error 2
  31. make[2]: *** [CMakeFiles/noise_model.dir/build.make:178: examples/noise_model] Error 1
  32. make[2]: *** [CMakeFiles/resize_util.dir/build.make:166: resize_util] Error 1
  33. make[2]: *** [CMakeFiles/simple_encoder.dir/build.make:178: examples/simple_encoder] Error 1
  34. make[1]: *** [CMakeFiles/Makefile2:1532: CMakeFiles/noise_model.dir/all] Error 2
  35. make[1]: *** [CMakeFiles/Makefile2:1325: CMakeFiles/resize_util.dir/all] Error 2
  36. make[1]: *** [CMakeFiles/Makefile2:1472: CMakeFiles/simple_encoder.dir/all] Error 2
  37. collect2: error: ld returned 1 exit status
  38. make[2]: *** [CMakeFiles/twopass_encoder.dir/build.make:178: examples/twopass_encoder] Error 1
  39. make[1]: *** [CMakeFiles/Makefile2:1502: CMakeFiles/twopass_encoder.dir/all] Error 2
  40. [ 98%] Built target aom_av1_rc
  41. make: *** [Makefile:136: all] Error 2
Advertisement
Add Comment
Please, Sign In to add comment
Advertisement