SHARE
TWEET

brew_install_ogre_failed_osx_mavericks

130s Apr 23rd, 2014 56 Never
Not a member of Pastebin yet? Sign Up, it unlocks many cool features!
  1. $ brew install -v ogre
  2. ==> Downloading https://sourceforge.net/projects/ogre/files/ogre/1.7/ogre_src_v1-7-4.tar.bz2
  3. Already downloaded: /Library/Caches/Homebrew/ogre-1.7.4.tar.bz2
  4. ==> Verifying ogre-1.7.4.tar.bz2 checksum
  5. tar xf /Library/Caches/Homebrew/ogre-1.7.4.tar.bz2
  6. ==> Downloading https://gist.github.com/raw/4237236/e357f1b9fa8b26d02ed84f411d5b5eb7446c68c5/pkg_config_fix.patch
  7. Already downloaded: /Library/Caches/Homebrew/ogre--patch-f9100fef2823227803f14e1676818ed17a89e895.patch
  8. ==> Verifying ogre--patch-f9100fef2823227803f14e1676818ed17a89e895.patch checksum
  9. ==> Downloading https://gist.github.com/raw/4237236/57cb907304433cc0bb83fd332ff98a5789102b00/prevent_framework_apple.patch
  10. Already downloaded: /Library/Caches/Homebrew/ogre--patch-019c0c8f82ffd6c7dd258676c4f04b9881695e43.patch
  11. ==> Verifying ogre--patch-019c0c8f82ffd6c7dd258676c4f04b9881695e43.patch checksum
  12. ==> Downloading https://gist.github.com/raw/4237236/31ae53cefdb693cb2fb81333178163a29f8cf7ca/osx_isystem.patch
  13. Already downloaded: /Library/Caches/Homebrew/ogre--patch-e750d6cb9f2b0123ef28dda4e024db98625fde76.patch
  14. ==> Verifying ogre--patch-e750d6cb9f2b0123ef28dda4e024db98625fde76.patch checksum
  15. ==> Downloading https://gist.github.com/raw/4237236/9c7df6689da4e0b358429692f6615f2707469f45/osx_linking.patch
  16. Already downloaded: /Library/Caches/Homebrew/ogre--patch-2855209c15422cc8df3110f9a0e32e084cd1e5b6.patch
  17. ==> Verifying ogre--patch-2855209c15422cc8df3110f9a0e32e084cd1e5b6.patch checksum
  18. ==> Downloading https://gist.github.com/raw/4237236/d667813d5ee1e712e0ea8cc99df9a85da6141b1e/replace_pbxcp_with_ditto.patch
  19. Already downloaded: /Library/Caches/Homebrew/ogre--patch-3d2e4054643189273450245e15182f406125c94b.patch
  20. ==> Verifying ogre--patch-3d2e4054643189273450245e15182f406125c94b.patch checksum
  21. ==> Downloading https://gist.github.com/wjwwood/5672104/raw/bf69b4528b3090ad99a760029beb75b7aeb11248/fix_boost_linking.patch
  22. Already downloaded: /Library/Caches/Homebrew/ogre--patch-73d730e4fbc01ce06d9137a495b0a52488ca71e8.patch
  23. ==> Verifying ogre--patch-73d730e4fbc01ce06d9137a495b0a52488ca71e8.patch checksum
  24. ==> Downloading https://gist.github.com/hgaiser/7346167/raw/3167c2fde153618e55b37f857ef4a90cc54ed2a3/ogre.patch
  25. Already downloaded: /Library/Caches/Homebrew/ogre--patch-6cf5fc081d291b7f9bc9ce3dd4019cc18b16b4b9.patch
  26. ==> Verifying ogre--patch-6cf5fc081d291b7f9bc9ce3dd4019cc18b16b4b9.patch checksum
  27. ==> Patching
  28. /usr/bin/patch -g 0 -f -d /private/tmp/ogre-4JyI/ogre_src_v1-7-4 -p1 -i /private/tmp/ogre--patch-ho6i/pkg_config_fix.patch
  29. patching file CMake/Templates/OGRE.pc.in
  30. /usr/bin/patch -g 0 -f -d /private/tmp/ogre-4JyI/ogre_src_v1-7-4 -p1 -i /private/tmp/ogre--patch-NKgp/prevent_framework_apple.patch
  31. patching file OgreMain/CMakeLists.txt
  32. /usr/bin/patch -g 0 -f -d /private/tmp/ogre-4JyI/ogre_src_v1-7-4 -p1 -i /private/tmp/ogre--patch-y2Ut/osx_isystem.patch
  33. patching file CMakeLists.txt
  34. /usr/bin/patch -g 0 -f -d /private/tmp/ogre-4JyI/ogre_src_v1-7-4 -p1 -i /private/tmp/ogre--patch-pi4J/osx_linking.patch
  35. patching file CMake/Dependencies.cmake
  36. Hunk #1 succeeded at 123 with fuzz 1.
  37. patching file CMake/Packages/FindFreetype.cmake
  38. /usr/bin/patch -g 0 -f -d /private/tmp/ogre-4JyI/ogre_src_v1-7-4 -p1 -i /private/tmp/ogre--patch-IvDD/replace_pbxcp_with_ditto.patch
  39. patching file Components/Paging/CMakeLists.txt
  40. patching file Components/Property/CMakeLists.txt
  41. patching file Components/RTShaderSystem/CMakeLists.txt
  42. patching file Components/Terrain/CMakeLists.txt
  43. patching file OgreMain/CMakeLists.txt
  44. patching file PlugIns/BSPSceneManager/CMakeLists.txt
  45. patching file PlugIns/CgProgramManager/CMakeLists.txt
  46. patching file PlugIns/OctreeSceneManager/CMakeLists.txt
  47. patching file PlugIns/OctreeZone/CMakeLists.txt
  48. patching file PlugIns/PCZSceneManager/CMakeLists.txt
  49. patching file PlugIns/ParticleFX/CMakeLists.txt
  50. /usr/bin/patch -g 0 -f -d /private/tmp/ogre-4JyI/ogre_src_v1-7-4 -p1 -i /private/tmp/ogre--patch-hzRv/fix_boost_linking.patch
  51. patching file CMake/Dependencies.cmake
  52. Hunk #1 succeeded at 134 with fuzz 1.
  53. /usr/bin/patch -g 0 -f -d /private/tmp/ogre-4JyI/ogre_src_v1-7-4 -p1 -i /private/tmp/ogre--patch-ODtw/ogre.patch
  54. patching file RenderSystems/GL/src/OSX/OgreOSXCocoaWindow.mm
  55. patching file RenderSystems/GL/src/OSX/OgreOSXGLSupport.mm
  56. ==> cmake -DCMAKE_OSX_ARCHITECTURES='x86_64' -DOGRE_BUILD_PLUGIN_CG=OFF -DCMAKE_INSTALL_PREFIX=/usr/local/Cellar/ogre/1.7.4 -DCMAKE_BUILD_TYPE=None -DCMAKE_FIND_FRAMEWORK=LAST -DCMAKE_VERBOSE_MAKEFILE=ON -Wno-dev ..
  57. -- The C compiler identification is Clang 5.1.0
  58. -- The CXX compiler identification is Clang 5.1.0
  59. -- Check for working C compiler: /usr/local/Library/ENV/4.3/clang
  60. -- Check for working C compiler: /usr/local/Library/ENV/4.3/clang -- works
  61. -- Detecting C compiler ABI info
  62. -- Detecting C compiler ABI info - done
  63. -- Check for working CXX compiler: /usr/local/Library/ENV/4.3/clang++
  64. -- Check for working CXX compiler: /usr/local/Library/ENV/4.3/clang++ -- works
  65. -- Detecting CXX compiler ABI info
  66. -- Detecting CXX compiler ABI info - done
  67. -- Configuring OGRE 1.7.4
  68. -- Check size of void*
  69. -- Check size of void* - done
  70. -- Check if the system is big endian
  71. -- Searching 16 bit integer
  72. -- Looking for sys/types.h
  73. -- Looking for sys/types.h - found
  74. -- Looking for stdint.h
  75. -- Looking for stdint.h - found
  76. -- Looking for stddef.h
  77. -- Looking for stddef.h - found
  78. -- Check size of unsigned short
  79. -- Check size of unsigned short - done
  80. -- Using unsigned short
  81. -- Check if the system is big endian - little endian
  82. -- Search path: /tmp/ogre-4JyI/ogre_src_v1-7-4/build/Dependencies;/tmp/ogre-4JyI/ogre_src_v1-7-4/Dependencies;/tmp/ogre-4JyI/ogre_src_v1-7-4/build/../Dependencies;/tmp/ogre-4JyI/ogre_src_v1-7-4/../Dependencies
  83. -- Looking for ZLIB...
  84. -- Found PkgConfig: /usr/local/bin/pkg-config (found version "0.28")
  85. -- checking for module 'zzip-zlib-config'
  86. --   found zzip-zlib-config, version 1.2.5
  87. -- Found ZLIB: optimized;/usr/lib/libz.dylib;debug;/usr/lib/libz.dylib
  88. -- Looking for ZZip...
  89. -- checking for module 'zziplib'
  90. --   found zziplib, version 0.13.62
  91. -- Found ZZip: optimized;/usr/local/lib/libzzip.dylib;debug;/usr/local/lib/libzzip.dylib
  92. -- Looking for FreeImage...
  93. -- checking for module 'freeimage'
  94. --   package 'freeimage' not found
  95. -- Found FreeImage: optimized;/usr/local/lib/libfreeimage.dylib;debug;/usr/local/lib/libfreeimage.dylib
  96. -- Looking for FREETYPE...
  97. -- checking for module 'freetype2'
  98. --   found freetype2, version 17.2.11
  99. -- CMAKE_PREFIX_PATH: /tmp/ogre-4JyI/ogre_src_v1-7-4/build/Dependencies;/tmp/ogre-4JyI/ogre_src_v1-7-4/Dependencies;/tmp/ogre-4JyI/ogre_src_v1-7-4/build/../Dependencies;/tmp/ogre-4JyI/ogre_src_v1-7-4/../Dependencies;/usr/local
  100. -- Found FREETYPE: optimized;/usr/local/lib/libfreetype.dylib;debug;/usr/local/lib/libfreetype.dylib
  101. -- Looking for XOpenDisplay in /opt/X11/lib/libX11.dylib;/opt/X11/lib/libXext.dylib
  102. -- Looking for XOpenDisplay in /opt/X11/lib/libX11.dylib;/opt/X11/lib/libXext.dylib - found
  103. -- Looking for gethostbyname
  104. -- Looking for gethostbyname - found
  105. -- Looking for connect
  106. -- Looking for connect - found
  107. -- Looking for remove
  108. -- Looking for remove - found
  109. -- Looking for shmat
  110. -- Looking for shmat - found
  111. -- Looking for IceConnectionNumber in ICE
  112. -- Looking for IceConnectionNumber in ICE - found
  113. -- Found X11: /opt/X11/lib/libX11.dylib
  114. -- Found OpenGL: /Applications/Xcode.app/Contents/Developer/Platforms/MacOSX.platform/Developer/SDKs/MacOSX10.9.sdk/System/Library/Frameworks/OpenGL.framework  
  115. -- Looking for Cg...
  116. -- Cg_PREFIX_PATH changed.
  117. -- checking for module 'Cg'
  118. --   package 'Cg' not found
  119. -- Could not locate Cg
  120. -- Looking for POCO...
  121. -- checking for module 'POCO'
  122. --   package 'POCO' not found
  123. -- Found POCO: optimized;/usr/local/lib/libPocoFoundation.dylib;debug;/usr/local/lib/libPocoFoundationd.dylib
  124. -- Looking for POCO_Util...
  125. -- Found POCO_Util: optimized;/usr/local/lib/libPocoUtil.dylib;debug;/usr/local/lib/libPocoUtild.dylib
  126. -- Looking for POCO_Net...
  127. -- Found POCO_Net: optimized;/usr/local/lib/libPocoNet.dylib;debug;/usr/local/lib/libPocoNetd.dylib
  128. -- Looking for POCO_NetSSL...
  129. -- Found POCO_NetSSL: optimized;/usr/local/lib/libPocoNetSSL.dylib;debug;/usr/local/lib/libPocoNetSSLd.dylib
  130. -- Looking for POCO_XML...
  131. -- Found POCO_XML: optimized;/usr/local/lib/libPocoXML.dylib;debug;/usr/local/lib/libPocoXMLd.dylib
  132. -- Looking for TBB...
  133. -- Found TBB: optimized;/usr/local/lib/libtbb.dylib;debug;/usr/local/lib/libtbb.dylib
  134. -- Looking for TBB_MALLOC...
  135. -- Found TBB_MALLOC: optimized;/usr/local/lib/libtbbmalloc.dylib;debug;/usr/local/lib/libtbbmalloc.dylib
  136. -- Looking for TBB_MALLOC_PROXY...
  137. -- Could not locate TBB_MALLOC_PROXY
  138. -- Looking for OIS...
  139. -- OIS_PREFIX_PATH changed.
  140. -- checking for module 'OIS'
  141. --   package 'OIS' not found
  142. -- Could not locate OIS
  143. -- Found Doxygen: /usr/local/bin/doxygen  
  144. -- Looking for CppUnit...
  145. -- checking for module 'cppunit'
  146. --   package 'cppunit' not found
  147. -- Found CppUnit: optimized;/usr/local/lib/libcppunit.dylib;debug;/usr/local/lib/libcppunit.dylib
  148. -- Looking for Carbon...
  149. -- checking for module 'Carbon'
  150. --   package 'Carbon' not found
  151. -- Found Carbon: -framework Carbon
  152. -- Looking for Cocoa...
  153. -- checking for module 'Cocoa'
  154. --   package 'Cocoa' not found
  155. -- Found Cocoa: -framework Cocoa
  156. -- Looking for IOKit...
  157. -- checking for module 'IOKit'
  158. --   package 'IOKit' not found
  159. -- Found IOKit: -framework IOKit
  160. --
  161. -----------------------------------------------------------------------------
  162. -- The following external packages were located on your system.
  163. -- This installation will have the extra features provided by these packages.
  164. + zlib
  165. + zziplib
  166. + freeimage
  167. + freetype
  168. + X11
  169. + Xt
  170. + Xaw
  171. + OpenGL
  172. + OpenGL ES
  173. + boost
  174. + boost-thread
  175. + boost-system
  176. + boost-date_time
  177. + POCO
  178. + tbb
  179. + Doxygen
  180. + CppUnit
  181. + Carbon
  182. + Cocoa
  183. + IOKit
  184. -----------------------------------------------------------------------------
  185. -- The following OPTIONAL packages could NOT be located on your system.
  186. -- Consider installing them to enable more features from this software.
  187. + cg: C for graphics shader language <http://developer.nvidia.com/object/cg_toolkit.html>
  188. + OIS: Input library needed for the samples <http://sourceforge.net/projects/wgois>
  189. -----------------------------------------------------------------------------
  190.  
  191. send_error/tmp/ogre-4JyI/bin/debug/libOIS.a did not exist, can't install!
  192. send_error/tmp/ogre-4JyI/bin/release/libOIS.a did not exist, can't install!
  193. -- Could not find dependency: OIS
  194. -- Skipping samples build
  195. --
  196. ----------------------------------------------------------------------------
  197.   FEATURE SUMMARY
  198. ----------------------------------------------------------------------------
  199.  
  200. Building components:
  201.   + Paging
  202.   + Property
  203.   + Terrain
  204.   + RTShader System
  205.   + RTShader System Core Shaders
  206.   + RTShader System Extensions Shaders
  207. Building plugins:
  208.   + BSP scene manager
  209.   + Octree scene manager
  210.   + Portal connected zone scene manager
  211.   + Particle FX
  212. Building rendersystems:
  213.   + OpenGL
  214. Building executables:
  215.   + Samples
  216.   + Tools
  217. Building core features:
  218.   + DDS image codec
  219.   + FreeImage codec
  220.   + ZIP archives
  221.  
  222. Build type:                      dynamic
  223. Threading support:               background (boost)
  224. Use double precision:            disabled
  225. Allocator type:                  nedmalloc (pooling)
  226. STL containers use allocator:    enabled
  227. Strings use allocator:           disabled
  228. Memory tracker (debug):          disabled
  229. Memory tracker (release):        disabled
  230. Use new script compilers:        enabled
  231. Use Boost:                       enabled
  232.  
  233. ----------------------------------------------------------------------------
  234.  
  235. -- Configuring done
  236. -- Generating done
  237. -- Build files have been written to: /tmp/ogre-4JyI/ogre_src_v1-7-4/build
  238. ==> make install
  239. /usr/local/Cellar/cmake/2.8.12.2/bin/cmake -H/tmp/ogre-4JyI/ogre_src_v1-7-4 -B/tmp/ogre-4JyI/ogre_src_v1-7-4/build --check-build-system CMakeFiles/Makefile.cmake 0
  240. /usr/local/Cellar/cmake/2.8.12.2/bin/cmake -E cmake_progress_start /tmp/ogre-4JyI/ogre_src_v1-7-4/build/CMakeFiles /tmp/ogre-4JyI/ogre_src_v1-7-4/build/CMakeFiles/progress.marks
  241. /Applications/Xcode.app/Contents/Developer/usr/bin/make -f CMakeFiles/Makefile2 all
  242. /Applications/Xcode.app/Contents/Developer/usr/bin/make -f OgreMain/CMakeFiles/OgreMain.dir/build.make OgreMain/CMakeFiles/OgreMain.dir/depend
  243. cd /tmp/ogre-4JyI/ogre_src_v1-7-4/build && /usr/local/Cellar/cmake/2.8.12.2/bin/cmake -E cmake_depends "Unix Makefiles" /tmp/ogre-4JyI/ogre_src_v1-7-4 /tmp/ogre-4JyI/ogre_src_v1-7-4/OgreMain /tmp/ogre-4JyI/ogre_src_v1-7-4/build /tmp/ogre-4JyI/ogre_src_v1-7-4/build/OgreMain /tmp/ogre-4JyI/ogre_src_v1-7-4/build/OgreMain/CMakeFiles/OgreMain.dir/DependInfo.cmake --color=
  244. Scanning dependencies of target OgreMain
  245. /Applications/Xcode.app/Contents/Developer/usr/bin/make -f OgreMain/CMakeFiles/OgreMain.dir/build.make OgreMain/CMakeFiles/OgreMain.dir/build
  246. /usr/local/Cellar/cmake/2.8.12.2/bin/cmake -E cmake_progress_report /tmp/ogre-4JyI/ogre_src_v1-7-4/build/CMakeFiles
  247. /usr/local/Cellar/cmake/2.8.12.2/bin/cmake -E cmake_progress_report /tmp/ogre-4JyI/ogre_src_v1-7-4/build/CMakeFiles
  248. /usr/local/Cellar/cmake/2.8.12.2/bin/cmake -E cmake_progress_report /tmp/ogre-4JyI/ogre_src_v1-7-4/build/CMakeFiles
  249. /usr/local/Cellar/cmake/2.8.12.2/bin/cmake -E cmake_progress_report /tmp/ogre-4JyI/ogre_src_v1-7-4/build/CMakeFiles 1
  250. [  0%] /usr/local/Cellar/cmake/2.8.12.2/bin/cmake -E cmake_progress_report /tmp/ogre-4JyI/ogre_src_v1-7-4/build/CMakeFiles
  251. [  0%] [  0%] /usr/local/Cellar/cmake/2.8.12.2/bin/cmake -E cmake_progress_report /tmp/ogre-4JyI/ogre_src_v1-7-4/build/CMakeFiles
  252. [  1%] /usr/local/Cellar/cmake/2.8.12.2/bin/cmake -E cmake_progress_report /tmp/ogre-4JyI/ogre_src_v1-7-4/build/CMakeFiles
  253. [  1%] Building CXX object OgreMain/CMakeFiles/OgreMain.dir/src/OgreAlignedAllocator.cpp.o
  254. [  1%] cd /tmp/ogre-4JyI/ogre_src_v1-7-4/build/OgreMain && /usr/local/Library/ENV/4.3/clang++   -DBOOST_ALL_NO_LIB -DFREEIMAGE_LIB -DOGRE_NONCLIENT_BUILD -DOgreMain_EXPORTS -D_MT -D_USRDLL -arch x86_64 -isysroot /Applications/Xcode.app/Contents/Developer/Platforms/MacOSX.platform/Developer/SDKs/MacOSX10.9.sdk -fPIC -I/tmp/ogre-4JyI/ogre_src_v1-7-4/OgreMain/include -I/tmp/ogre-4JyI/ogre_src_v1-7-4/build/include -I/tmp/ogre-4JyI/ogre_src_v1-7-4/OgreMain/include/OSX -I/usr/local/include -I/opt/X11/include -I/tmp/ogre-4JyI/ogre_src_v1-7-4 -I/Applications/Xcode.app/Contents/Developer/Platforms/MacOSX.platform/Developer/SDKs/MacOSX10.9.sdk/System/Library/Frameworks/Carbon.framework/Headers -F/Applications/Xcode.app/Contents/Developer/Platforms/MacOSX.platform/Developer/SDKs/MacOSX10.9.sdk/System/Library/Frameworks -I/Applications/Xcode.app/Contents/Developer/Platforms/MacOSX.platform/Developer/SDKs/MacOSX10.9.sdk/System/Library/Frameworks/Cocoa.framework/Headers -I/tmp/ogre-4JyI/ogre_src_v1-7-4/OgreMain/src/nedmalloc    -pthread -o CMakeFiles/OgreMain.dir/src/OgreAlignedAllocator.cpp.o -c /tmp/ogre-4JyI/ogre_src_v1-7-4/OgreMain/src/OgreAlignedAllocator.cpp
  255. /usr/local/Cellar/cmake/2.8.12.2/bin/cmake -E cmake_progress_report /tmp/ogre-4JyI/ogre_src_v1-7-4/build/CMakeFiles 2
  256. Building CXX object OgreMain/CMakeFiles/OgreMain.dir/src/OgreAnimable.cpp.o
  257. Building CXX object OgreMain/CMakeFiles/OgreMain.dir/src/OgreAnimation.cpp.o
  258. cd /tmp/ogre-4JyI/ogre_src_v1-7-4/build/OgreMain && /usr/local/Library/ENV/4.3/clang++   -DBOOST_ALL_NO_LIB -DFREEIMAGE_LIB -DOGRE_NONCLIENT_BUILD -DOgreMain_EXPORTS -D_MT -D_USRDLL -arch x86_64 -isysroot /Applications/Xcode.app/Contents/Developer/Platforms/MacOSX.platform/Developer/SDKs/MacOSX10.9.sdk -fPIC -I/tmp/ogre-4JyI/ogre_src_v1-7-4/OgreMain/include -I/tmp/ogre-4JyI/ogre_src_v1-7-4/build/include -I/tmp/ogre-4JyI/ogre_src_v1-7-4/OgreMain/include/OSX -I/usr/local/include -I/opt/X11/include -I/tmp/ogre-4JyI/ogre_src_v1-7-4 -I/Applications/Xcode.app/Contents/Developer/Platforms/MacOSX.platform/Developer/SDKs/MacOSX10.9.sdk/System/Library/Frameworks/Carbon.framework/Headers -F/Applications/Xcode.app/Contents/Developer/Platforms/MacOSX.platform/Developer/SDKs/MacOSX10.9.sdk/System/Library/Frameworks -I/Applications/Xcode.app/Contents/Developer/Platforms/MacOSX.platform/Developer/SDKs/MacOSX10.9.sdk/System/Library/Frameworks/Cocoa.framework/Headers -I/tmp/ogre-4JyI/ogre_src_v1-7-4/OgreMain/src/nedmalloc    -pthread -o CMakeFiles/OgreMain.dir/src/OgreAnimable.cpp.o -c /tmp/ogre-4JyI/ogre_src_v1-7-4/OgreMain/src/OgreAnimable.cpp
  259. [  1%] cd /tmp/ogre-4JyI/ogre_src_v1-7-4/build/OgreMain && /usr/local/Library/ENV/4.3/clang++   -DBOOST_ALL_NO_LIB -DFREEIMAGE_LIB -DOGRE_NONCLIENT_BUILD -DOgreMain_EXPORTS -D_MT -D_USRDLL -arch x86_64 -isysroot /Applications/Xcode.app/Contents/Developer/Platforms/MacOSX.platform/Developer/SDKs/MacOSX10.9.sdk -fPIC -I/tmp/ogre-4JyI/ogre_src_v1-7-4/OgreMain/include -I/tmp/ogre-4JyI/ogre_src_v1-7-4/build/include -I/tmp/ogre-4JyI/ogre_src_v1-7-4/OgreMain/include/OSX -I/usr/local/include -I/opt/X11/include -I/tmp/ogre-4JyI/ogre_src_v1-7-4 -I/Applications/Xcode.app/Contents/Developer/Platforms/MacOSX.platform/Developer/SDKs/MacOSX10.9.sdk/System/Library/Frameworks/Carbon.framework/Headers -F/Applications/Xcode.app/Contents/Developer/Platforms/MacOSX.platform/Developer/SDKs/MacOSX10.9.sdk/System/Library/Frameworks -I/Applications/Xcode.app/Contents/Developer/Platforms/MacOSX.platform/Developer/SDKs/MacOSX10.9.sdk/System/Library/Frameworks/Cocoa.framework/Headers -I/tmp/ogre-4JyI/ogre_src_v1-7-4/OgreMain/src/nedmalloc    -pthread -o CMakeFiles/OgreMain.dir/src/OgreAnimation.cpp.o -c /tmp/ogre-4JyI/ogre_src_v1-7-4/OgreMain/src/OgreAnimation.cpp
  260. Building CXX object OgreMain/CMakeFiles/OgreMain.dir/src/OgreAnimationState.cpp.o
  261. cd /tmp/ogre-4JyI/ogre_src_v1-7-4/build/OgreMain && /usr/local/Library/ENV/4.3/clang++   -DBOOST_ALL_NO_LIB -DFREEIMAGE_LIB -DOGRE_NONCLIENT_BUILD -DOgreMain_EXPORTS -D_MT -D_USRDLL -arch x86_64 -isysroot /Applications/Xcode.app/Contents/Developer/Platforms/MacOSX.platform/Developer/SDKs/MacOSX10.9.sdk -fPIC -I/tmp/ogre-4JyI/ogre_src_v1-7-4/OgreMain/include -I/tmp/ogre-4JyI/ogre_src_v1-7-4/build/include -I/tmp/ogre-4JyI/ogre_src_v1-7-4/OgreMain/include/OSX -I/usr/local/include -I/opt/X11/include -I/tmp/ogre-4JyI/ogre_src_v1-7-4 -I/Applications/Xcode.app/Contents/Developer/Platforms/MacOSX.platform/Developer/SDKs/MacOSX10.9.sdk/System/Library/Frameworks/Carbon.framework/Headers -F/Applications/Xcode.app/Contents/Developer/Platforms/MacOSX.platform/Developer/SDKs/MacOSX10.9.sdk/System/Library/Frameworks -I/Applications/Xcode.app/Contents/Developer/Platforms/MacOSX.platform/Developer/SDKs/MacOSX10.9.sdk/System/Library/Frameworks/Cocoa.framework/Headers -I/tmp/ogre-4JyI/ogre_src_v1-7-4/OgreMain/src/nedmalloc    -pthread -o CMakeFiles/OgreMain.dir/src/OgreAnimationState.cpp.o -c /tmp/ogre-4JyI/ogre_src_v1-7-4/OgreMain/src/OgreAnimationState.cpp
  262. [  2%] Building CXX object OgreMain/CMakeFiles/OgreMain.dir/src/OgreArchiveManager.cpp.o
  263. Building CXX object OgreMain/CMakeFiles/OgreMain.dir/src/OgreAnimationTrack.cpp.o
  264. cd /tmp/ogre-4JyI/ogre_src_v1-7-4/build/OgreMain && /usr/local/Library/ENV/4.3/clang++   -DBOOST_ALL_NO_LIB -DFREEIMAGE_LIB -DOGRE_NONCLIENT_BUILD -DOgreMain_EXPORTS -D_MT -D_USRDLL -arch x86_64 -isysroot /Applications/Xcode.app/Contents/Developer/Platforms/MacOSX.platform/Developer/SDKs/MacOSX10.9.sdk -fPIC -I/tmp/ogre-4JyI/ogre_src_v1-7-4/OgreMain/include -I/tmp/ogre-4JyI/ogre_src_v1-7-4/build/include -I/tmp/ogre-4JyI/ogre_src_v1-7-4/OgreMain/include/OSX -I/usr/local/include -I/opt/X11/include -I/tmp/ogre-4JyI/ogre_src_v1-7-4 -I/Applications/Xcode.app/Contents/Developer/Platforms/MacOSX.platform/Developer/SDKs/MacOSX10.9.sdk/System/Library/Frameworks/Carbon.framework/Headers -F/Applications/Xcode.app/Contents/Developer/Platforms/MacOSX.platform/Developer/SDKs/MacOSX10.9.sdk/System/Library/Frameworks -I/Applications/Xcode.app/Contents/Developer/Platforms/MacOSX.platform/Developer/SDKs/MacOSX10.9.sdk/System/Library/Frameworks/Cocoa.framework/Headers -I/tmp/ogre-4JyI/ogre_src_v1-7-4/OgreMain/src/nedmalloc    -pthread -o CMakeFiles/OgreMain.dir/src/OgreArchiveManager.cpp.o -c /tmp/ogre-4JyI/ogre_src_v1-7-4/OgreMain/src/OgreArchiveManager.cpp
  265. cd /tmp/ogre-4JyI/ogre_src_v1-7-4/build/OgreMain && /usr/local/Library/ENV/4.3/clang++   -DBOOST_ALL_NO_LIB -DFREEIMAGE_LIB -DOGRE_NONCLIENT_BUILD -DOgreMain_EXPORTS -D_MT -D_USRDLL -arch x86_64 -isysroot /Applications/Xcode.app/Contents/Developer/Platforms/MacOSX.platform/Developer/SDKs/MacOSX10.9.sdk -fPIC -I/tmp/ogre-4JyI/ogre_src_v1-7-4/OgreMain/include -I/tmp/ogre-4JyI/ogre_src_v1-7-4/build/include -I/tmp/ogre-4JyI/ogre_src_v1-7-4/OgreMain/include/OSX -I/usr/local/include -I/opt/X11/include -I/tmp/ogre-4JyI/ogre_src_v1-7-4 -I/Applications/Xcode.app/Contents/Developer/Platforms/MacOSX.platform/Developer/SDKs/MacOSX10.9.sdk/System/Library/Frameworks/Carbon.framework/Headers -F/Applications/Xcode.app/Contents/Developer/Platforms/MacOSX.platform/Developer/SDKs/MacOSX10.9.sdk/System/Library/Frameworks -I/Applications/Xcode.app/Contents/Developer/Platforms/MacOSX.platform/Developer/SDKs/MacOSX10.9.sdk/System/Library/Frameworks/Cocoa.framework/Headers -I/tmp/ogre-4JyI/ogre_src_v1-7-4/OgreMain/src/nedmalloc    -pthread -o CMakeFiles/OgreMain.dir/src/OgreAnimationTrack.cpp.o -c /tmp/ogre-4JyI/ogre_src_v1-7-4/OgreMain/src/OgreAnimationTrack.cpp
  266. Building CXX object OgreMain/CMakeFiles/OgreMain.dir/src/OgreAutoParamDataSource.cpp.o
  267. cd /tmp/ogre-4JyI/ogre_src_v1-7-4/build/OgreMain && /usr/local/Library/ENV/4.3/clang++   -DBOOST_ALL_NO_LIB -DFREEIMAGE_LIB -DOGRE_NONCLIENT_BUILD -DOgreMain_EXPORTS -D_MT -D_USRDLL -arch x86_64 -isysroot /Applications/Xcode.app/Contents/Developer/Platforms/MacOSX.platform/Developer/SDKs/MacOSX10.9.sdk -fPIC -I/tmp/ogre-4JyI/ogre_src_v1-7-4/OgreMain/include -I/tmp/ogre-4JyI/ogre_src_v1-7-4/build/include -I/tmp/ogre-4JyI/ogre_src_v1-7-4/OgreMain/include/OSX -I/usr/local/include -I/opt/X11/include -I/tmp/ogre-4JyI/ogre_src_v1-7-4 -I/Applications/Xcode.app/Contents/Developer/Platforms/MacOSX.platform/Developer/SDKs/MacOSX10.9.sdk/System/Library/Frameworks/Carbon.framework/Headers -F/Applications/Xcode.app/Contents/Developer/Platforms/MacOSX.platform/Developer/SDKs/MacOSX10.9.sdk/System/Library/Frameworks -I/Applications/Xcode.app/Contents/Developer/Platforms/MacOSX.platform/Developer/SDKs/MacOSX10.9.sdk/System/Library/Frameworks/Cocoa.framework/Headers -I/tmp/ogre-4JyI/ogre_src_v1-7-4/OgreMain/src/nedmalloc    -pthread -o CMakeFiles/OgreMain.dir/src/OgreAutoParamDataSource.cpp.o -c /tmp/ogre-4JyI/ogre_src_v1-7-4/OgreMain/src/OgreAutoParamDataSource.cpp
  268. Building CXX object OgreMain/CMakeFiles/OgreMain.dir/src/OgreAxisAlignedBox.cpp.o
  269. cd /tmp/ogre-4JyI/ogre_src_v1-7-4/build/OgreMain && /usr/local/Library/ENV/4.3/clang++   -DBOOST_ALL_NO_LIB -DFREEIMAGE_LIB -DOGRE_NONCLIENT_BUILD -DOgreMain_EXPORTS -D_MT -D_USRDLL -arch x86_64 -isysroot /Applications/Xcode.app/Contents/Developer/Platforms/MacOSX.platform/Developer/SDKs/MacOSX10.9.sdk -fPIC -I/tmp/ogre-4JyI/ogre_src_v1-7-4/OgreMain/include -I/tmp/ogre-4JyI/ogre_src_v1-7-4/build/include -I/tmp/ogre-4JyI/ogre_src_v1-7-4/OgreMain/include/OSX -I/usr/local/include -I/opt/X11/include -I/tmp/ogre-4JyI/ogre_src_v1-7-4 -I/Applications/Xcode.app/Contents/Developer/Platforms/MacOSX.platform/Developer/SDKs/MacOSX10.9.sdk/System/Library/Frameworks/Carbon.framework/Headers -F/Applications/Xcode.app/Contents/Developer/Platforms/MacOSX.platform/Developer/SDKs/MacOSX10.9.sdk/System/Library/Frameworks -I/Applications/Xcode.app/Contents/Developer/Platforms/MacOSX.platform/Developer/SDKs/MacOSX10.9.sdk/System/Library/Frameworks/Cocoa.framework/Headers -I/tmp/ogre-4JyI/ogre_src_v1-7-4/OgreMain/src/nedmalloc    -pthread -o CMakeFiles/OgreMain.dir/src/OgreAxisAlignedBox.cpp.o -c /tmp/ogre-4JyI/ogre_src_v1-7-4/OgreMain/src/OgreAxisAlignedBox.cpp
  270. /usr/local/Cellar/cmake/2.8.12.2/bin/cmake -E cmake_progress_report /tmp/ogre-4JyI/ogre_src_v1-7-4/build/CMakeFiles
  271. [  2%] Building CXX object OgreMain/CMakeFiles/OgreMain.dir/src/OgreBillboard.cpp.o
  272. cd /tmp/ogre-4JyI/ogre_src_v1-7-4/build/OgreMain && /usr/local/Library/ENV/4.3/clang++   -DBOOST_ALL_NO_LIB -DFREEIMAGE_LIB -DOGRE_NONCLIENT_BUILD -DOgreMain_EXPORTS -D_MT -D_USRDLL -arch x86_64 -isysroot /Applications/Xcode.app/Contents/Developer/Platforms/MacOSX.platform/Developer/SDKs/MacOSX10.9.sdk -fPIC -I/tmp/ogre-4JyI/ogre_src_v1-7-4/OgreMain/include -I/tmp/ogre-4JyI/ogre_src_v1-7-4/build/include -I/tmp/ogre-4JyI/ogre_src_v1-7-4/OgreMain/include/OSX -I/usr/local/include -I/opt/X11/include -I/tmp/ogre-4JyI/ogre_src_v1-7-4 -I/Applications/Xcode.app/Contents/Developer/Platforms/MacOSX.platform/Developer/SDKs/MacOSX10.9.sdk/System/Library/Frameworks/Carbon.framework/Headers -F/Applications/Xcode.app/Contents/Developer/Platforms/MacOSX.platform/Developer/SDKs/MacOSX10.9.sdk/System/Library/Frameworks -I/Applications/Xcode.app/Contents/Developer/Platforms/MacOSX.platform/Developer/SDKs/MacOSX10.9.sdk/System/Library/Frameworks/Cocoa.framework/Headers -I/tmp/ogre-4JyI/ogre_src_v1-7-4/OgreMain/src/nedmalloc    -pthread -o CMakeFiles/OgreMain.dir/src/OgreBillboard.cpp.o -c /tmp/ogre-4JyI/ogre_src_v1-7-4/OgreMain/src/OgreBillboard.cpp
  273. /usr/local/Cellar/cmake/2.8.12.2/bin/cmake -E cmake_progress_report /tmp/ogre-4JyI/ogre_src_v1-7-4/build/CMakeFiles
  274. [  2%] Building CXX object OgreMain/CMakeFiles/OgreMain.dir/src/OgreBillboardChain.cpp.o
  275. cd /tmp/ogre-4JyI/ogre_src_v1-7-4/build/OgreMain && /usr/local/Library/ENV/4.3/clang++   -DBOOST_ALL_NO_LIB -DFREEIMAGE_LIB -DOGRE_NONCLIENT_BUILD -DOgreMain_EXPORTS -D_MT -D_USRDLL -arch x86_64 -isysroot /Applications/Xcode.app/Contents/Developer/Platforms/MacOSX.platform/Developer/SDKs/MacOSX10.9.sdk -fPIC -I/tmp/ogre-4JyI/ogre_src_v1-7-4/OgreMain/include -I/tmp/ogre-4JyI/ogre_src_v1-7-4/build/include -I/tmp/ogre-4JyI/ogre_src_v1-7-4/OgreMain/include/OSX -I/usr/local/include -I/opt/X11/include -I/tmp/ogre-4JyI/ogre_src_v1-7-4 -I/Applications/Xcode.app/Contents/Developer/Platforms/MacOSX.platform/Developer/SDKs/MacOSX10.9.sdk/System/Library/Frameworks/Carbon.framework/Headers -F/Applications/Xcode.app/Contents/Developer/Platforms/MacOSX.platform/Developer/SDKs/MacOSX10.9.sdk/System/Library/Frameworks -I/Applications/Xcode.app/Contents/Developer/Platforms/MacOSX.platform/Developer/SDKs/MacOSX10.9.sdk/System/Library/Frameworks/Cocoa.framework/Headers -I/tmp/ogre-4JyI/ogre_src_v1-7-4/OgreMain/src/nedmalloc    -pthread -o CMakeFiles/OgreMain.dir/src/OgreBillboardChain.cpp.o -c /tmp/ogre-4JyI/ogre_src_v1-7-4/OgreMain/src/OgreBillboardChain.cpp
  276. /usr/local/Cellar/cmake/2.8.12.2/bin/cmake -E cmake_progress_report /tmp/ogre-4JyI/ogre_src_v1-7-4/build/CMakeFiles
  277. [  2%] Building CXX object OgreMain/CMakeFiles/OgreMain.dir/src/OgreBillboardParticleRenderer.cpp.o
  278. cd /tmp/ogre-4JyI/ogre_src_v1-7-4/build/OgreMain && /usr/local/Library/ENV/4.3/clang++   -DBOOST_ALL_NO_LIB -DFREEIMAGE_LIB -DOGRE_NONCLIENT_BUILD -DOgreMain_EXPORTS -D_MT -D_USRDLL -arch x86_64 -isysroot /Applications/Xcode.app/Contents/Developer/Platforms/MacOSX.platform/Developer/SDKs/MacOSX10.9.sdk -fPIC -I/tmp/ogre-4JyI/ogre_src_v1-7-4/OgreMain/include -I/tmp/ogre-4JyI/ogre_src_v1-7-4/build/include -I/tmp/ogre-4JyI/ogre_src_v1-7-4/OgreMain/include/OSX -I/usr/local/include -I/opt/X11/include -I/tmp/ogre-4JyI/ogre_src_v1-7-4 -I/Applications/Xcode.app/Contents/Developer/Platforms/MacOSX.platform/Developer/SDKs/MacOSX10.9.sdk/System/Library/Frameworks/Carbon.framework/Headers -F/Applications/Xcode.app/Contents/Developer/Platforms/MacOSX.platform/Developer/SDKs/MacOSX10.9.sdk/System/Library/Frameworks -I/Applications/Xcode.app/Contents/Developer/Platforms/MacOSX.platform/Developer/SDKs/MacOSX10.9.sdk/System/Library/Frameworks/Cocoa.framework/Headers -I/tmp/ogre-4JyI/ogre_src_v1-7-4/OgreMain/src/nedmalloc    -pthread -o CMakeFiles/OgreMain.dir/src/OgreBillboardParticleRenderer.cpp.o -c /tmp/ogre-4JyI/ogre_src_v1-7-4/OgreMain/src/OgreBillboardParticleRenderer.cpp
  279. /usr/local/Cellar/cmake/2.8.12.2/bin/cmake -E cmake_progress_report /tmp/ogre-4JyI/ogre_src_v1-7-4/build/CMakeFiles 3
  280. [  3%] Building CXX object OgreMain/CMakeFiles/OgreMain.dir/src/OgreBillboardSet.cpp.o
  281. cd /tmp/ogre-4JyI/ogre_src_v1-7-4/build/OgreMain && /usr/local/Library/ENV/4.3/clang++   -DBOOST_ALL_NO_LIB -DFREEIMAGE_LIB -DOGRE_NONCLIENT_BUILD -DOgreMain_EXPORTS -D_MT -D_USRDLL -arch x86_64 -isysroot /Applications/Xcode.app/Contents/Developer/Platforms/MacOSX.platform/Developer/SDKs/MacOSX10.9.sdk -fPIC -I/tmp/ogre-4JyI/ogre_src_v1-7-4/OgreMain/include -I/tmp/ogre-4JyI/ogre_src_v1-7-4/build/include -I/tmp/ogre-4JyI/ogre_src_v1-7-4/OgreMain/include/OSX -I/usr/local/include -I/opt/X11/include -I/tmp/ogre-4JyI/ogre_src_v1-7-4 -I/Applications/Xcode.app/Contents/Developer/Platforms/MacOSX.platform/Developer/SDKs/MacOSX10.9.sdk/System/Library/Frameworks/Carbon.framework/Headers -F/Applications/Xcode.app/Contents/Developer/Platforms/MacOSX.platform/Developer/SDKs/MacOSX10.9.sdk/System/Library/Frameworks -I/Applications/Xcode.app/Contents/Developer/Platforms/MacOSX.platform/Developer/SDKs/MacOSX10.9.sdk/System/Library/Frameworks/Cocoa.framework/Headers -I/tmp/ogre-4JyI/ogre_src_v1-7-4/OgreMain/src/nedmalloc    -pthread -o CMakeFiles/OgreMain.dir/src/OgreBillboardSet.cpp.o -c /tmp/ogre-4JyI/ogre_src_v1-7-4/OgreMain/src/OgreBillboardSet.cpp
  282. /usr/local/Cellar/cmake/2.8.12.2/bin/cmake -E cmake_progress_report /tmp/ogre-4JyI/ogre_src_v1-7-4/build/CMakeFiles
  283. [  3%] Building CXX object OgreMain/CMakeFiles/OgreMain.dir/src/OgreBone.cpp.o
  284. cd /tmp/ogre-4JyI/ogre_src_v1-7-4/build/OgreMain && /usr/local/Library/ENV/4.3/clang++   -DBOOST_ALL_NO_LIB -DFREEIMAGE_LIB -DOGRE_NONCLIENT_BUILD -DOgreMain_EXPORTS -D_MT -D_USRDLL -arch x86_64 -isysroot /Applications/Xcode.app/Contents/Developer/Platforms/MacOSX.platform/Developer/SDKs/MacOSX10.9.sdk -fPIC -I/tmp/ogre-4JyI/ogre_src_v1-7-4/OgreMain/include -I/tmp/ogre-4JyI/ogre_src_v1-7-4/build/include -I/tmp/ogre-4JyI/ogre_src_v1-7-4/OgreMain/include/OSX -I/usr/local/include -I/opt/X11/include -I/tmp/ogre-4JyI/ogre_src_v1-7-4 -I/Applications/Xcode.app/Contents/Developer/Platforms/MacOSX.platform/Developer/SDKs/MacOSX10.9.sdk/System/Library/Frameworks/Carbon.framework/Headers -F/Applications/Xcode.app/Contents/Developer/Platforms/MacOSX.platform/Developer/SDKs/MacOSX10.9.sdk/System/Library/Frameworks -I/Applications/Xcode.app/Contents/Developer/Platforms/MacOSX.platform/Developer/SDKs/MacOSX10.9.sdk/System/Library/Frameworks/Cocoa.framework/Headers -I/tmp/ogre-4JyI/ogre_src_v1-7-4/OgreMain/src/nedmalloc    -pthread -o CMakeFiles/OgreMain.dir/src/OgreBone.cpp.o -c /tmp/ogre-4JyI/ogre_src_v1-7-4/OgreMain/src/OgreBone.cpp
  285. /usr/local/Cellar/cmake/2.8.12.2/bin/cmake -E cmake_progress_report /tmp/ogre-4JyI/ogre_src_v1-7-4/build/CMakeFiles
  286. [  3%] Building CXX object OgreMain/CMakeFiles/OgreMain.dir/src/OgreBorderPanelOverlayElement.cpp.o
  287. cd /tmp/ogre-4JyI/ogre_src_v1-7-4/build/OgreMain && /usr/local/Library/ENV/4.3/clang++   -DBOOST_ALL_NO_LIB -DFREEIMAGE_LIB -DOGRE_NONCLIENT_BUILD -DOgreMain_EXPORTS -D_MT -D_USRDLL -arch x86_64 -isysroot /Applications/Xcode.app/Contents/Developer/Platforms/MacOSX.platform/Developer/SDKs/MacOSX10.9.sdk -fPIC -I/tmp/ogre-4JyI/ogre_src_v1-7-4/OgreMain/include -I/tmp/ogre-4JyI/ogre_src_v1-7-4/build/include -I/tmp/ogre-4JyI/ogre_src_v1-7-4/OgreMain/include/OSX -I/usr/local/include -I/opt/X11/include -I/tmp/ogre-4JyI/ogre_src_v1-7-4 -I/Applications/Xcode.app/Contents/Developer/Platforms/MacOSX.platform/Developer/SDKs/MacOSX10.9.sdk/System/Library/Frameworks/Carbon.framework/Headers -F/Applications/Xcode.app/Contents/Developer/Platforms/MacOSX.platform/Developer/SDKs/MacOSX10.9.sdk/System/Library/Frameworks -I/Applications/Xcode.app/Contents/Developer/Platforms/MacOSX.platform/Developer/SDKs/MacOSX10.9.sdk/System/Library/Frameworks/Cocoa.framework/Headers -I/tmp/ogre-4JyI/ogre_src_v1-7-4/OgreMain/src/nedmalloc    -pthread -o CMakeFiles/OgreMain.dir/src/OgreBorderPanelOverlayElement.cpp.o -c /tmp/ogre-4JyI/ogre_src_v1-7-4/OgreMain/src/OgreBorderPanelOverlayElement.cpp
  288. /usr/local/Cellar/cmake/2.8.12.2/bin/cmake -E cmake_progress_report /tmp/ogre-4JyI/ogre_src_v1-7-4/build/CMakeFiles
  289. [  3%] Building CXX object OgreMain/CMakeFiles/OgreMain.dir/src/OgreCamera.cpp.o
  290. cd /tmp/ogre-4JyI/ogre_src_v1-7-4/build/OgreMain && /usr/local/Library/ENV/4.3/clang++   -DBOOST_ALL_NO_LIB -DFREEIMAGE_LIB -DOGRE_NONCLIENT_BUILD -DOgreMain_EXPORTS -D_MT -D_USRDLL -arch x86_64 -isysroot /Applications/Xcode.app/Contents/Developer/Platforms/MacOSX.platform/Developer/SDKs/MacOSX10.9.sdk -fPIC -I/tmp/ogre-4JyI/ogre_src_v1-7-4/OgreMain/include -I/tmp/ogre-4JyI/ogre_src_v1-7-4/build/include -I/tmp/ogre-4JyI/ogre_src_v1-7-4/OgreMain/include/OSX -I/usr/local/include -I/opt/X11/include -I/tmp/ogre-4JyI/ogre_src_v1-7-4 -I/Applications/Xcode.app/Contents/Developer/Platforms/MacOSX.platform/Developer/SDKs/MacOSX10.9.sdk/System/Library/Frameworks/Carbon.framework/Headers -F/Applications/Xcode.app/Contents/Developer/Platforms/MacOSX.platform/Developer/SDKs/MacOSX10.9.sdk/System/Library/Frameworks -I/Applications/Xcode.app/Contents/Developer/Platforms/MacOSX.platform/Developer/SDKs/MacOSX10.9.sdk/System/Library/Frameworks/Cocoa.framework/Headers -I/tmp/ogre-4JyI/ogre_src_v1-7-4/OgreMain/src/nedmalloc    -pthread -o CMakeFiles/OgreMain.dir/src/OgreCamera.cpp.o -c /tmp/ogre-4JyI/ogre_src_v1-7-4/OgreMain/src/OgreCamera.cpp
  291. /usr/local/Cellar/cmake/2.8.12.2/bin/cmake -E cmake_progress_report /tmp/ogre-4JyI/ogre_src_v1-7-4/build/CMakeFiles 4
  292. [  4%] Building CXX object OgreMain/CMakeFiles/OgreMain.dir/src/OgreCodec.cpp.o
  293. cd /tmp/ogre-4JyI/ogre_src_v1-7-4/build/OgreMain && /usr/local/Library/ENV/4.3/clang++   -DBOOST_ALL_NO_LIB -DFREEIMAGE_LIB -DOGRE_NONCLIENT_BUILD -DOgreMain_EXPORTS -D_MT -D_USRDLL -arch x86_64 -isysroot /Applications/Xcode.app/Contents/Developer/Platforms/MacOSX.platform/Developer/SDKs/MacOSX10.9.sdk -fPIC -I/tmp/ogre-4JyI/ogre_src_v1-7-4/OgreMain/include -I/tmp/ogre-4JyI/ogre_src_v1-7-4/build/include -I/tmp/ogre-4JyI/ogre_src_v1-7-4/OgreMain/include/OSX -I/usr/local/include -I/opt/X11/include -I/tmp/ogre-4JyI/ogre_src_v1-7-4 -I/Applications/Xcode.app/Contents/Developer/Platforms/MacOSX.platform/Developer/SDKs/MacOSX10.9.sdk/System/Library/Frameworks/Carbon.framework/Headers -F/Applications/Xcode.app/Contents/Developer/Platforms/MacOSX.platform/Developer/SDKs/MacOSX10.9.sdk/System/Library/Frameworks -I/Applications/Xcode.app/Contents/Developer/Platforms/MacOSX.platform/Developer/SDKs/MacOSX10.9.sdk/System/Library/Frameworks/Cocoa.framework/Headers -I/tmp/ogre-4JyI/ogre_src_v1-7-4/OgreMain/src/nedmalloc    -pthread -o CMakeFiles/OgreMain.dir/src/OgreCodec.cpp.o -c /tmp/ogre-4JyI/ogre_src_v1-7-4/OgreMain/src/OgreCodec.cpp
  294. /usr/local/Cellar/cmake/2.8.12.2/bin/cmake -E cmake_progress_report /tmp/ogre-4JyI/ogre_src_v1-7-4/build/CMakeFiles
  295. [  4%] Building CXX object OgreMain/CMakeFiles/OgreMain.dir/src/OgreColourValue.cpp.o
  296. cd /tmp/ogre-4JyI/ogre_src_v1-7-4/build/OgreMain && /usr/local/Library/ENV/4.3/clang++   -DBOOST_ALL_NO_LIB -DFREEIMAGE_LIB -DOGRE_NONCLIENT_BUILD -DOgreMain_EXPORTS -D_MT -D_USRDLL -arch x86_64 -isysroot /Applications/Xcode.app/Contents/Developer/Platforms/MacOSX.platform/Developer/SDKs/MacOSX10.9.sdk -fPIC -I/tmp/ogre-4JyI/ogre_src_v1-7-4/OgreMain/include -I/tmp/ogre-4JyI/ogre_src_v1-7-4/build/include -I/tmp/ogre-4JyI/ogre_src_v1-7-4/OgreMain/include/OSX -I/usr/local/include -I/opt/X11/include -I/tmp/ogre-4JyI/ogre_src_v1-7-4 -I/Applications/Xcode.app/Contents/Developer/Platforms/MacOSX.platform/Developer/SDKs/MacOSX10.9.sdk/System/Library/Frameworks/Carbon.framework/Headers -F/Applications/Xcode.app/Contents/Developer/Platforms/MacOSX.platform/Developer/SDKs/MacOSX10.9.sdk/System/Library/Frameworks -I/Applications/Xcode.app/Contents/Developer/Platforms/MacOSX.platform/Developer/SDKs/MacOSX10.9.sdk/System/Library/Frameworks/Cocoa.framework/Headers -I/tmp/ogre-4JyI/ogre_src_v1-7-4/OgreMain/src/nedmalloc    -pthread -o CMakeFiles/OgreMain.dir/src/OgreColourValue.cpp.o -c /tmp/ogre-4JyI/ogre_src_v1-7-4/OgreMain/src/OgreColourValue.cpp
  297. /usr/local/Cellar/cmake/2.8.12.2/bin/cmake -E cmake_progress_report /tmp/ogre-4JyI/ogre_src_v1-7-4/build/CMakeFiles
  298. [  4%] Building CXX object OgreMain/CMakeFiles/OgreMain.dir/src/OgreCommon.cpp.o
  299. cd /tmp/ogre-4JyI/ogre_src_v1-7-4/build/OgreMain && /usr/local/Library/ENV/4.3/clang++   -DBOOST_ALL_NO_LIB -DFREEIMAGE_LIB -DOGRE_NONCLIENT_BUILD -DOgreMain_EXPORTS -D_MT -D_USRDLL -arch x86_64 -isysroot /Applications/Xcode.app/Contents/Developer/Platforms/MacOSX.platform/Developer/SDKs/MacOSX10.9.sdk -fPIC -I/tmp/ogre-4JyI/ogre_src_v1-7-4/OgreMain/include -I/tmp/ogre-4JyI/ogre_src_v1-7-4/build/include -I/tmp/ogre-4JyI/ogre_src_v1-7-4/OgreMain/include/OSX -I/usr/local/include -I/opt/X11/include -I/tmp/ogre-4JyI/ogre_src_v1-7-4 -I/Applications/Xcode.app/Contents/Developer/Platforms/MacOSX.platform/Developer/SDKs/MacOSX10.9.sdk/System/Library/Frameworks/Carbon.framework/Headers -F/Applications/Xcode.app/Contents/Developer/Platforms/MacOSX.platform/Developer/SDKs/MacOSX10.9.sdk/System/Library/Frameworks -I/Applications/Xcode.app/Contents/Developer/Platforms/MacOSX.platform/Developer/SDKs/MacOSX10.9.sdk/System/Library/Frameworks/Cocoa.framework/Headers -I/tmp/ogre-4JyI/ogre_src_v1-7-4/OgreMain/src/nedmalloc    -pthread -o CMakeFiles/OgreMain.dir/src/OgreCommon.cpp.o -c /tmp/ogre-4JyI/ogre_src_v1-7-4/OgreMain/src/OgreCommon.cpp
  300. /usr/local/Cellar/cmake/2.8.12.2/bin/cmake -E cmake_progress_report /tmp/ogre-4JyI/ogre_src_v1-7-4/build/CMakeFiles 5
  301. [  5%] Building CXX object OgreMain/CMakeFiles/OgreMain.dir/src/OgreCompositionPass.cpp.o
  302. cd /tmp/ogre-4JyI/ogre_src_v1-7-4/build/OgreMain && /usr/local/Library/ENV/4.3/clang++   -DBOOST_ALL_NO_LIB -DFREEIMAGE_LIB -DOGRE_NONCLIENT_BUILD -DOgreMain_EXPORTS -D_MT -D_USRDLL -arch x86_64 -isysroot /Applications/Xcode.app/Contents/Developer/Platforms/MacOSX.platform/Developer/SDKs/MacOSX10.9.sdk -fPIC -I/tmp/ogre-4JyI/ogre_src_v1-7-4/OgreMain/include -I/tmp/ogre-4JyI/ogre_src_v1-7-4/build/include -I/tmp/ogre-4JyI/ogre_src_v1-7-4/OgreMain/include/OSX -I/usr/local/include -I/opt/X11/include -I/tmp/ogre-4JyI/ogre_src_v1-7-4 -I/Applications/Xcode.app/Contents/Developer/Platforms/MacOSX.platform/Developer/SDKs/MacOSX10.9.sdk/System/Library/Frameworks/Carbon.framework/Headers -F/Applications/Xcode.app/Contents/Developer/Platforms/MacOSX.platform/Developer/SDKs/MacOSX10.9.sdk/System/Library/Frameworks -I/Applications/Xcode.app/Contents/Developer/Platforms/MacOSX.platform/Developer/SDKs/MacOSX10.9.sdk/System/Library/Frameworks/Cocoa.framework/Headers -I/tmp/ogre-4JyI/ogre_src_v1-7-4/OgreMain/src/nedmalloc    -pthread -o CMakeFiles/OgreMain.dir/src/OgreCompositionPass.cpp.o -c /tmp/ogre-4JyI/ogre_src_v1-7-4/OgreMain/src/OgreCompositionPass.cpp
  303. /usr/local/Cellar/cmake/2.8.12.2/bin/cmake -E cmake_progress_report /tmp/ogre-4JyI/ogre_src_v1-7-4/build/CMakeFiles
  304. [  5%] Building CXX object OgreMain/CMakeFiles/OgreMain.dir/src/OgreCompositionTargetPass.cpp.o
  305. cd /tmp/ogre-4JyI/ogre_src_v1-7-4/build/OgreMain && /usr/local/Library/ENV/4.3/clang++   -DBOOST_ALL_NO_LIB -DFREEIMAGE_LIB -DOGRE_NONCLIENT_BUILD -DOgreMain_EXPORTS -D_MT -D_USRDLL -arch x86_64 -isysroot /Applications/Xcode.app/Contents/Developer/Platforms/MacOSX.platform/Developer/SDKs/MacOSX10.9.sdk -fPIC -I/tmp/ogre-4JyI/ogre_src_v1-7-4/OgreMain/include -I/tmp/ogre-4JyI/ogre_src_v1-7-4/build/include -I/tmp/ogre-4JyI/ogre_src_v1-7-4/OgreMain/include/OSX -I/usr/local/include -I/opt/X11/include -I/tmp/ogre-4JyI/ogre_src_v1-7-4 -I/Applications/Xcode.app/Contents/Developer/Platforms/MacOSX.platform/Developer/SDKs/MacOSX10.9.sdk/System/Library/Frameworks/Carbon.framework/Headers -F/Applications/Xcode.app/Contents/Developer/Platforms/MacOSX.platform/Developer/SDKs/MacOSX10.9.sdk/System/Library/Frameworks -I/Applications/Xcode.app/Contents/Developer/Platforms/MacOSX.platform/Developer/SDKs/MacOSX10.9.sdk/System/Library/Frameworks/Cocoa.framework/Headers -I/tmp/ogre-4JyI/ogre_src_v1-7-4/OgreMain/src/nedmalloc    -pthread -o CMakeFiles/OgreMain.dir/src/OgreCompositionTargetPass.cpp.o -c /tmp/ogre-4JyI/ogre_src_v1-7-4/OgreMain/src/OgreCompositionTargetPass.cpp
  306. /usr/local/Cellar/cmake/2.8.12.2/bin/cmake -E cmake_progress_report /tmp/ogre-4JyI/ogre_src_v1-7-4/build/CMakeFiles
  307. [  5%] Building CXX object OgreMain/CMakeFiles/OgreMain.dir/src/OgreCompositionTechnique.cpp.o
  308. cd /tmp/ogre-4JyI/ogre_src_v1-7-4/build/OgreMain && /usr/local/Library/ENV/4.3/clang++   -DBOOST_ALL_NO_LIB -DFREEIMAGE_LIB -DOGRE_NONCLIENT_BUILD -DOgreMain_EXPORTS -D_MT -D_USRDLL -arch x86_64 -isysroot /Applications/Xcode.app/Contents/Developer/Platforms/MacOSX.platform/Developer/SDKs/MacOSX10.9.sdk -fPIC -I/tmp/ogre-4JyI/ogre_src_v1-7-4/OgreMain/include -I/tmp/ogre-4JyI/ogre_src_v1-7-4/build/include -I/tmp/ogre-4JyI/ogre_src_v1-7-4/OgreMain/include/OSX -I/usr/local/include -I/opt/X11/include -I/tmp/ogre-4JyI/ogre_src_v1-7-4 -I/Applications/Xcode.app/Contents/Developer/Platforms/MacOSX.platform/Developer/SDKs/MacOSX10.9.sdk/System/Library/Frameworks/Carbon.framework/Headers -F/Applications/Xcode.app/Contents/Developer/Platforms/MacOSX.platform/Developer/SDKs/MacOSX10.9.sdk/System/Library/Frameworks -I/Applications/Xcode.app/Contents/Developer/Platforms/MacOSX.platform/Developer/SDKs/MacOSX10.9.sdk/System/Library/Frameworks/Cocoa.framework/Headers -I/tmp/ogre-4JyI/ogre_src_v1-7-4/OgreMain/src/nedmalloc    -pthread -o CMakeFiles/OgreMain.dir/src/OgreCompositionTechnique.cpp.o -c /tmp/ogre-4JyI/ogre_src_v1-7-4/OgreMain/src/OgreCompositionTechnique.cpp
  309. /usr/local/Cellar/cmake/2.8.12.2/bin/cmake -E cmake_progress_report /tmp/ogre-4JyI/ogre_src_v1-7-4/build/CMakeFiles
  310. [  5%] Building CXX object OgreMain/CMakeFiles/OgreMain.dir/src/OgreCompositor.cpp.o
  311. cd /tmp/ogre-4JyI/ogre_src_v1-7-4/build/OgreMain && /usr/local/Library/ENV/4.3/clang++   -DBOOST_ALL_NO_LIB -DFREEIMAGE_LIB -DOGRE_NONCLIENT_BUILD -DOgreMain_EXPORTS -D_MT -D_USRDLL -arch x86_64 -isysroot /Applications/Xcode.app/Contents/Developer/Platforms/MacOSX.platform/Developer/SDKs/MacOSX10.9.sdk -fPIC -I/tmp/ogre-4JyI/ogre_src_v1-7-4/OgreMain/include -I/tmp/ogre-4JyI/ogre_src_v1-7-4/build/include -I/tmp/ogre-4JyI/ogre_src_v1-7-4/OgreMain/include/OSX -I/usr/local/include -I/opt/X11/include -I/tmp/ogre-4JyI/ogre_src_v1-7-4 -I/Applications/Xcode.app/Contents/Developer/Platforms/MacOSX.platform/Developer/SDKs/MacOSX10.9.sdk/System/Library/Frameworks/Carbon.framework/Headers -F/Applications/Xcode.app/Contents/Developer/Platforms/MacOSX.platform/Developer/SDKs/MacOSX10.9.sdk/System/Library/Frameworks -I/Applications/Xcode.app/Contents/Developer/Platforms/MacOSX.platform/Developer/SDKs/MacOSX10.9.sdk/System/Library/Frameworks/Cocoa.framework/Headers -I/tmp/ogre-4JyI/ogre_src_v1-7-4/OgreMain/src/nedmalloc    -pthread -o CMakeFiles/OgreMain.dir/src/OgreCompositor.cpp.o -c /tmp/ogre-4JyI/ogre_src_v1-7-4/OgreMain/src/OgreCompositor.cpp
  312. /usr/local/Cellar/cmake/2.8.12.2/bin/cmake -E cmake_progress_report /tmp/ogre-4JyI/ogre_src_v1-7-4/build/CMakeFiles 6
  313. [  6%] Building CXX object OgreMain/CMakeFiles/OgreMain.dir/src/OgreCompositorChain.cpp.o
  314. cd /tmp/ogre-4JyI/ogre_src_v1-7-4/build/OgreMain && /usr/local/Library/ENV/4.3/clang++   -DBOOST_ALL_NO_LIB -DFREEIMAGE_LIB -DOGRE_NONCLIENT_BUILD -DOgreMain_EXPORTS -D_MT -D_USRDLL -arch x86_64 -isysroot /Applications/Xcode.app/Contents/Developer/Platforms/MacOSX.platform/Developer/SDKs/MacOSX10.9.sdk -fPIC -I/tmp/ogre-4JyI/ogre_src_v1-7-4/OgreMain/include -I/tmp/ogre-4JyI/ogre_src_v1-7-4/build/include -I/tmp/ogre-4JyI/ogre_src_v1-7-4/OgreMain/include/OSX -I/usr/local/include -I/opt/X11/include -I/tmp/ogre-4JyI/ogre_src_v1-7-4 -I/Applications/Xcode.app/Contents/Developer/Platforms/MacOSX.platform/Developer/SDKs/MacOSX10.9.sdk/System/Library/Frameworks/Carbon.framework/Headers -F/Applications/Xcode.app/Contents/Developer/Platforms/MacOSX.platform/Developer/SDKs/MacOSX10.9.sdk/System/Library/Frameworks -I/Applications/Xcode.app/Contents/Developer/Platforms/MacOSX.platform/Developer/SDKs/MacOSX10.9.sdk/System/Library/Frameworks/Cocoa.framework/Headers -I/tmp/ogre-4JyI/ogre_src_v1-7-4/OgreMain/src/nedmalloc    -pthread -o CMakeFiles/OgreMain.dir/src/OgreCompositorChain.cpp.o -c /tmp/ogre-4JyI/ogre_src_v1-7-4/OgreMain/src/OgreCompositorChain.cpp
  315. /usr/local/Cellar/cmake/2.8.12.2/bin/cmake -E cmake_progress_report /tmp/ogre-4JyI/ogre_src_v1-7-4/build/CMakeFiles
  316. [  6%] Building CXX object OgreMain/CMakeFiles/OgreMain.dir/src/OgreCompositorInstance.cpp.o
  317. cd /tmp/ogre-4JyI/ogre_src_v1-7-4/build/OgreMain && /usr/local/Library/ENV/4.3/clang++   -DBOOST_ALL_NO_LIB -DFREEIMAGE_LIB -DOGRE_NONCLIENT_BUILD -DOgreMain_EXPORTS -D_MT -D_USRDLL -arch x86_64 -isysroot /Applications/Xcode.app/Contents/Developer/Platforms/MacOSX.platform/Developer/SDKs/MacOSX10.9.sdk -fPIC -I/tmp/ogre-4JyI/ogre_src_v1-7-4/OgreMain/include -I/tmp/ogre-4JyI/ogre_src_v1-7-4/build/include -I/tmp/ogre-4JyI/ogre_src_v1-7-4/OgreMain/include/OSX -I/usr/local/include -I/opt/X11/include -I/tmp/ogre-4JyI/ogre_src_v1-7-4 -I/Applications/Xcode.app/Contents/Developer/Platforms/MacOSX.platform/Developer/SDKs/MacOSX10.9.sdk/System/Library/Frameworks/Carbon.framework/Headers -F/Applications/Xcode.app/Contents/Developer/Platforms/MacOSX.platform/Developer/SDKs/MacOSX10.9.sdk/System/Library/Frameworks -I/Applications/Xcode.app/Contents/Developer/Platforms/MacOSX.platform/Developer/SDKs/MacOSX10.9.sdk/System/Library/Frameworks/Cocoa.framework/Headers -I/tmp/ogre-4JyI/ogre_src_v1-7-4/OgreMain/src/nedmalloc    -pthread -o CMakeFiles/OgreMain.dir/src/OgreCompositorInstance.cpp.o -c /tmp/ogre-4JyI/ogre_src_v1-7-4/OgreMain/src/OgreCompositorInstance.cpp
  318. /usr/local/Cellar/cmake/2.8.12.2/bin/cmake -E cmake_progress_report /tmp/ogre-4JyI/ogre_src_v1-7-4/build/CMakeFiles
  319. [  6%] Building CXX object OgreMain/CMakeFiles/OgreMain.dir/src/OgreCompositorManager.cpp.o
  320. cd /tmp/ogre-4JyI/ogre_src_v1-7-4/build/OgreMain && /usr/local/Library/ENV/4.3/clang++   -DBOOST_ALL_NO_LIB -DFREEIMAGE_LIB -DOGRE_NONCLIENT_BUILD -DOgreMain_EXPORTS -D_MT -D_USRDLL -arch x86_64 -isysroot /Applications/Xcode.app/Contents/Developer/Platforms/MacOSX.platform/Developer/SDKs/MacOSX10.9.sdk -fPIC -I/tmp/ogre-4JyI/ogre_src_v1-7-4/OgreMain/include -I/tmp/ogre-4JyI/ogre_src_v1-7-4/build/include -I/tmp/ogre-4JyI/ogre_src_v1-7-4/OgreMain/include/OSX -I/usr/local/include -I/opt/X11/include -I/tmp/ogre-4JyI/ogre_src_v1-7-4 -I/Applications/Xcode.app/Contents/Developer/Platforms/MacOSX.platform/Developer/SDKs/MacOSX10.9.sdk/System/Library/Frameworks/Carbon.framework/Headers -F/Applications/Xcode.app/Contents/Developer/Platforms/MacOSX.platform/Developer/SDKs/MacOSX10.9.sdk/System/Library/Frameworks -I/Applications/Xcode.app/Contents/Developer/Platforms/MacOSX.platform/Developer/SDKs/MacOSX10.9.sdk/System/Library/Frameworks/Cocoa.framework/Headers -I/tmp/ogre-4JyI/ogre_src_v1-7-4/OgreMain/src/nedmalloc    -pthread -o CMakeFiles/OgreMain.dir/src/OgreCompositorManager.cpp.o -c /tmp/ogre-4JyI/ogre_src_v1-7-4/OgreMain/src/OgreCompositorManager.cpp
  321. /usr/local/Cellar/cmake/2.8.12.2/bin/cmake -E cmake_progress_report /tmp/ogre-4JyI/ogre_src_v1-7-4/build/CMakeFiles
  322. [  6%] Building CXX object OgreMain/CMakeFiles/OgreMain.dir/src/OgreConfigFile.cpp.o
  323. cd /tmp/ogre-4JyI/ogre_src_v1-7-4/build/OgreMain && /usr/local/Library/ENV/4.3/clang++   -DBOOST_ALL_NO_LIB -DFREEIMAGE_LIB -DOGRE_NONCLIENT_BUILD -DOgreMain_EXPORTS -D_MT -D_USRDLL -arch x86_64 -isysroot /Applications/Xcode.app/Contents/Developer/Platforms/MacOSX.platform/Developer/SDKs/MacOSX10.9.sdk -fPIC -I/tmp/ogre-4JyI/ogre_src_v1-7-4/OgreMain/include -I/tmp/ogre-4JyI/ogre_src_v1-7-4/build/include -I/tmp/ogre-4JyI/ogre_src_v1-7-4/OgreMain/include/OSX -I/usr/local/include -I/opt/X11/include -I/tmp/ogre-4JyI/ogre_src_v1-7-4 -I/Applications/Xcode.app/Contents/Developer/Platforms/MacOSX.platform/Developer/SDKs/MacOSX10.9.sdk/System/Library/Frameworks/Carbon.framework/Headers -F/Applications/Xcode.app/Contents/Developer/Platforms/MacOSX.platform/Developer/SDKs/MacOSX10.9.sdk/System/Library/Frameworks -I/Applications/Xcode.app/Contents/Developer/Platforms/MacOSX.platform/Developer/SDKs/MacOSX10.9.sdk/System/Library/Frameworks/Cocoa.framework/Headers -I/tmp/ogre-4JyI/ogre_src_v1-7-4/OgreMain/src/nedmalloc    -pthread -o CMakeFiles/OgreMain.dir/src/OgreConfigFile.cpp.o -c /tmp/ogre-4JyI/ogre_src_v1-7-4/OgreMain/src/OgreConfigFile.cpp
  324. /usr/local/Cellar/cmake/2.8.12.2/bin/cmake -E cmake_progress_report /tmp/ogre-4JyI/ogre_src_v1-7-4/build/CMakeFiles 7
  325. [  7%] Building CXX object OgreMain/CMakeFiles/OgreMain.dir/src/OgreControllerManager.cpp.o
  326. cd /tmp/ogre-4JyI/ogre_src_v1-7-4/build/OgreMain && /usr/local/Library/ENV/4.3/clang++   -DBOOST_ALL_NO_LIB -DFREEIMAGE_LIB -DOGRE_NONCLIENT_BUILD -DOgreMain_EXPORTS -D_MT -D_USRDLL -arch x86_64 -isysroot /Applications/Xcode.app/Contents/Developer/Platforms/MacOSX.platform/Developer/SDKs/MacOSX10.9.sdk -fPIC -I/tmp/ogre-4JyI/ogre_src_v1-7-4/OgreMain/include -I/tmp/ogre-4JyI/ogre_src_v1-7-4/build/include -I/tmp/ogre-4JyI/ogre_src_v1-7-4/OgreMain/include/OSX -I/usr/local/include -I/opt/X11/include -I/tmp/ogre-4JyI/ogre_src_v1-7-4 -I/Applications/Xcode.app/Contents/Developer/Platforms/MacOSX.platform/Developer/SDKs/MacOSX10.9.sdk/System/Library/Frameworks/Carbon.framework/Headers -F/Applications/Xcode.app/Contents/Developer/Platforms/MacOSX.platform/Developer/SDKs/MacOSX10.9.sdk/System/Library/Frameworks -I/Applications/Xcode.app/Contents/Developer/Platforms/MacOSX.platform/Developer/SDKs/MacOSX10.9.sdk/System/Library/Frameworks/Cocoa.framework/Headers -I/tmp/ogre-4JyI/ogre_src_v1-7-4/OgreMain/src/nedmalloc    -pthread -o CMakeFiles/OgreMain.dir/src/OgreControllerManager.cpp.o -c /tmp/ogre-4JyI/ogre_src_v1-7-4/OgreMain/src/OgreControllerManager.cpp
  327. /usr/local/Cellar/cmake/2.8.12.2/bin/cmake -E cmake_progress_report /tmp/ogre-4JyI/ogre_src_v1-7-4/build/CMakeFiles
  328. [  7%] Building CXX object OgreMain/CMakeFiles/OgreMain.dir/src/OgreConvexBody.cpp.o
  329. cd /tmp/ogre-4JyI/ogre_src_v1-7-4/build/OgreMain && /usr/local/Library/ENV/4.3/clang++   -DBOOST_ALL_NO_LIB -DFREEIMAGE_LIB -DOGRE_NONCLIENT_BUILD -DOgreMain_EXPORTS -D_MT -D_USRDLL -arch x86_64 -isysroot /Applications/Xcode.app/Contents/Developer/Platforms/MacOSX.platform/Developer/SDKs/MacOSX10.9.sdk -fPIC -I/tmp/ogre-4JyI/ogre_src_v1-7-4/OgreMain/include -I/tmp/ogre-4JyI/ogre_src_v1-7-4/build/include -I/tmp/ogre-4JyI/ogre_src_v1-7-4/OgreMain/include/OSX -I/usr/local/include -I/opt/X11/include -I/tmp/ogre-4JyI/ogre_src_v1-7-4 -I/Applications/Xcode.app/Contents/Developer/Platforms/MacOSX.platform/Developer/SDKs/MacOSX10.9.sdk/System/Library/Frameworks/Carbon.framework/Headers -F/Applications/Xcode.app/Contents/Developer/Platforms/MacOSX.platform/Developer/SDKs/MacOSX10.9.sdk/System/Library/Frameworks -I/Applications/Xcode.app/Contents/Developer/Platforms/MacOSX.platform/Developer/SDKs/MacOSX10.9.sdk/System/Library/Frameworks/Cocoa.framework/Headers -I/tmp/ogre-4JyI/ogre_src_v1-7-4/OgreMain/src/nedmalloc    -pthread -o CMakeFiles/OgreMain.dir/src/OgreConvexBody.cpp.o -c /tmp/ogre-4JyI/ogre_src_v1-7-4/OgreMain/src/OgreConvexBody.cpp
  330. /usr/local/Cellar/cmake/2.8.12.2/bin/cmake -E cmake_progress_report /tmp/ogre-4JyI/ogre_src_v1-7-4/build/CMakeFiles
  331. [  7%] Building CXX object OgreMain/CMakeFiles/OgreMain.dir/src/OgreDataStream.cpp.o
  332. cd /tmp/ogre-4JyI/ogre_src_v1-7-4/build/OgreMain && /usr/local/Library/ENV/4.3/clang++   -DBOOST_ALL_NO_LIB -DFREEIMAGE_LIB -DOGRE_NONCLIENT_BUILD -DOgreMain_EXPORTS -D_MT -D_USRDLL -arch x86_64 -isysroot /Applications/Xcode.app/Contents/Developer/Platforms/MacOSX.platform/Developer/SDKs/MacOSX10.9.sdk -fPIC -I/tmp/ogre-4JyI/ogre_src_v1-7-4/OgreMain/include -I/tmp/ogre-4JyI/ogre_src_v1-7-4/build/include -I/tmp/ogre-4JyI/ogre_src_v1-7-4/OgreMain/include/OSX -I/usr/local/include -I/opt/X11/include -I/tmp/ogre-4JyI/ogre_src_v1-7-4 -I/Applications/Xcode.app/Contents/Developer/Platforms/MacOSX.platform/Developer/SDKs/MacOSX10.9.sdk/System/Library/Frameworks/Carbon.framework/Headers -F/Applications/Xcode.app/Contents/Developer/Platforms/MacOSX.platform/Developer/SDKs/MacOSX10.9.sdk/System/Library/Frameworks -I/Applications/Xcode.app/Contents/Developer/Platforms/MacOSX.platform/Developer/SDKs/MacOSX10.9.sdk/System/Library/Frameworks/Cocoa.framework/Headers -I/tmp/ogre-4JyI/ogre_src_v1-7-4/OgreMain/src/nedmalloc    -pthread -o CMakeFiles/OgreMain.dir/src/OgreDataStream.cpp.o -c /tmp/ogre-4JyI/ogre_src_v1-7-4/OgreMain/src/OgreDataStream.cpp
  333. /usr/local/Cellar/cmake/2.8.12.2/bin/cmake -E cmake_progress_report /tmp/ogre-4JyI/ogre_src_v1-7-4/build/CMakeFiles
  334. [  7%] Building CXX object OgreMain/CMakeFiles/OgreMain.dir/src/OgreDefaultHardwareBufferManager.cpp.o
  335. cd /tmp/ogre-4JyI/ogre_src_v1-7-4/build/OgreMain && /usr/local/Library/ENV/4.3/clang++   -DBOOST_ALL_NO_LIB -DFREEIMAGE_LIB -DOGRE_NONCLIENT_BUILD -DOgreMain_EXPORTS -D_MT -D_USRDLL -arch x86_64 -isysroot /Applications/Xcode.app/Contents/Developer/Platforms/MacOSX.platform/Developer/SDKs/MacOSX10.9.sdk -fPIC -I/tmp/ogre-4JyI/ogre_src_v1-7-4/OgreMain/include -I/tmp/ogre-4JyI/ogre_src_v1-7-4/build/include -I/tmp/ogre-4JyI/ogre_src_v1-7-4/OgreMain/include/OSX -I/usr/local/include -I/opt/X11/include -I/tmp/ogre-4JyI/ogre_src_v1-7-4 -I/Applications/Xcode.app/Contents/Developer/Platforms/MacOSX.platform/Developer/SDKs/MacOSX10.9.sdk/System/Library/Frameworks/Carbon.framework/Headers -F/Applications/Xcode.app/Contents/Developer/Platforms/MacOSX.platform/Developer/SDKs/MacOSX10.9.sdk/System/Library/Frameworks -I/Applications/Xcode.app/Contents/Developer/Platforms/MacOSX.platform/Developer/SDKs/MacOSX10.9.sdk/System/Library/Frameworks/Cocoa.framework/Headers -I/tmp/ogre-4JyI/ogre_src_v1-7-4/OgreMain/src/nedmalloc    -pthread -o CMakeFiles/OgreMain.dir/src/OgreDefaultHardwareBufferManager.cpp.o -c /tmp/ogre-4JyI/ogre_src_v1-7-4/OgreMain/src/OgreDefaultHardwareBufferManager.cpp
  336. /usr/local/Cellar/cmake/2.8.12.2/bin/cmake -E cmake_progress_report /tmp/ogre-4JyI/ogre_src_v1-7-4/build/CMakeFiles 8
  337. [  8%] Building CXX object OgreMain/CMakeFiles/OgreMain.dir/src/OgreDefaultSceneQueries.cpp.o
  338. cd /tmp/ogre-4JyI/ogre_src_v1-7-4/build/OgreMain && /usr/local/Library/ENV/4.3/clang++   -DBOOST_ALL_NO_LIB -DFREEIMAGE_LIB -DOGRE_NONCLIENT_BUILD -DOgreMain_EXPORTS -D_MT -D_USRDLL -arch x86_64 -isysroot /Applications/Xcode.app/Contents/Developer/Platforms/MacOSX.platform/Developer/SDKs/MacOSX10.9.sdk -fPIC -I/tmp/ogre-4JyI/ogre_src_v1-7-4/OgreMain/include -I/tmp/ogre-4JyI/ogre_src_v1-7-4/build/include -I/tmp/ogre-4JyI/ogre_src_v1-7-4/OgreMain/include/OSX -I/usr/local/include -I/opt/X11/include -I/tmp/ogre-4JyI/ogre_src_v1-7-4 -I/Applications/Xcode.app/Contents/Developer/Platforms/MacOSX.platform/Developer/SDKs/MacOSX10.9.sdk/System/Library/Frameworks/Carbon.framework/Headers -F/Applications/Xcode.app/Contents/Developer/Platforms/MacOSX.platform/Developer/SDKs/MacOSX10.9.sdk/System/Library/Frameworks -I/Applications/Xcode.app/Contents/Developer/Platforms/MacOSX.platform/Developer/SDKs/MacOSX10.9.sdk/System/Library/Frameworks/Cocoa.framework/Headers -I/tmp/ogre-4JyI/ogre_src_v1-7-4/OgreMain/src/nedmalloc    -pthread -o CMakeFiles/OgreMain.dir/src/OgreDefaultSceneQueries.cpp.o -c /tmp/ogre-4JyI/ogre_src_v1-7-4/OgreMain/src/OgreDefaultSceneQueries.cpp
  339. /usr/local/Cellar/cmake/2.8.12.2/bin/cmake -E cmake_progress_report /tmp/ogre-4JyI/ogre_src_v1-7-4/build/CMakeFiles
  340. [  8%] Building CXX object OgreMain/CMakeFiles/OgreMain.dir/src/OgreDistanceLodStrategy.cpp.o
  341. cd /tmp/ogre-4JyI/ogre_src_v1-7-4/build/OgreMain && /usr/local/Library/ENV/4.3/clang++   -DBOOST_ALL_NO_LIB -DFREEIMAGE_LIB -DOGRE_NONCLIENT_BUILD -DOgreMain_EXPORTS -D_MT -D_USRDLL -arch x86_64 -isysroot /Applications/Xcode.app/Contents/Developer/Platforms/MacOSX.platform/Developer/SDKs/MacOSX10.9.sdk -fPIC -I/tmp/ogre-4JyI/ogre_src_v1-7-4/OgreMain/include -I/tmp/ogre-4JyI/ogre_src_v1-7-4/build/include -I/tmp/ogre-4JyI/ogre_src_v1-7-4/OgreMain/include/OSX -I/usr/local/include -I/opt/X11/include -I/tmp/ogre-4JyI/ogre_src_v1-7-4 -I/Applications/Xcode.app/Contents/Developer/Platforms/MacOSX.platform/Developer/SDKs/MacOSX10.9.sdk/System/Library/Frameworks/Carbon.framework/Headers -F/Applications/Xcode.app/Contents/Developer/Platforms/MacOSX.platform/Developer/SDKs/MacOSX10.9.sdk/System/Library/Frameworks -I/Applications/Xcode.app/Contents/Developer/Platforms/MacOSX.platform/Developer/SDKs/MacOSX10.9.sdk/System/Library/Frameworks/Cocoa.framework/Headers -I/tmp/ogre-4JyI/ogre_src_v1-7-4/OgreMain/src/nedmalloc    -pthread -o CMakeFiles/OgreMain.dir/src/OgreDistanceLodStrategy.cpp.o -c /tmp/ogre-4JyI/ogre_src_v1-7-4/OgreMain/src/OgreDistanceLodStrategy.cpp
  342. /usr/local/Cellar/cmake/2.8.12.2/bin/cmake -E cmake_progress_report /tmp/ogre-4JyI/ogre_src_v1-7-4/build/CMakeFiles
  343. [  8%] Building CXX object OgreMain/CMakeFiles/OgreMain.dir/src/OgreDynLib.cpp.o
  344. cd /tmp/ogre-4JyI/ogre_src_v1-7-4/build/OgreMain && /usr/local/Library/ENV/4.3/clang++   -DBOOST_ALL_NO_LIB -DFREEIMAGE_LIB -DOGRE_NONCLIENT_BUILD -DOgreMain_EXPORTS -D_MT -D_USRDLL -arch x86_64 -isysroot /Applications/Xcode.app/Contents/Developer/Platforms/MacOSX.platform/Developer/SDKs/MacOSX10.9.sdk -fPIC -I/tmp/ogre-4JyI/ogre_src_v1-7-4/OgreMain/include -I/tmp/ogre-4JyI/ogre_src_v1-7-4/build/include -I/tmp/ogre-4JyI/ogre_src_v1-7-4/OgreMain/include/OSX -I/usr/local/include -I/opt/X11/include -I/tmp/ogre-4JyI/ogre_src_v1-7-4 -I/Applications/Xcode.app/Contents/Developer/Platforms/MacOSX.platform/Developer/SDKs/MacOSX10.9.sdk/System/Library/Frameworks/Carbon.framework/Headers -F/Applications/Xcode.app/Contents/Developer/Platforms/MacOSX.platform/Developer/SDKs/MacOSX10.9.sdk/System/Library/Frameworks -I/Applications/Xcode.app/Contents/Developer/Platforms/MacOSX.platform/Developer/SDKs/MacOSX10.9.sdk/System/Library/Frameworks/Cocoa.framework/Headers -I/tmp/ogre-4JyI/ogre_src_v1-7-4/OgreMain/src/nedmalloc    -pthread -o CMakeFiles/OgreMain.dir/src/OgreDynLib.cpp.o -c /tmp/ogre-4JyI/ogre_src_v1-7-4/OgreMain/src/OgreDynLib.cpp
  345. /usr/local/Cellar/cmake/2.8.12.2/bin/cmake -E cmake_progress_report /tmp/ogre-4JyI/ogre_src_v1-7-4/build/CMakeFiles
  346. [  8%] Building CXX object OgreMain/CMakeFiles/OgreMain.dir/src/OgreDynLibManager.cpp.o
  347. cd /tmp/ogre-4JyI/ogre_src_v1-7-4/build/OgreMain && /usr/local/Library/ENV/4.3/clang++   -DBOOST_ALL_NO_LIB -DFREEIMAGE_LIB -DOGRE_NONCLIENT_BUILD -DOgreMain_EXPORTS -D_MT -D_USRDLL -arch x86_64 -isysroot /Applications/Xcode.app/Contents/Developer/Platforms/MacOSX.platform/Developer/SDKs/MacOSX10.9.sdk -fPIC -I/tmp/ogre-4JyI/ogre_src_v1-7-4/OgreMain/include -I/tmp/ogre-4JyI/ogre_src_v1-7-4/build/include -I/tmp/ogre-4JyI/ogre_src_v1-7-4/OgreMain/include/OSX -I/usr/local/include -I/opt/X11/include -I/tmp/ogre-4JyI/ogre_src_v1-7-4 -I/Applications/Xcode.app/Contents/Developer/Platforms/MacOSX.platform/Developer/SDKs/MacOSX10.9.sdk/System/Library/Frameworks/Carbon.framework/Headers -F/Applications/Xcode.app/Contents/Developer/Platforms/MacOSX.platform/Developer/SDKs/MacOSX10.9.sdk/System/Library/Frameworks -I/Applications/Xcode.app/Contents/Developer/Platforms/MacOSX.platform/Developer/SDKs/MacOSX10.9.sdk/System/Library/Frameworks/Cocoa.framework/Headers -I/tmp/ogre-4JyI/ogre_src_v1-7-4/OgreMain/src/nedmalloc    -pthread -o CMakeFiles/OgreMain.dir/src/OgreDynLibManager.cpp.o -c /tmp/ogre-4JyI/ogre_src_v1-7-4/OgreMain/src/OgreDynLibManager.cpp
  348. /usr/local/Cellar/cmake/2.8.12.2/bin/cmake -E cmake_progress_report /tmp/ogre-4JyI/ogre_src_v1-7-4/build/CMakeFiles 9
  349. [  9%] Building CXX object OgreMain/CMakeFiles/OgreMain.dir/src/OgreEdgeListBuilder.cpp.o
  350. cd /tmp/ogre-4JyI/ogre_src_v1-7-4/build/OgreMain && /usr/local/Library/ENV/4.3/clang++   -DBOOST_ALL_NO_LIB -DFREEIMAGE_LIB -DOGRE_NONCLIENT_BUILD -DOgreMain_EXPORTS -D_MT -D_USRDLL -arch x86_64 -isysroot /Applications/Xcode.app/Contents/Developer/Platforms/MacOSX.platform/Developer/SDKs/MacOSX10.9.sdk -fPIC -I/tmp/ogre-4JyI/ogre_src_v1-7-4/OgreMain/include -I/tmp/ogre-4JyI/ogre_src_v1-7-4/build/include -I/tmp/ogre-4JyI/ogre_src_v1-7-4/OgreMain/include/OSX -I/usr/local/include -I/opt/X11/include -I/tmp/ogre-4JyI/ogre_src_v1-7-4 -I/Applications/Xcode.app/Contents/Developer/Platforms/MacOSX.platform/Developer/SDKs/MacOSX10.9.sdk/System/Library/Frameworks/Carbon.framework/Headers -F/Applications/Xcode.app/Contents/Developer/Platforms/MacOSX.platform/Developer/SDKs/MacOSX10.9.sdk/System/Library/Frameworks -I/Applications/Xcode.app/Contents/Developer/Platforms/MacOSX.platform/Developer/SDKs/MacOSX10.9.sdk/System/Library/Frameworks/Cocoa.framework/Headers -I/tmp/ogre-4JyI/ogre_src_v1-7-4/OgreMain/src/nedmalloc    -pthread -o CMakeFiles/OgreMain.dir/src/OgreEdgeListBuilder.cpp.o -c /tmp/ogre-4JyI/ogre_src_v1-7-4/OgreMain/src/OgreEdgeListBuilder.cpp
  351. /usr/local/Cellar/cmake/2.8.12.2/bin/cmake -E cmake_progress_report /tmp/ogre-4JyI/ogre_src_v1-7-4/build/CMakeFiles
  352. [  9%] Building CXX object OgreMain/CMakeFiles/OgreMain.dir/src/OgreEntity.cpp.o
  353. cd /tmp/ogre-4JyI/ogre_src_v1-7-4/build/OgreMain && /usr/local/Library/ENV/4.3/clang++   -DBOOST_ALL_NO_LIB -DFREEIMAGE_LIB -DOGRE_NONCLIENT_BUILD -DOgreMain_EXPORTS -D_MT -D_USRDLL -arch x86_64 -isysroot /Applications/Xcode.app/Contents/Developer/Platforms/MacOSX.platform/Developer/SDKs/MacOSX10.9.sdk -fPIC -I/tmp/ogre-4JyI/ogre_src_v1-7-4/OgreMain/include -I/tmp/ogre-4JyI/ogre_src_v1-7-4/build/include -I/tmp/ogre-4JyI/ogre_src_v1-7-4/OgreMain/include/OSX -I/usr/local/include -I/opt/X11/include -I/tmp/ogre-4JyI/ogre_src_v1-7-4 -I/Applications/Xcode.app/Contents/Developer/Platforms/MacOSX.platform/Developer/SDKs/MacOSX10.9.sdk/System/Library/Frameworks/Carbon.framework/Headers -F/Applications/Xcode.app/Contents/Developer/Platforms/MacOSX.platform/Developer/SDKs/MacOSX10.9.sdk/System/Library/Frameworks -I/Applications/Xcode.app/Contents/Developer/Platforms/MacOSX.platform/Developer/SDKs/MacOSX10.9.sdk/System/Library/Frameworks/Cocoa.framework/Headers -I/tmp/ogre-4JyI/ogre_src_v1-7-4/OgreMain/src/nedmalloc    -pthread -o CMakeFiles/OgreMain.dir/src/OgreEntity.cpp.o -c /tmp/ogre-4JyI/ogre_src_v1-7-4/OgreMain/src/OgreEntity.cpp
  354. /usr/local/Cellar/cmake/2.8.12.2/bin/cmake -E cmake_progress_report /tmp/ogre-4JyI/ogre_src_v1-7-4/build/CMakeFiles
  355. [  9%] Building CXX object OgreMain/CMakeFiles/OgreMain.dir/src/OgreException.cpp.o
  356. cd /tmp/ogre-4JyI/ogre_src_v1-7-4/build/OgreMain && /usr/local/Library/ENV/4.3/clang++   -DBOOST_ALL_NO_LIB -DFREEIMAGE_LIB -DOGRE_NONCLIENT_BUILD -DOgreMain_EXPORTS -D_MT -D_USRDLL -arch x86_64 -isysroot /Applications/Xcode.app/Contents/Developer/Platforms/MacOSX.platform/Developer/SDKs/MacOSX10.9.sdk -fPIC -I/tmp/ogre-4JyI/ogre_src_v1-7-4/OgreMain/include -I/tmp/ogre-4JyI/ogre_src_v1-7-4/build/include -I/tmp/ogre-4JyI/ogre_src_v1-7-4/OgreMain/include/OSX -I/usr/local/include -I/opt/X11/include -I/tmp/ogre-4JyI/ogre_src_v1-7-4 -I/Applications/Xcode.app/Contents/Developer/Platforms/MacOSX.platform/Developer/SDKs/MacOSX10.9.sdk/System/Library/Frameworks/Carbon.framework/Headers -F/Applications/Xcode.app/Contents/Developer/Platforms/MacOSX.platform/Developer/SDKs/MacOSX10.9.sdk/System/Library/Frameworks -I/Applications/Xcode.app/Contents/Developer/Platforms/MacOSX.platform/Developer/SDKs/MacOSX10.9.sdk/System/Library/Frameworks/Cocoa.framework/Headers -I/tmp/ogre-4JyI/ogre_src_v1-7-4/OgreMain/src/nedmalloc    -pthread -o CMakeFiles/OgreMain.dir/src/OgreException.cpp.o -c /tmp/ogre-4JyI/ogre_src_v1-7-4/OgreMain/src/OgreException.cpp
  357. /usr/local/Cellar/cmake/2.8.12.2/bin/cmake -E cmake_progress_report /tmp/ogre-4JyI/ogre_src_v1-7-4/build/CMakeFiles 10
  358. [ 10%] Building CXX object OgreMain/CMakeFiles/OgreMain.dir/src/OgreExternalTextureSource.cpp.o
  359. cd /tmp/ogre-4JyI/ogre_src_v1-7-4/build/OgreMain && /usr/local/Library/ENV/4.3/clang++   -DBOOST_ALL_NO_LIB -DFREEIMAGE_LIB -DOGRE_NONCLIENT_BUILD -DOgreMain_EXPORTS -D_MT -D_USRDLL -arch x86_64 -isysroot /Applications/Xcode.app/Contents/Developer/Platforms/MacOSX.platform/Developer/SDKs/MacOSX10.9.sdk -fPIC -I/tmp/ogre-4JyI/ogre_src_v1-7-4/OgreMain/include -I/tmp/ogre-4JyI/ogre_src_v1-7-4/build/include -I/tmp/ogre-4JyI/ogre_src_v1-7-4/OgreMain/include/OSX -I/usr/local/include -I/opt/X11/include -I/tmp/ogre-4JyI/ogre_src_v1-7-4 -I/Applications/Xcode.app/Contents/Developer/Platforms/MacOSX.platform/Developer/SDKs/MacOSX10.9.sdk/System/Library/Frameworks/Carbon.framework/Headers -F/Applications/Xcode.app/Contents/Developer/Platforms/MacOSX.platform/Developer/SDKs/MacOSX10.9.sdk/System/Library/Frameworks -I/Applications/Xcode.app/Contents/Developer/Platforms/MacOSX.platform/Developer/SDKs/MacOSX10.9.sdk/System/Library/Frameworks/Cocoa.framework/Headers -I/tmp/ogre-4JyI/ogre_src_v1-7-4/OgreMain/src/nedmalloc    -pthread -o CMakeFiles/OgreMain.dir/src/OgreExternalTextureSource.cpp.o -c /tmp/ogre-4JyI/ogre_src_v1-7-4/OgreMain/src/OgreExternalTextureSource.cpp
  360. /usr/local/Cellar/cmake/2.8.12.2/bin/cmake -E cmake_progress_report /tmp/ogre-4JyI/ogre_src_v1-7-4/build/CMakeFiles
  361. [ 10%] Building CXX object OgreMain/CMakeFiles/OgreMain.dir/src/OgreExternalTextureSourceManager.cpp.o
  362. cd /tmp/ogre-4JyI/ogre_src_v1-7-4/build/OgreMain && /usr/local/Library/ENV/4.3/clang++   -DBOOST_ALL_NO_LIB -DFREEIMAGE_LIB -DOGRE_NONCLIENT_BUILD -DOgreMain_EXPORTS -D_MT -D_USRDLL -arch x86_64 -isysroot /Applications/Xcode.app/Contents/Developer/Platforms/MacOSX.platform/Developer/SDKs/MacOSX10.9.sdk -fPIC -I/tmp/ogre-4JyI/ogre_src_v1-7-4/OgreMain/include -I/tmp/ogre-4JyI/ogre_src_v1-7-4/build/include -I/tmp/ogre-4JyI/ogre_src_v1-7-4/OgreMain/include/OSX -I/usr/local/include -I/opt/X11/include -I/tmp/ogre-4JyI/ogre_src_v1-7-4 -I/Applications/Xcode.app/Contents/Developer/Platforms/MacOSX.platform/Developer/SDKs/MacOSX10.9.sdk/System/Library/Frameworks/Carbon.framework/Headers -F/Applications/Xcode.app/Contents/Developer/Platforms/MacOSX.platform/Developer/SDKs/MacOSX10.9.sdk/System/Library/Frameworks -I/Applications/Xcode.app/Contents/Developer/Platforms/MacOSX.platform/Developer/SDKs/MacOSX10.9.sdk/System/Library/Frameworks/Cocoa.framework/Headers -I/tmp/ogre-4JyI/ogre_src_v1-7-4/OgreMain/src/nedmalloc    -pthread -o CMakeFiles/OgreMain.dir/src/OgreExternalTextureSourceManager.cpp.o -c /tmp/ogre-4JyI/ogre_src_v1-7-4/OgreMain/src/OgreExternalTextureSourceManager.cpp
  363. /usr/local/Cellar/cmake/2.8.12.2/bin/cmake -E cmake_progress_report /tmp/ogre-4JyI/ogre_src_v1-7-4/build/CMakeFiles
  364. [ 10%] Building CXX object OgreMain/CMakeFiles/OgreMain.dir/src/OgreFileSystem.cpp.o
  365. cd /tmp/ogre-4JyI/ogre_src_v1-7-4/build/OgreMain && /usr/local/Library/ENV/4.3/clang++   -DBOOST_ALL_NO_LIB -DFREEIMAGE_LIB -DOGRE_NONCLIENT_BUILD -DOgreMain_EXPORTS -D_MT -D_USRDLL -arch x86_64 -isysroot /Applications/Xcode.app/Contents/Developer/Platforms/MacOSX.platform/Developer/SDKs/MacOSX10.9.sdk -fPIC -I/tmp/ogre-4JyI/ogre_src_v1-7-4/OgreMain/include -I/tmp/ogre-4JyI/ogre_src_v1-7-4/build/include -I/tmp/ogre-4JyI/ogre_src_v1-7-4/OgreMain/include/OSX -I/usr/local/include -I/opt/X11/include -I/tmp/ogre-4JyI/ogre_src_v1-7-4 -I/Applications/Xcode.app/Contents/Developer/Platforms/MacOSX.platform/Developer/SDKs/MacOSX10.9.sdk/System/Library/Frameworks/Carbon.framework/Headers -F/Applications/Xcode.app/Contents/Developer/Platforms/MacOSX.platform/Developer/SDKs/MacOSX10.9.sdk/System/Library/Frameworks -I/Applications/Xcode.app/Contents/Developer/Platforms/MacOSX.platform/Developer/SDKs/MacOSX10.9.sdk/System/Library/Frameworks/Cocoa.framework/Headers -I/tmp/ogre-4JyI/ogre_src_v1-7-4/OgreMain/src/nedmalloc    -pthread -o CMakeFiles/OgreMain.dir/src/OgreFileSystem.cpp.o -c /tmp/ogre-4JyI/ogre_src_v1-7-4/OgreMain/src/OgreFileSystem.cpp
  366. /usr/local/Cellar/cmake/2.8.12.2/bin/cmake -E cmake_progress_report /tmp/ogre-4JyI/ogre_src_v1-7-4/build/CMakeFiles
  367. [ 10%] Building CXX object OgreMain/CMakeFiles/OgreMain.dir/src/OgreFont.cpp.o
  368. cd /tmp/ogre-4JyI/ogre_src_v1-7-4/build/OgreMain && /usr/local/Library/ENV/4.3/clang++   -DBOOST_ALL_NO_LIB -DFREEIMAGE_LIB -DOGRE_NONCLIENT_BUILD -DOgreMain_EXPORTS -D_MT -D_USRDLL -arch x86_64 -isysroot /Applications/Xcode.app/Contents/Developer/Platforms/MacOSX.platform/Developer/SDKs/MacOSX10.9.sdk -fPIC -I/tmp/ogre-4JyI/ogre_src_v1-7-4/OgreMain/include -I/tmp/ogre-4JyI/ogre_src_v1-7-4/build/include -I/tmp/ogre-4JyI/ogre_src_v1-7-4/OgreMain/include/OSX -I/usr/local/include -I/opt/X11/include -I/tmp/ogre-4JyI/ogre_src_v1-7-4 -I/Applications/Xcode.app/Contents/Developer/Platforms/MacOSX.platform/Developer/SDKs/MacOSX10.9.sdk/System/Library/Frameworks/Carbon.framework/Headers -F/Applications/Xcode.app/Contents/Developer/Platforms/MacOSX.platform/Developer/SDKs/MacOSX10.9.sdk/System/Library/Frameworks -I/Applications/Xcode.app/Contents/Developer/Platforms/MacOSX.platform/Developer/SDKs/MacOSX10.9.sdk/System/Library/Frameworks/Cocoa.framework/Headers -I/tmp/ogre-4JyI/ogre_src_v1-7-4/OgreMain/src/nedmalloc    -pthread -o CMakeFiles/OgreMain.dir/src/OgreFont.cpp.o -c /tmp/ogre-4JyI/ogre_src_v1-7-4/OgreMain/src/OgreFont.cpp
  369. /usr/local/Cellar/cmake/2.8.12.2/bin/cmake -E cmake_progress_report /tmp/ogre-4JyI/ogre_src_v1-7-4/build/CMakeFiles 11
  370. [ 11%] Building CXX object OgreMain/CMakeFiles/OgreMain.dir/src/OgreFontManager.cpp.o
  371. cd /tmp/ogre-4JyI/ogre_src_v1-7-4/build/OgreMain && /usr/local/Library/ENV/4.3/clang++   -DBOOST_ALL_NO_LIB -DFREEIMAGE_LIB -DOGRE_NONCLIENT_BUILD -DOgreMain_EXPORTS -D_MT -D_USRDLL -arch x86_64 -isysroot /Applications/Xcode.app/Contents/Developer/Platforms/MacOSX.platform/Developer/SDKs/MacOSX10.9.sdk -fPIC -I/tmp/ogre-4JyI/ogre_src_v1-7-4/OgreMain/include -I/tmp/ogre-4JyI/ogre_src_v1-7-4/build/include -I/tmp/ogre-4JyI/ogre_src_v1-7-4/OgreMain/include/OSX -I/usr/local/include -I/opt/X11/include -I/tmp/ogre-4JyI/ogre_src_v1-7-4 -I/Applications/Xcode.app/Contents/Developer/Platforms/MacOSX.platform/Developer/SDKs/MacOSX10.9.sdk/System/Library/Frameworks/Carbon.framework/Headers -F/Applications/Xcode.app/Contents/Developer/Platforms/MacOSX.platform/Developer/SDKs/MacOSX10.9.sdk/System/Library/Frameworks -I/Applications/Xcode.app/Contents/Developer/Platforms/MacOSX.platform/Developer/SDKs/MacOSX10.9.sdk/System/Library/Frameworks/Cocoa.framework/Headers -I/tmp/ogre-4JyI/ogre_src_v1-7-4/OgreMain/src/nedmalloc    -pthread -o CMakeFiles/OgreMain.dir/src/OgreFontManager.cpp.o -c /tmp/ogre-4JyI/ogre_src_v1-7-4/OgreMain/src/OgreFontManager.cpp
  372. /usr/local/Cellar/cmake/2.8.12.2/bin/cmake -E cmake_progress_report /tmp/ogre-4JyI/ogre_src_v1-7-4/build/CMakeFiles
  373. [ 11%] Building CXX object OgreMain/CMakeFiles/OgreMain.dir/src/OgreFrustum.cpp.o
  374. cd /tmp/ogre-4JyI/ogre_src_v1-7-4/build/OgreMain && /usr/local/Library/ENV/4.3/clang++   -DBOOST_ALL_NO_LIB -DFREEIMAGE_LIB -DOGRE_NONCLIENT_BUILD -DOgreMain_EXPORTS -D_MT -D_USRDLL -arch x86_64 -isysroot /Applications/Xcode.app/Contents/Developer/Platforms/MacOSX.platform/Developer/SDKs/MacOSX10.9.sdk -fPIC -I/tmp/ogre-4JyI/ogre_src_v1-7-4/OgreMain/include -I/tmp/ogre-4JyI/ogre_src_v1-7-4/build/include -I/tmp/ogre-4JyI/ogre_src_v1-7-4/OgreMain/include/OSX -I/usr/local/include -I/opt/X11/include -I/tmp/ogre-4JyI/ogre_src_v1-7-4 -I/Applications/Xcode.app/Contents/Developer/Platforms/MacOSX.platform/Developer/SDKs/MacOSX10.9.sdk/System/Library/Frameworks/Carbon.framework/Headers -F/Applications/Xcode.app/Contents/Developer/Platforms/MacOSX.platform/Developer/SDKs/MacOSX10.9.sdk/System/Library/Frameworks -I/Applications/Xcode.app/Contents/Developer/Platforms/MacOSX.platform/Developer/SDKs/MacOSX10.9.sdk/System/Library/Frameworks/Cocoa.framework/Headers -I/tmp/ogre-4JyI/ogre_src_v1-7-4/OgreMain/src/nedmalloc    -pthread -o CMakeFiles/OgreMain.dir/src/OgreFrustum.cpp.o -c /tmp/ogre-4JyI/ogre_src_v1-7-4/OgreMain/src/OgreFrustum.cpp
  375. /usr/local/Cellar/cmake/2.8.12.2/bin/cmake -E cmake_progress_report /tmp/ogre-4JyI/ogre_src_v1-7-4/build/CMakeFiles
  376. [ 11%] Building CXX object OgreMain/CMakeFiles/OgreMain.dir/src/OgreGpuProgram.cpp.o
  377. cd /tmp/ogre-4JyI/ogre_src_v1-7-4/build/OgreMain && /usr/local/Library/ENV/4.3/clang++   -DBOOST_ALL_NO_LIB -DFREEIMAGE_LIB -DOGRE_NONCLIENT_BUILD -DOgreMain_EXPORTS -D_MT -D_USRDLL -arch x86_64 -isysroot /Applications/Xcode.app/Contents/Developer/Platforms/MacOSX.platform/Developer/SDKs/MacOSX10.9.sdk -fPIC -I/tmp/ogre-4JyI/ogre_src_v1-7-4/OgreMain/include -I/tmp/ogre-4JyI/ogre_src_v1-7-4/build/include -I/tmp/ogre-4JyI/ogre_src_v1-7-4/OgreMain/include/OSX -I/usr/local/include -I/opt/X11/include -I/tmp/ogre-4JyI/ogre_src_v1-7-4 -I/Applications/Xcode.app/Contents/Developer/Platforms/MacOSX.platform/Developer/SDKs/MacOSX10.9.sdk/System/Library/Frameworks/Carbon.framework/Headers -F/Applications/Xcode.app/Contents/Developer/Platforms/MacOSX.platform/Developer/SDKs/MacOSX10.9.sdk/System/Library/Frameworks -I/Applications/Xcode.app/Contents/Developer/Platforms/MacOSX.platform/Developer/SDKs/MacOSX10.9.sdk/System/Library/Frameworks/Cocoa.framework/Headers -I/tmp/ogre-4JyI/ogre_src_v1-7-4/OgreMain/src/nedmalloc    -pthread -o CMakeFiles/OgreMain.dir/src/OgreGpuProgram.cpp.o -c /tmp/ogre-4JyI/ogre_src_v1-7-4/OgreMain/src/OgreGpuProgram.cpp
  378. /usr/local/Cellar/cmake/2.8.12.2/bin/cmake -E cmake_progress_report /tmp/ogre-4JyI/ogre_src_v1-7-4/build/CMakeFiles
  379. [ 11%] Building CXX object OgreMain/CMakeFiles/OgreMain.dir/src/OgreGpuProgramManager.cpp.o
  380. cd /tmp/ogre-4JyI/ogre_src_v1-7-4/build/OgreMain && /usr/local/Library/ENV/4.3/clang++   -DBOOST_ALL_NO_LIB -DFREEIMAGE_LIB -DOGRE_NONCLIENT_BUILD -DOgreMain_EXPORTS -D_MT -D_USRDLL -arch x86_64 -isysroot /Applications/Xcode.app/Contents/Developer/Platforms/MacOSX.platform/Developer/SDKs/MacOSX10.9.sdk -fPIC -I/tmp/ogre-4JyI/ogre_src_v1-7-4/OgreMain/include -I/tmp/ogre-4JyI/ogre_src_v1-7-4/build/include -I/tmp/ogre-4JyI/ogre_src_v1-7-4/OgreMain/include/OSX -I/usr/local/include -I/opt/X11/include -I/tmp/ogre-4JyI/ogre_src_v1-7-4 -I/Applications/Xcode.app/Contents/Developer/Platforms/MacOSX.platform/Developer/SDKs/MacOSX10.9.sdk/System/Library/Frameworks/Carbon.framework/Headers -F/Applications/Xcode.app/Contents/Developer/Platforms/MacOSX.platform/Developer/SDKs/MacOSX10.9.sdk/System/Library/Frameworks -I/Applications/Xcode.app/Contents/Developer/Platforms/MacOSX.platform/Developer/SDKs/MacOSX10.9.sdk/System/Library/Frameworks/Cocoa.framework/Headers -I/tmp/ogre-4JyI/ogre_src_v1-7-4/OgreMain/src/nedmalloc    -pthread -o CMakeFiles/OgreMain.dir/src/OgreGpuProgramManager.cpp.o -c /tmp/ogre-4JyI/ogre_src_v1-7-4/OgreMain/src/OgreGpuProgramManager.cpp
  381. /usr/local/Cellar/cmake/2.8.12.2/bin/cmake -E cmake_progress_report /tmp/ogre-4JyI/ogre_src_v1-7-4/build/CMakeFiles 12
  382. [ 12%] Building CXX object OgreMain/CMakeFiles/OgreMain.dir/src/OgreGpuProgramParams.cpp.o
  383. cd /tmp/ogre-4JyI/ogre_src_v1-7-4/build/OgreMain && /usr/local/Library/ENV/4.3/clang++   -DBOOST_ALL_NO_LIB -DFREEIMAGE_LIB -DOGRE_NONCLIENT_BUILD -DOgreMain_EXPORTS -D_MT -D_USRDLL -arch x86_64 -isysroot /Applications/Xcode.app/Contents/Developer/Platforms/MacOSX.platform/Developer/SDKs/MacOSX10.9.sdk -fPIC -I/tmp/ogre-4JyI/ogre_src_v1-7-4/OgreMain/include -I/tmp/ogre-4JyI/ogre_src_v1-7-4/build/include -I/tmp/ogre-4JyI/ogre_src_v1-7-4/OgreMain/include/OSX -I/usr/local/include -I/opt/X11/include -I/tmp/ogre-4JyI/ogre_src_v1-7-4 -I/Applications/Xcode.app/Contents/Developer/Platforms/MacOSX.platform/Developer/SDKs/MacOSX10.9.sdk/System/Library/Frameworks/Carbon.framework/Headers -F/Applications/Xcode.app/Contents/Developer/Platforms/MacOSX.platform/Developer/SDKs/MacOSX10.9.sdk/System/Library/Frameworks -I/Applications/Xcode.app/Contents/Developer/Platforms/MacOSX.platform/Developer/SDKs/MacOSX10.9.sdk/System/Library/Frameworks/Cocoa.framework/Headers -I/tmp/ogre-4JyI/ogre_src_v1-7-4/OgreMain/src/nedmalloc    -pthread -o CMakeFiles/OgreMain.dir/src/OgreGpuProgramParams.cpp.o -c /tmp/ogre-4JyI/ogre_src_v1-7-4/OgreMain/src/OgreGpuProgramParams.cpp
  384. /tmp/ogre-4JyI/ogre_src_v1-7-4/OgreMain/src/OgreFont.cpp:44:10: fatal error: 'freetype.h' file not found
  385. #include FT_FREETYPE_H
  386.          ^
  387. /usr/local/include/freetype/config/ftheader.h:173:24: note: expanded from macro 'FT_FREETYPE_H'
  388. #define FT_FREETYPE_H  <freetype.h>
  389.                        ^
  390. 1 error generated.
  391. /usr/local/Cellar/cmake/2.8.12.2/bin/cmake -E cmake_progress_report /tmp/ogre-4JyI/ogre_src_v1-7-4/build/CMakeFiles
  392. [ 12%] make[2]: *** [OgreMain/CMakeFiles/OgreMain.dir/src/OgreFont.cpp.o] Error 1
  393. make[2]: *** Waiting for unfinished jobs....
  394. Building CXX object OgreMain/CMakeFiles/OgreMain.dir/src/OgreGpuProgramUsage.cpp.o
  395. cd /tmp/ogre-4JyI/ogre_src_v1-7-4/build/OgreMain && /usr/local/Library/ENV/4.3/clang++   -DBOOST_ALL_NO_LIB -DFREEIMAGE_LIB -DOGRE_NONCLIENT_BUILD -DOgreMain_EXPORTS -D_MT -D_USRDLL -arch x86_64 -isysroot /Applications/Xcode.app/Contents/Developer/Platforms/MacOSX.platform/Developer/SDKs/MacOSX10.9.sdk -fPIC -I/tmp/ogre-4JyI/ogre_src_v1-7-4/OgreMain/include -I/tmp/ogre-4JyI/ogre_src_v1-7-4/build/include -I/tmp/ogre-4JyI/ogre_src_v1-7-4/OgreMain/include/OSX -I/usr/local/include -I/opt/X11/include -I/tmp/ogre-4JyI/ogre_src_v1-7-4 -I/Applications/Xcode.app/Contents/Developer/Platforms/MacOSX.platform/Developer/SDKs/MacOSX10.9.sdk/System/Library/Frameworks/Carbon.framework/Headers -F/Applications/Xcode.app/Contents/Developer/Platforms/MacOSX.platform/Developer/SDKs/MacOSX10.9.sdk/System/Library/Frameworks -I/Applications/Xcode.app/Contents/Developer/Platforms/MacOSX.platform/Developer/SDKs/MacOSX10.9.sdk/System/Library/Frameworks/Cocoa.framework/Headers -I/tmp/ogre-4JyI/ogre_src_v1-7-4/OgreMain/src/nedmalloc    -pthread -o CMakeFiles/OgreMain.dir/src/OgreGpuProgramUsage.cpp.o -c /tmp/ogre-4JyI/ogre_src_v1-7-4/OgreMain/src/OgreGpuProgramUsage.cpp
  396. make[1]: *** [OgreMain/CMakeFiles/OgreMain.dir/all] Error 2
  397. make: *** [all] Error 2
  398. ==> Formula
  399. Tap: osrf/simulation
  400. Path: /usr/local/Library/Taps/osrf-simulation/ogre.rb
  401. ==> Configuration
  402. HOMEBREW_VERSION: 0.9.5
  403. HEAD: 24cc097d27661169e5b96da8ddb4b8cfebbc5086
  404. CPU: 8-core 64-bit haswell
  405. OS X: 10.9.2-x86_64
  406. Xcode: 5.1.1
  407. CLT: 5.1.0.0.1.1396320587
  408. X11: 2.7.5 => /opt/X11
  409. ==> ENV
  410. HOMEBREW_CC: clang
  411. HOMEBREW_CXX: clang++
  412. MAKEFLAGS: -j8
  413. CMAKE_PREFIX_PATH: /usr/local
  414. CMAKE_INCLUDE_PATH: /usr/include/libxml2:/opt/X11/include:/opt/X11/include/freetype2
  415. CMAKE_LIBRARY_PATH: /opt/X11/lib
  416. PKG_CONFIG_PATH: /usr/local/opt/libpng/lib/pkgconfig:/usr/local/opt/freetype/lib/pkgconfig:/usr/local/opt/libzzip/lib/pkgconfig
  417. PKG_CONFIG_LIBDIR: /usr/lib/pkgconfig:/usr/local/Library/ENV/pkgconfig/10.9:/opt/X11/lib/pkgconfig:/opt/X11/share/pkgconfig
  418. ACLOCAL_PATH: /usr/local/share/aclocal:/opt/X11/share/aclocal
  419. PATH: /usr/local/Library/ENV/4.3:/usr/local/opt/cmake/bin:/usr/local/opt/doxygen/bin:/usr/local/opt/libpng/bin:/usr/local/opt/freetype/bin:/usr/local/opt/libzzip/bin:/opt/X11/bin:/usr/bin:/bin:/usr/sbin:/sbin
  420.  
  421. Error: ogre 1.7.4 did not build
  422. Logs:
  423.      /Users/n130s/Library/Logs/Homebrew/ogre/01.cmake
  424.      /Users/n130s/Library/Logs/Homebrew/ogre/01.cmake.cc
  425.      /Users/n130s/Library/Logs/Homebrew/ogre/02.make
  426.      /Users/n130s/Library/Logs/Homebrew/ogre/02.make.cc
RAW Paste Data
We use cookies for various purposes including analytics. By continuing to use Pastebin, you agree to our use of cookies as described in the Cookies Policy. OK, I Understand
Top