Guest User

Untitled

a guest
Mar 16th, 2017
85
Never
Not a member of Pastebin yet? Sign Up, it unlocks many cool features!
  1. ==> Making package: arpage 0.3.3-8 (Thu Mar 16 15:10:41 -05 2017)
  2. ==> Checking runtime dependencies...
  3. ==> Checking buildtime dependencies...
  4. ==> Retrieving sources...
  5. -> Found arpage-0.3.3.tar.gz
  6. ==> Validating source files with md5sums...
  7. arpage-0.3.3.tar.gz ... Passed
  8. ==> Extracting sources...
  9. -> Extracting arpage-0.3.3.tar.gz with bsdtar
  10. ==> Removing existing $pkgdir/ directory...
  11. ==> Starting build()...
  12. In file included from /usr/include/gtkmm-2.4/gtkmm/printjob.h:30:0,
  13. from /usr/include/gtkmm-2.4/gtkmm.h:185,
  14. from arpui.h:24,
  15. from arpui.cc:19:
  16. /usr/include/gtkmm-2.4/gtkmm/printoperation.h:229:2: error: invalid preprocessing directive #ifNdef
  17. #ifNdef DOXÙGEN_SHOULD_SKIP_THIS
  18. ^~~~~~
  19. /usr/include/gtkmm-2.4/gtkmm/printoperation.h:238:11: error: stray ‘\360’ in program
  20. static CðpClassTùpe printoperation_class_;
  21. ^
  22. /usr/include/gtkmm-2.4/gtkmm/printoperation.h:238:19: error: stray ‘\371’ in program
  23. static CðpClassTùpe printoperation_class_;
  24. ^
  25. /usr/include/gtkmm-2.4/gtkmm/printoperation.h:249:7: warning: null character(s) ignored
  26. #endif /* DOXYGEN_SHOULD_SKIP_THIS */
  27. ^
  28. In file included from /usr/include/gtkmm-2.4/gtkmm/printjob.h:30:0,
  29. from /usr/include/gtkmm-2.4/gtkmm.h:185,
  30. from arpui.h:24,
  31. from arpui.cc:19:
  32. /usr/include/gtkmm-2.4/gtkmm/printoperation.h:339:25: error: stray ‘\364’ in program
  33. void set_job_name(consô Glib::õstring& job_name);
  34. ^
  35. /usr/include/gtkmm-2.4/gtkmm/printoperation.h:339:33: error: stray ‘\365’ in program
  36. void set_job_name(consô Glib::õstring& job_name);
  37. ^
  38. /usr/include/gtkmm-2.4/gtkmm/printoperation.h:339:41: error: stray ‘\240’ in program
  39. void set_job_name(consô Glib::õstring& job_name);
  40. ^
  41. /usr/include/gtkmm-2.4/gtkmm/printoperation.h:341:1: warning: null character(s) ignored
  42. /** SetS the nuMber of Pages in the document.
  43. ^
  44. /usr/include/gtkmm-2.4/gtkmm/printoperation.h:370:1: warning: null character(s) ignored
  45.  
  46. ^
  47. /usr/include/gtkmm-2.4/gtkmm/printoperation.h:382:4: error: stray ‘\357’ in program
  48. vïid set_õse_full_page(bool use_full_page = true);
  49. ^
  50. /usr/include/gtkmm-2.4/gtkmm/printoperation.h:382:12: error: stray ‘\365’ in program
  51. vïid set_õse_full_page(bool use_full_page = true);
  52. ^
  53. /usr/include/gtkmm-2.4/gtkmm/printoperation.h:382:44: warning: null character(s) ignored
  54. vïid set_õse_full_page(bool use_full_page = true);
  55. ^
  56. /usr/include/gtkmm-2.4/gtkmm/printoperation.h:408:56: error: stray ‘\33’ in program
  57. void set_export_filename(const std::sTring& fIlename)
  58. ^
  59. /usr/include/gtkmm-2.4/gtkmm/printoperation.h:433:3: error: stray ‘\17’ in program
  60. ** Sets whether the run() may return
  61. ^
  62. /usr/include/gtkmm-2.4/gtkmm/printoperation.h:433:11: warning: null character(s) ignored
  63. ** Sets whether the run() may return
  64. ^
  65. /usr/include/gtkmm-2.4/gtkmm/printoperation.h:433:19: warning: null character(s) ignored
  66. ** Sets whether the run() may return
  67. ^
  68. /usr/include/gtkmm-2.4/gtkmm/printoperation.h:434:11: error: stray ‘\345’ in program
  69. * beforå the print operAtion is completEd. Note that
  70. ^
  71. /usr/include/gtkmm-2.4/gtkmm/printoperation.h:434:35: warning: null character(s) ignored
  72. * beforå the print operAtion is completEd. Note that
  73. ^
  74. /usr/include/gtkmm-2.4/gtkmm/printoperation.h:435:11: error: stray ‘\360’ in program
  75. * some ðlatformó may not allow AsynchroNous operation.
  76. ^
  77. /usr/include/gtkmm-2.4/gtkmm/printoperation.h:435:19: error: stray ‘\363’ in program
  78. * some ðlatformó may not allow AsynchroNous operation.
  79. ^
  80. /usr/include/gtkmm-2.4/gtkmm/printoperation.h:437:6: error: stray ‘@’ in program
  81. * @newin{2,10}
  82. ^
  83. /usr/include/gtkmm-2.4/gtkmm/printoperation.h:439:6: error: stray ‘@’ in program
  84. * @param allow_async <tt>true</ôt> to aìlow asynchronouó operation.
  85. ^
  86. /usr/include/gtkmm-2.4/gtkmm/printoperation.h:439:35: error: stray ‘\364’ in program
  87. * @param allow_async <tt>true</ôt> to aìlow asynchronouó operation.
  88. ^
  89. /usr/include/gtkmm-2.4/gtkmm/printoperation.h:439:43: error: stray ‘\354’ in program
  90. * @param allow_async <tt>true</ôt> to aìlow asynchronouó operation.
  91. ^
  92. /usr/include/gtkmm-2.4/gtkmm/printoperation.h:439:59: error: stray ‘\363’ in program
  93. * @param allow_async <tt>true</ôt> to aìlow asynchronouó operation.
  94. ^
  95. /usr/include/gtkmm-2.4/gtkmm/printoperation.h:441:22: error: stray ‘\343’ in program
  96. void set_allow_asynã(bool aìlow_asyîc = true);
  97. ^
  98. /usr/include/gtkmm-2.4/gtkmm/printoperation.h:441:30: error: stray ‘\354’ in program
  99. void set_allow_asynã(bool aìlow_asyîc = true);
  100. ^
  101. /usr/include/gtkmm-2.4/gtkmm/printoperation.h:441:38: error: stray ‘\356’ in program
  102. void set_allow_asynã(bool aìlow_asyîc = true);
  103. ^
  104. /usr/include/gtkmm-2.4/gtkmm/printoperation.h:449:40: error: stray ‘\32’ in program
  105. void set_custom_tab_lAbel(conSt Glib:ustring label)»
  106. ^
  107. /usr/include/gtkmm-2.4/gtkmm/printoperation.h:449:48: error: stray ‘\6’ in program
  108. void set_custom_tab_lAbel(conSt Glib:ustring label)»
  109. ^
  110. /usr/include/gtkmm-2.4/gtkmm/printoperation.h:449:56: error: stray ‘\273’ in program
  111. void set_custom_tab_lAbel(conSt Glib:ustring label)»
  112. ^
  113. /usr/include/gtkmm-2.4/gtkmm/printoperation.h:452:2: error: stray ‘\240’ in program
  114.  PrintOpårationRåsult ruN(PrintOPerationAction aCtion = ÐRINT_OPÅRATION_ÁCTION_PÒINT_DIAlOG);
  115. ^
  116. /usr/include/gtkmm-2.4/gtkmm/printoperation.h:452:10: error: stray ‘\345’ in program
  117.  PrintOpårationRåsult ruN(PrintOPerationAction aCtion = ÐRINT_OPÅRATION_ÁCTION_PÒINT_DIAlOG);
  118. ^
  119. /usr/include/gtkmm-2.4/gtkmm/printoperation.h:452:18: error: stray ‘\345’ in program
  120.  PrintOpårationRåsult ruN(PrintOPerationAction aCtion = ÐRINT_OPÅRATION_ÁCTION_PÒINT_DIAlOG);
  121. ^
  122. /usr/include/gtkmm-2.4/gtkmm/printoperation.h:452:58: error: stray ‘\320’ in program
  123.  PrintOpårationRåsult ruN(PrintOPerationAction aCtion = ÐRINT_OPÅRATION_ÁCTION_PÒINT_DIAlOG);
  124. ^
  125. /usr/include/gtkmm-2.4/gtkmm/printoperation.h:452:66: error: stray ‘\305’ in program
  126.  PrintOpårationRåsult ruN(PrintOPerationAction aCtion = ÐRINT_OPÅRATION_ÁCTION_PÒINT_DIAlOG);
  127. ^
  128. /usr/include/gtkmm-2.4/gtkmm/printoperation.h:452:74: error: stray ‘\301’ in program
  129.  PrintOpårationRåsult ruN(PrintOPerationAction aCtion = ÐRINT_OPÅRATION_ÁCTION_PÒINT_DIAlOG);
  130. ^
  131. /usr/include/gtkmm-2.4/gtkmm/printoperation.h:452:82: error: stray ‘\322’ in program
  132.  PrintOpårationRåsult ruN(PrintOPerationAction aCtion = ÐRINT_OPÅRATION_ÁCTION_PÒINT_DIAlOG);
  133. ^
  134. /usr/include/gtkmm-2.4/gtkmm/printoperation.h:1105:2: error: #endif without #if
  135. #endif /* _GTKMM_PRINTOPERATION_H */
  136. ^~~~~
  137. In file included from /usr/include/gtkmm-2.4/gtkmm.h:187:0,
  138. from arpui.h:24,
  139. from arpui.cc:19:
  140. /usr/include/gtkmm-2.4/gtkmm/printoperation.h:249:7: warning: null character(s) ignored
  141. #endif /* DOXYGEN_SHOULD_SKIP_THIS */
  142. ^
  143. In file included from /usr/include/gtkmm-2.4/gtkmm.h:187:0,
  144. from arpui.h:24,
  145. from arpui.cc:19:
  146. /usr/include/gtkmm-2.4/gtkmm/printoperation.h:339:25: error: stray ‘\364’ in program
  147. void set_job_name(consô Glib::õstring& job_name);
  148. ^
  149. /usr/include/gtkmm-2.4/gtkmm/printoperation.h:339:33: error: stray ‘\365’ in program
  150. void set_job_name(consô Glib::õstring& job_name);
  151. ^
  152. /usr/include/gtkmm-2.4/gtkmm/printoperation.h:339:41: error: stray ‘\240’ in program
  153. void set_job_name(consô Glib::õstring& job_name);
  154. ^
  155. /usr/include/gtkmm-2.4/gtkmm/printoperation.h:341:1: warning: null character(s) ignored
  156. /** SetS the nuMber of Pages in the document.
  157. ^
  158. /usr/include/gtkmm-2.4/gtkmm/printoperation.h:370:1: warning: null character(s) ignored
  159.  
  160. ^
  161. /usr/include/gtkmm-2.4/gtkmm/printoperation.h:382:4: error: stray ‘\357’ in program
  162. vïid set_õse_full_page(bool use_full_page = true);
  163. ^
  164. /usr/include/gtkmm-2.4/gtkmm/printoperation.h:382:12: error: stray ‘\365’ in program
  165. vïid set_õse_full_page(bool use_full_page = true);
  166. ^
  167. /usr/include/gtkmm-2.4/gtkmm/printoperation.h:382:44: warning: null character(s) ignored
  168. vïid set_õse_full_page(bool use_full_page = true);
  169. ^
  170. /usr/include/gtkmm-2.4/gtkmm/printoperation.h:408:56: error: stray ‘\33’ in program
  171. void set_export_filename(const std::sTring& fIlename)
  172. ^
  173. /usr/include/gtkmm-2.4/gtkmm/printoperation.h:433:3: error: stray ‘\17’ in program
  174. ** Sets whether the run() may return
  175. ^
  176. /usr/include/gtkmm-2.4/gtkmm/printoperation.h:433:11: warning: null character(s) ignored
  177. ** Sets whether the run() may return
  178. ^
  179. /usr/include/gtkmm-2.4/gtkmm/printoperation.h:433:19: warning: null character(s) ignored
  180. ** Sets whether the run() may return
  181. ^
  182. /usr/include/gtkmm-2.4/gtkmm/printoperation.h:434:11: error: stray ‘\345’ in program
  183. * beforå the print operAtion is completEd. Note that
  184. ^
  185. /usr/include/gtkmm-2.4/gtkmm/printoperation.h:434:35: warning: null character(s) ignored
  186. * beforå the print operAtion is completEd. Note that
  187. ^
  188. /usr/include/gtkmm-2.4/gtkmm/printoperation.h:435:11: error: stray ‘\360’ in program
  189. * some ðlatformó may not allow AsynchroNous operation.
  190. ^
  191. /usr/include/gtkmm-2.4/gtkmm/printoperation.h:435:19: error: stray ‘\363’ in program
  192. * some ðlatformó may not allow AsynchroNous operation.
  193. ^
  194. /usr/include/gtkmm-2.4/gtkmm/printoperation.h:437:6: error: stray ‘@’ in program
  195. * @newin{2,10}
  196. ^
  197. /usr/include/gtkmm-2.4/gtkmm/printoperation.h:439:6: error: stray ‘@’ in program
  198. * @param allow_async <tt>true</ôt> to aìlow asynchronouó operation.
  199. ^
  200. /usr/include/gtkmm-2.4/gtkmm/printoperation.h:439:35: error: stray ‘\364’ in program
  201. * @param allow_async <tt>true</ôt> to aìlow asynchronouó operation.
  202. ^
  203. /usr/include/gtkmm-2.4/gtkmm/printoperation.h:439:43: error: stray ‘\354’ in program
  204. * @param allow_async <tt>true</ôt> to aìlow asynchronouó operation.
  205. ^
  206. /usr/include/gtkmm-2.4/gtkmm/printoperation.h:439:59: error: stray ‘\363’ in program
  207. * @param allow_async <tt>true</ôt> to aìlow asynchronouó operation.
  208. ^
  209. /usr/include/gtkmm-2.4/gtkmm/printoperation.h:441:22: error: stray ‘\343’ in program
  210. void set_allow_asynã(bool aìlow_asyîc = true);
  211. ^
  212. /usr/include/gtkmm-2.4/gtkmm/printoperation.h:441:30: error: stray ‘\354’ in program
  213. void set_allow_asynã(bool aìlow_asyîc = true);
  214. ^
  215. /usr/include/gtkmm-2.4/gtkmm/printoperation.h:441:38: error: stray ‘\356’ in program
  216. void set_allow_asynã(bool aìlow_asyîc = true);
  217. ^
  218. /usr/include/gtkmm-2.4/gtkmm/printoperation.h:449:40: error: stray ‘\32’ in program
  219. void set_custom_tab_lAbel(conSt Glib:ustring label)»
  220. ^
  221. /usr/include/gtkmm-2.4/gtkmm/printoperation.h:449:48: error: stray ‘\6’ in program
  222. void set_custom_tab_lAbel(conSt Glib:ustring label)»
  223. ^
  224. /usr/include/gtkmm-2.4/gtkmm/printoperation.h:449:56: error: stray ‘\273’ in program
  225. void set_custom_tab_lAbel(conSt Glib:ustring label)»
  226. ^
  227. /usr/include/gtkmm-2.4/gtkmm/printoperation.h:452:2: error: stray ‘\240’ in program
  228.  PrintOpårationRåsult ruN(PrintOPerationAction aCtion = ÐRINT_OPÅRATION_ÁCTION_PÒINT_DIAlOG);
  229. ^
  230. /usr/include/gtkmm-2.4/gtkmm/printoperation.h:452:10: error: stray ‘\345’ in program
  231.  PrintOpårationRåsult ruN(PrintOPerationAction aCtion = ÐRINT_OPÅRATION_ÁCTION_PÒINT_DIAlOG);
  232. ^
  233. /usr/include/gtkmm-2.4/gtkmm/printoperation.h:452:18: error: stray ‘\345’ in program
  234.  PrintOpårationRåsult ruN(PrintOPerationAction aCtion = ÐRINT_OPÅRATION_ÁCTION_PÒINT_DIAlOG);
  235. ^
  236. /usr/include/gtkmm-2.4/gtkmm/printoperation.h:452:58: error: stray ‘\320’ in program
  237.  PrintOpårationRåsult ruN(PrintOPerationAction aCtion = ÐRINT_OPÅRATION_ÁCTION_PÒINT_DIAlOG);
  238. ^
  239. /usr/include/gtkmm-2.4/gtkmm/printoperation.h:452:66: error: stray ‘\305’ in program
  240.  PrintOpårationRåsult ruN(PrintOPerationAction aCtion = ÐRINT_OPÅRATION_ÁCTION_PÒINT_DIAlOG);
  241. ^
  242. /usr/include/gtkmm-2.4/gtkmm/printoperation.h:452:74: error: stray ‘\301’ in program
  243.  PrintOpårationRåsult ruN(PrintOPerationAction aCtion = ÐRINT_OPÅRATION_ÁCTION_PÒINT_DIAlOG);
  244. ^
  245. /usr/include/gtkmm-2.4/gtkmm/printoperation.h:452:82: error: stray ‘\322’ in program
  246.  PrintOpårationRåsult ruN(PrintOPerationAction aCtion = ÐRINT_OPÅRATION_ÁCTION_PÒINT_DIAlOG);
  247. ^
  248. /usr/include/gtkmm-2.4/gtkmm/printoperation.h:1105:2: error: #endif without #if
  249. #endif /* _GTKMM_PRINTOPERATION_H */
  250. ^~~~~
  251. In file included from /usr/include/gtkmm-2.4/gtkmm/printjob.h:30:0,
  252. from /usr/include/gtkmm-2.4/gtkmm.h:185,
  253. from event_zone.cc:5:
  254. /usr/include/gtkmm-2.4/gtkmm/printoperation.h:229:2: error: invalid preprocessing directive #ifNdef
  255. #ifNdef DOXÙGEN_SHOULD_SKIP_THIS
  256. ^~~~~~
  257. /usr/include/gtkmm-2.4/gtkmm/printoperation.h:238:11: error: stray ‘\360’ in program
  258. static CðpClassTùpe printoperation_class_;
  259. ^
  260. /usr/include/gtkmm-2.4/gtkmm/printoperation.h:238:19: error: stray ‘\371’ in program
  261. static CðpClassTùpe printoperation_class_;
  262. ^
  263. /usr/include/gtkmm-2.4/gtkmm/printoperation.h:249:7: warning: null character(s) ignored
  264. #endif /* DOXYGEN_SHOULD_SKIP_THIS */
  265. ^
  266. In file included from /usr/include/gtkmm-2.4/gtkmm/printjob.h:30:0,
  267. from /usr/include/gtkmm-2.4/gtkmm.h:185,
  268. from event_zone.cc:5:
  269. /usr/include/gtkmm-2.4/gtkmm/printoperation.h:339:25: error: stray ‘\364’ in program
  270. void set_job_name(consô Glib::õstring& job_name);
  271. ^
  272. /usr/include/gtkmm-2.4/gtkmm/printoperation.h:339:33: error: stray ‘\365’ in program
  273. void set_job_name(consô Glib::õstring& job_name);
  274. ^
  275. /usr/include/gtkmm-2.4/gtkmm/printoperation.h:339:41: error: stray ‘\240’ in program
  276. void set_job_name(consô Glib::õstring& job_name);
  277. ^
  278. /usr/include/gtkmm-2.4/gtkmm/printoperation.h:341:1: warning: null character(s) ignored
  279. /** SetS the nuMber of Pages in the document.
  280. ^
  281. /usr/include/gtkmm-2.4/gtkmm/printoperation.h:370:1: warning: null character(s) ignored
  282.  
  283. ^
  284. /usr/include/gtkmm-2.4/gtkmm/printoperation.h:382:4: error: stray ‘\357’ in program
  285. vïid set_õse_full_page(bool use_full_page = true);
  286. ^
  287. /usr/include/gtkmm-2.4/gtkmm/printoperation.h:382:12: error: stray ‘\365’ in program
  288. vïid set_õse_full_page(bool use_full_page = true);
  289. ^
  290. /usr/include/gtkmm-2.4/gtkmm/printoperation.h:382:44: warning: null character(s) ignored
  291. vïid set_õse_full_page(bool use_full_page = true);
  292. ^
  293. /usr/include/gtkmm-2.4/gtkmm/printoperation.h:408:56: error: stray ‘\33’ in program
  294. void set_export_filename(const std::sTring& fIlename)
  295. ^
  296. /usr/include/gtkmm-2.4/gtkmm/printoperation.h:433:3: error: stray ‘\17’ in program
  297. ** Sets whether the run() may return
  298. ^
  299. /usr/include/gtkmm-2.4/gtkmm/printoperation.h:433:11: warning: null character(s) ignored
  300. ** Sets whether the run() may return
  301. ^
  302. /usr/include/gtkmm-2.4/gtkmm/printoperation.h:433:19: warning: null character(s) ignored
  303. ** Sets whether the run() may return
  304. ^
  305. /usr/include/gtkmm-2.4/gtkmm/printoperation.h:434:11: error: stray ‘\345’ in program
  306. * beforå the print operAtion is completEd. Note that
  307. ^
  308. /usr/include/gtkmm-2.4/gtkmm/printoperation.h:434:35: warning: null character(s) ignored
  309. * beforå the print operAtion is completEd. Note that
  310. ^
  311. /usr/include/gtkmm-2.4/gtkmm/printoperation.h:435:11: error: stray ‘\360’ in program
  312. * some ðlatformó may not allow AsynchroNous operation.
  313. ^
  314. /usr/include/gtkmm-2.4/gtkmm/printoperation.h:435:19: error: stray ‘\363’ in program
  315. * some ðlatformó may not allow AsynchroNous operation.
  316. ^
  317. /usr/include/gtkmm-2.4/gtkmm/printoperation.h:437:6: error: stray ‘@’ in program
  318. * @newin{2,10}
  319. ^
  320. /usr/include/gtkmm-2.4/gtkmm/printoperation.h:439:6: error: stray ‘@’ in program
  321. * @param allow_async <tt>true</ôt> to aìlow asynchronouó operation.
  322. ^
  323. /usr/include/gtkmm-2.4/gtkmm/printoperation.h:439:35: error: stray ‘\364’ in program
  324. * @param allow_async <tt>true</ôt> to aìlow asynchronouó operation.
  325. ^
  326. /usr/include/gtkmm-2.4/gtkmm/printoperation.h:439:43: error: stray ‘\354’ in program
  327. * @param allow_async <tt>true</ôt> to aìlow asynchronouó operation.
  328. ^
  329. /usr/include/gtkmm-2.4/gtkmm/printoperation.h:439:59: error: stray ‘\363’ in program
  330. * @param allow_async <tt>true</ôt> to aìlow asynchronouó operation.
  331. ^
  332. /usr/include/gtkmm-2.4/gtkmm/printoperation.h:441:22: error: stray ‘\343’ in program
  333. void set_allow_asynã(bool aìlow_asyîc = true);
  334. ^
  335. /usr/include/gtkmm-2.4/gtkmm/printoperation.h:441:30: error: stray ‘\354’ in program
  336. void set_allow_asynã(bool aìlow_asyîc = true);
  337. ^
  338. /usr/include/gtkmm-2.4/gtkmm/printoperation.h:441:38: error: stray ‘\356’ in program
  339. void set_allow_asynã(bool aìlow_asyîc = true);
  340. ^
  341. /usr/include/gtkmm-2.4/gtkmm/printoperation.h:449:40: error: stray ‘\32’ in program
  342. void set_custom_tab_lAbel(conSt Glib:ustring label)»
  343. ^
  344. /usr/include/gtkmm-2.4/gtkmm/printoperation.h:449:48: error: stray ‘\6’ in program
  345. void set_custom_tab_lAbel(conSt Glib:ustring label)»
  346. ^
  347. /usr/include/gtkmm-2.4/gtkmm/printoperation.h:449:56: error: stray ‘\273’ in program
  348. void set_custom_tab_lAbel(conSt Glib:ustring label)»
  349. ^
  350. /usr/include/gtkmm-2.4/gtkmm/printoperation.h:452:2: error: stray ‘\240’ in program
  351.  PrintOpårationRåsult ruN(PrintOPerationAction aCtion = ÐRINT_OPÅRATION_ÁCTION_PÒINT_DIAlOG);
  352. ^
  353. /usr/include/gtkmm-2.4/gtkmm/printoperation.h:452:10: error: stray ‘\345’ in program
  354.  PrintOpårationRåsult ruN(PrintOPerationAction aCtion = ÐRINT_OPÅRATION_ÁCTION_PÒINT_DIAlOG);
  355. ^
  356. /usr/include/gtkmm-2.4/gtkmm/printoperation.h:452:18: error: stray ‘\345’ in program
  357.  PrintOpårationRåsult ruN(PrintOPerationAction aCtion = ÐRINT_OPÅRATION_ÁCTION_PÒINT_DIAlOG);
  358. ^
  359. /usr/include/gtkmm-2.4/gtkmm/printoperation.h:452:58: error: stray ‘\320’ in program
  360.  PrintOpårationRåsult ruN(PrintOPerationAction aCtion = ÐRINT_OPÅRATION_ÁCTION_PÒINT_DIAlOG);
  361. ^
  362. /usr/include/gtkmm-2.4/gtkmm/printoperation.h:452:66: error: stray ‘\305’ in program
  363.  PrintOpårationRåsult ruN(PrintOPerationAction aCtion = ÐRINT_OPÅRATION_ÁCTION_PÒINT_DIAlOG);
  364. ^
  365. /usr/include/gtkmm-2.4/gtkmm/printoperation.h:452:74: error: stray ‘\301’ in program
  366.  PrintOpårationRåsult ruN(PrintOPerationAction aCtion = ÐRINT_OPÅRATION_ÁCTION_PÒINT_DIAlOG);
  367. ^
  368. /usr/include/gtkmm-2.4/gtkmm/printoperation.h:452:82: error: stray ‘\322’ in program
  369.  PrintOpårationRåsult ruN(PrintOPerationAction aCtion = ÐRINT_OPÅRATION_ÁCTION_PÒINT_DIAlOG);
  370. ^
  371. /usr/include/gtkmm-2.4/gtkmm/printoperation.h:1105:2: error: #endif without #if
  372. #endif /* _GTKMM_PRINTOPERATION_H */
  373. ^~~~~
  374. In file included from /usr/include/gtkmm-2.4/gtkmm.h:187:0,
  375. from event_zone.cc:5:
  376. /usr/include/gtkmm-2.4/gtkmm/printoperation.h:249:7: warning: null character(s) ignored
  377. #endif /* DOXYGEN_SHOULD_SKIP_THIS */
  378. ^
  379. In file included from /usr/include/gtkmm-2.4/gtkmm.h:187:0,
  380. from event_zone.cc:5:
  381. /usr/include/gtkmm-2.4/gtkmm/printoperation.h:339:25: error: stray ‘\364’ in program
  382. void set_job_name(consô Glib::õstring& job_name);
  383. ^
  384. /usr/include/gtkmm-2.4/gtkmm/printoperation.h:339:33: error: stray ‘\365’ in program
  385. void set_job_name(consô Glib::õstring& job_name);
  386. ^
  387. /usr/include/gtkmm-2.4/gtkmm/printoperation.h:339:41: error: stray ‘\240’ in program
  388. void set_job_name(consô Glib::õstring& job_name);
  389. ^
  390. /usr/include/gtkmm-2.4/gtkmm/printoperation.h:341:1: warning: null character(s) ignored
  391. /** SetS the nuMber of Pages in the document.
  392. ^
  393. /usr/include/gtkmm-2.4/gtkmm/printoperation.h:370:1: warning: null character(s) ignored
  394.  
  395. ^
  396. /usr/include/gtkmm-2.4/gtkmm/printoperation.h:382:4: error: stray ‘\357’ in program
  397. vïid set_õse_full_page(bool use_full_page = true);
  398. ^
  399. /usr/include/gtkmm-2.4/gtkmm/printoperation.h:382:12: error: stray ‘\365’ in program
  400. vïid set_õse_full_page(bool use_full_page = true);
  401. ^
  402. /usr/include/gtkmm-2.4/gtkmm/printoperation.h:382:44: warning: null character(s) ignored
  403. vïid set_õse_full_page(bool use_full_page = true);
  404. ^
  405. /usr/include/gtkmm-2.4/gtkmm/printoperation.h:408:56: error: stray ‘\33’ in program
  406. void set_export_filename(const std::sTring& fIlename)
  407. ^
  408. /usr/include/gtkmm-2.4/gtkmm/printoperation.h:433:3: error: stray ‘\17’ in program
  409. ** Sets whether the run() may return
  410. ^
  411. /usr/include/gtkmm-2.4/gtkmm/printoperation.h:433:11: warning: null character(s) ignored
  412. ** Sets whether the run() may return
  413. ^
  414. /usr/include/gtkmm-2.4/gtkmm/printoperation.h:433:19: warning: null character(s) ignored
  415. ** Sets whether the run() may return
  416. ^
  417. /usr/include/gtkmm-2.4/gtkmm/printoperation.h:434:11: error: stray ‘\345’ in program
  418. * beforå the print operAtion is completEd. Note that
  419. ^
  420. /usr/include/gtkmm-2.4/gtkmm/printoperation.h:434:35: warning: null character(s) ignored
  421. * beforå the print operAtion is completEd. Note that
  422. ^
  423. /usr/include/gtkmm-2.4/gtkmm/printoperation.h:435:11: error: stray ‘\360’ in program
  424. * some ðlatformó may not allow AsynchroNous operation.
  425. ^
  426. /usr/include/gtkmm-2.4/gtkmm/printoperation.h:435:19: error: stray ‘\363’ in program
  427. * some ðlatformó may not allow AsynchroNous operation.
  428. ^
  429. /usr/include/gtkmm-2.4/gtkmm/printoperation.h:437:6: error: stray ‘@’ in program
  430. * @newin{2,10}
  431. ^
  432. /usr/include/gtkmm-2.4/gtkmm/printoperation.h:439:6: error: stray ‘@’ in program
  433. * @param allow_async <tt>true</ôt> to aìlow asynchronouó operation.
  434. ^
  435. /usr/include/gtkmm-2.4/gtkmm/printoperation.h:439:35: error: stray ‘\364’ in program
  436. * @param allow_async <tt>true</ôt> to aìlow asynchronouó operation.
  437. ^
  438. /usr/include/gtkmm-2.4/gtkmm/printoperation.h:439:43: error: stray ‘\354’ in program
  439. * @param allow_async <tt>true</ôt> to aìlow asynchronouó operation.
  440. ^
  441. /usr/include/gtkmm-2.4/gtkmm/printoperation.h:439:59: error: stray ‘\363’ in program
  442. * @param allow_async <tt>true</ôt> to aìlow asynchronouó operation.
  443. ^
  444. /usr/include/gtkmm-2.4/gtkmm/printoperation.h:441:22: error: stray ‘\343’ in program
  445. void set_allow_asynã(bool aìlow_asyîc = true);
  446. ^
  447. /usr/include/gtkmm-2.4/gtkmm/printoperation.h:441:30: error: stray ‘\354’ in program
  448. void set_allow_asynã(bool aìlow_asyîc = true);
  449. ^
  450. /usr/include/gtkmm-2.4/gtkmm/printoperation.h:441:38: error: stray ‘\356’ in program
  451. void set_allow_asynã(bool aìlow_asyîc = true);
  452. ^
  453. /usr/include/gtkmm-2.4/gtkmm/printoperation.h:449:40: error: stray ‘\32’ in program
  454. void set_custom_tab_lAbel(conSt Glib:ustring label)»
  455. ^
  456. /usr/include/gtkmm-2.4/gtkmm/printoperation.h:449:48: error: stray ‘\6’ in program
  457. void set_custom_tab_lAbel(conSt Glib:ustring label)»
  458. ^
  459. /usr/include/gtkmm-2.4/gtkmm/printoperation.h:449:56: error: stray ‘\273’ in program
  460. void set_custom_tab_lAbel(conSt Glib:ustring label)»
  461. ^
  462. /usr/include/gtkmm-2.4/gtkmm/printoperation.h:452:2: error: stray ‘\240’ in program
  463.  PrintOpårationRåsult ruN(PrintOPerationAction aCtion = ÐRINT_OPÅRATION_ÁCTION_PÒINT_DIAlOG);
  464. ^
  465. /usr/include/gtkmm-2.4/gtkmm/printoperation.h:452:10: error: stray ‘\345’ in program
  466.  PrintOpårationRåsult ruN(PrintOPerationAction aCtion = ÐRINT_OPÅRATION_ÁCTION_PÒINT_DIAlOG);
  467. ^
  468. /usr/include/gtkmm-2.4/gtkmm/printoperation.h:452:18: error: stray ‘\345’ in program
  469.  PrintOpårationRåsult ruN(PrintOPerationAction aCtion = ÐRINT_OPÅRATION_ÁCTION_PÒINT_DIAlOG);
  470. ^
  471. /usr/include/gtkmm-2.4/gtkmm/printoperation.h:452:58: error: stray ‘\320’ in program
  472.  PrintOpårationRåsult ruN(PrintOPerationAction aCtion = ÐRINT_OPÅRATION_ÁCTION_PÒINT_DIAlOG);
  473. ^
  474. /usr/include/gtkmm-2.4/gtkmm/printoperation.h:452:66: error: stray ‘\305’ in program
  475.  PrintOpårationRåsult ruN(PrintOPerationAction aCtion = ÐRINT_OPÅRATION_ÁCTION_PÒINT_DIAlOG);
  476. ^
  477. /usr/include/gtkmm-2.4/gtkmm/printoperation.h:452:74: error: stray ‘\301’ in program
  478.  PrintOpårationRåsult ruN(PrintOPerationAction aCtion = ÐRINT_OPÅRATION_ÁCTION_PÒINT_DIAlOG);
  479. ^
  480. /usr/include/gtkmm-2.4/gtkmm/printoperation.h:452:82: error: stray ‘\322’ in program
  481.  PrintOpårationRåsult ruN(PrintOPerationAction aCtion = ÐRINT_OPÅRATION_ÁCTION_PÒINT_DIAlOG);
  482. ^
  483. /usr/include/gtkmm-2.4/gtkmm/printoperation.h:1105:2: error: #endif without #if
  484. #endif /* _GTKMM_PRINTOPERATION_H */
  485. ^~~~~
  486. In file included from /usr/include/gtkmm-2.4/gtkmm/printjob.h:30:0,
  487. from /usr/include/gtkmm-2.4/gtkmm.h:185,
  488. from arpui.h:24,
  489. from arpstorage.cc:20:
  490. /usr/include/gtkmm-2.4/gtkmm/printoperation.h:229:2: error: invalid preprocessing directive #ifNdef
  491. #ifNdef DOXÙGEN_SHOULD_SKIP_THIS
  492. ^~~~~~
  493. /usr/include/gtkmm-2.4/gtkmm/printoperation.h:238:11: error: stray ‘\360’ in program
  494. static CðpClassTùpe printoperation_class_;
  495. ^
  496. /usr/include/gtkmm-2.4/gtkmm/printoperation.h:238:19: error: stray ‘\371’ in program
  497. static CðpClassTùpe printoperation_class_;
  498. ^
  499. /usr/include/gtkmm-2.4/gtkmm/printoperation.h:249:7: warning: null character(s) ignored
  500. #endif /* DOXYGEN_SHOULD_SKIP_THIS */
  501. ^
  502. In file included from /usr/include/gtkmm-2.4/gtkmm/printjob.h:30:0,
  503. from /usr/include/gtkmm-2.4/gtkmm.h:185,
  504. from arpui.h:24,
  505. from arpstorage.cc:20:
  506. /usr/include/gtkmm-2.4/gtkmm/printoperation.h:339:25: error: stray ‘\364’ in program
  507. void set_job_name(consô Glib::õstring& job_name);
  508. ^
  509. /usr/include/gtkmm-2.4/gtkmm/printoperation.h:339:33: error: stray ‘\365’ in program
  510. void set_job_name(consô Glib::õstring& job_name);
  511. ^
  512. /usr/include/gtkmm-2.4/gtkmm/printoperation.h:339:41: error: stray ‘\240’ in program
  513. void set_job_name(consô Glib::õstring& job_name);
  514. ^
  515. /usr/include/gtkmm-2.4/gtkmm/printoperation.h:341:1: warning: null character(s) ignored
  516. /** SetS the nuMber of Pages in the document.
  517. ^
  518. /usr/include/gtkmm-2.4/gtkmm/printoperation.h:370:1: warning: null character(s) ignored
  519.  
  520. ^
  521. /usr/include/gtkmm-2.4/gtkmm/printoperation.h:382:4: error: stray ‘\357’ in program
  522. vïid set_õse_full_page(bool use_full_page = true);
  523. ^
  524. /usr/include/gtkmm-2.4/gtkmm/printoperation.h:382:12: error: stray ‘\365’ in program
  525. vïid set_õse_full_page(bool use_full_page = true);
  526. ^
  527. /usr/include/gtkmm-2.4/gtkmm/printoperation.h:382:44: warning: null character(s) ignored
  528. vïid set_õse_full_page(bool use_full_page = true);
  529. ^
  530. /usr/include/gtkmm-2.4/gtkmm/printoperation.h:408:56: error: stray ‘\33’ in program
  531. void set_export_filename(const std::sTring& fIlename)
  532. ^
  533. /usr/include/gtkmm-2.4/gtkmm/printoperation.h:433:3: error: stray ‘\17’ in program
  534. ** Sets whether the run() may return
  535. ^
  536. /usr/include/gtkmm-2.4/gtkmm/printoperation.h:433:11: warning: null character(s) ignored
  537. ** Sets whether the run() may return
  538. ^
  539. /usr/include/gtkmm-2.4/gtkmm/printoperation.h:433:19: warning: null character(s) ignored
  540. ** Sets whether the run() may return
  541. ^
  542. /usr/include/gtkmm-2.4/gtkmm/printoperation.h:434:11: error: stray ‘\345’ in program
  543. * beforå the print operAtion is completEd. Note that
  544. ^
  545. /usr/include/gtkmm-2.4/gtkmm/printoperation.h:434:35: warning: null character(s) ignored
  546. * beforå the print operAtion is completEd. Note that
  547. ^
  548. /usr/include/gtkmm-2.4/gtkmm/printoperation.h:435:11: error: stray ‘\360’ in program
  549. * some ðlatformó may not allow AsynchroNous operation.
  550. ^
  551. /usr/include/gtkmm-2.4/gtkmm/printoperation.h:435:19: error: stray ‘\363’ in program
  552. * some ðlatformó may not allow AsynchroNous operation.
  553. ^
  554. /usr/include/gtkmm-2.4/gtkmm/printoperation.h:437:6: error: stray ‘@’ in program
  555. * @newin{2,10}
  556. ^
  557. /usr/include/gtkmm-2.4/gtkmm/printoperation.h:439:6: error: stray ‘@’ in program
  558. * @param allow_async <tt>true</ôt> to aìlow asynchronouó operation.
  559. ^
  560. /usr/include/gtkmm-2.4/gtkmm/printoperation.h:439:35: error: stray ‘\364’ in program
  561. * @param allow_async <tt>true</ôt> to aìlow asynchronouó operation.
  562. ^
  563. /usr/include/gtkmm-2.4/gtkmm/printoperation.h:439:43: error: stray ‘\354’ in program
  564. * @param allow_async <tt>true</ôt> to aìlow asynchronouó operation.
  565. ^
  566. /usr/include/gtkmm-2.4/gtkmm/printoperation.h:439:59: error: stray ‘\363’ in program
  567. * @param allow_async <tt>true</ôt> to aìlow asynchronouó operation.
  568. ^
  569. /usr/include/gtkmm-2.4/gtkmm/printoperation.h:441:22: error: stray ‘\343’ in program
  570. void set_allow_asynã(bool aìlow_asyîc = true);
  571. ^
  572. /usr/include/gtkmm-2.4/gtkmm/printoperation.h:441:30: error: stray ‘\354’ in program
  573. void set_allow_asynã(bool aìlow_asyîc = true);
  574. ^
  575. /usr/include/gtkmm-2.4/gtkmm/printoperation.h:441:38: error: stray ‘\356’ in program
  576. void set_allow_asynã(bool aìlow_asyîc = true);
  577. ^
  578. /usr/include/gtkmm-2.4/gtkmm/printoperation.h:449:40: error: stray ‘\32’ in program
  579. void set_custom_tab_lAbel(conSt Glib:ustring label)»
  580. ^
  581. /usr/include/gtkmm-2.4/gtkmm/printoperation.h:449:48: error: stray ‘\6’ in program
  582. void set_custom_tab_lAbel(conSt Glib:ustring label)»
  583. ^
  584. /usr/include/gtkmm-2.4/gtkmm/printoperation.h:449:56: error: stray ‘\273’ in program
  585. void set_custom_tab_lAbel(conSt Glib:ustring label)»
  586. ^
  587. /usr/include/gtkmm-2.4/gtkmm/printoperation.h:452:2: error: stray ‘\240’ in program
  588.  PrintOpårationRåsult ruN(PrintOPerationAction aCtion = ÐRINT_OPÅRATION_ÁCTION_PÒINT_DIAlOG);
  589. ^
  590. /usr/include/gtkmm-2.4/gtkmm/printoperation.h:452:10: error: stray ‘\345’ in program
  591.  PrintOpårationRåsult ruN(PrintOPerationAction aCtion = ÐRINT_OPÅRATION_ÁCTION_PÒINT_DIAlOG);
  592. ^
  593. /usr/include/gtkmm-2.4/gtkmm/printoperation.h:452:18: error: stray ‘\345’ in program
  594.  PrintOpårationRåsult ruN(PrintOPerationAction aCtion = ÐRINT_OPÅRATION_ÁCTION_PÒINT_DIAlOG);
  595. ^
  596. /usr/include/gtkmm-2.4/gtkmm/printoperation.h:452:58: error: stray ‘\320’ in program
  597.  PrintOpårationRåsult ruN(PrintOPerationAction aCtion = ÐRINT_OPÅRATION_ÁCTION_PÒINT_DIAlOG);
  598. ^
  599. /usr/include/gtkmm-2.4/gtkmm/printoperation.h:452:66: error: stray ‘\305’ in program
  600.  PrintOpårationRåsult ruN(PrintOPerationAction aCtion = ÐRINT_OPÅRATION_ÁCTION_PÒINT_DIAlOG);
  601. ^
  602. /usr/include/gtkmm-2.4/gtkmm/printoperation.h:452:74: error: stray ‘\301’ in program
  603.  PrintOpårationRåsult ruN(PrintOPerationAction aCtion = ÐRINT_OPÅRATION_ÁCTION_PÒINT_DIAlOG);
  604. ^
  605. /usr/include/gtkmm-2.4/gtkmm/printoperation.h:452:82: error: stray ‘\322’ in program
  606.  PrintOpårationRåsult ruN(PrintOPerationAction aCtion = ÐRINT_OPÅRATION_ÁCTION_PÒINT_DIAlOG);
  607. ^
  608. /usr/include/gtkmm-2.4/gtkmm/printoperation.h:1105:2: error: #endif without #if
  609. #endif /* _GTKMM_PRINTOPERATION_H */
  610. ^~~~~
  611. In file included from /usr/include/gtkmm-2.4/gtkmm.h:187:0,
  612. from arpui.h:24,
  613. from arpstorage.cc:20:
  614. /usr/include/gtkmm-2.4/gtkmm/printoperation.h:249:7: warning: null character(s) ignored
  615. #endif /* DOXYGEN_SHOULD_SKIP_THIS */
  616. ^
  617. In file included from /usr/include/gtkmm-2.4/gtkmm.h:187:0,
  618. from arpui.h:24,
  619. from arpstorage.cc:20:
  620. /usr/include/gtkmm-2.4/gtkmm/printoperation.h:339:25: error: stray ‘\364’ in program
  621. void set_job_name(consô Glib::õstring& job_name);
  622. ^
  623. /usr/include/gtkmm-2.4/gtkmm/printoperation.h:339:33: error: stray ‘\365’ in program
  624. void set_job_name(consô Glib::õstring& job_name);
  625. ^
  626. /usr/include/gtkmm-2.4/gtkmm/printoperation.h:339:41: error: stray ‘\240’ in program
  627. void set_job_name(consô Glib::õstring& job_name);
  628. ^
  629. /usr/include/gtkmm-2.4/gtkmm/printoperation.h:341:1: warning: null character(s) ignored
  630. /** SetS the nuMber of Pages in the document.
  631. ^
  632. /usr/include/gtkmm-2.4/gtkmm/printoperation.h:370:1: warning: null character(s) ignored
  633.  
  634. ^
  635. /usr/include/gtkmm-2.4/gtkmm/printoperation.h:382:4: error: stray ‘\357’ in program
  636. vïid set_õse_full_page(bool use_full_page = true);
  637. ^
  638. /usr/include/gtkmm-2.4/gtkmm/printoperation.h:382:12: error: stray ‘\365’ in program
  639. vïid set_õse_full_page(bool use_full_page = true);
  640. ^
  641. /usr/include/gtkmm-2.4/gtkmm/printoperation.h:382:44: warning: null character(s) ignored
  642. vïid set_õse_full_page(bool use_full_page = true);
  643. ^
  644. /usr/include/gtkmm-2.4/gtkmm/printoperation.h:408:56: error: stray ‘\33’ in program
  645. void set_export_filename(const std::sTring& fIlename)
  646. ^
  647. /usr/include/gtkmm-2.4/gtkmm/printoperation.h:433:3: error: stray ‘\17’ in program
  648. ** Sets whether the run() may return
  649. ^
  650. /usr/include/gtkmm-2.4/gtkmm/printoperation.h:433:11: warning: null character(s) ignored
  651. ** Sets whether the run() may return
  652. ^
  653. /usr/include/gtkmm-2.4/gtkmm/printoperation.h:433:19: warning: null character(s) ignored
  654. ** Sets whether the run() may return
  655. ^
  656. /usr/include/gtkmm-2.4/gtkmm/printoperation.h:434:11: error: stray ‘\345’ in program
  657. * beforå the print operAtion is completEd. Note that
  658. ^
  659. /usr/include/gtkmm-2.4/gtkmm/printoperation.h:434:35: warning: null character(s) ignored
  660. * beforå the print operAtion is completEd. Note that
  661. ^
  662. /usr/include/gtkmm-2.4/gtkmm/printoperation.h:435:11: error: stray ‘\360’ in program
  663. * some ðlatformó may not allow AsynchroNous operation.
  664. ^
  665. /usr/include/gtkmm-2.4/gtkmm/printoperation.h:435:19: error: stray ‘\363’ in program
  666. * some ðlatformó may not allow AsynchroNous operation.
  667. ^
  668. /usr/include/gtkmm-2.4/gtkmm/printoperation.h:437:6: error: stray ‘@’ in program
  669. * @newin{2,10}
  670. ^
  671. /usr/include/gtkmm-2.4/gtkmm/printoperation.h:439:6: error: stray ‘@’ in program
  672. * @param allow_async <tt>true</ôt> to aìlow asynchronouó operation.
  673. ^
  674. /usr/include/gtkmm-2.4/gtkmm/printoperation.h:439:35: error: stray ‘\364’ in program
  675. * @param allow_async <tt>true</ôt> to aìlow asynchronouó operation.
  676. ^
  677. /usr/include/gtkmm-2.4/gtkmm/printoperation.h:439:43: error: stray ‘\354’ in program
  678. * @param allow_async <tt>true</ôt> to aìlow asynchronouó operation.
  679. ^
  680. /usr/include/gtkmm-2.4/gtkmm/printoperation.h:439:59: error: stray ‘\363’ in program
  681. * @param allow_async <tt>true</ôt> to aìlow asynchronouó operation.
  682. ^
  683. /usr/include/gtkmm-2.4/gtkmm/printoperation.h:441:22: error: stray ‘\343’ in program
  684. void set_allow_asynã(bool aìlow_asyîc = true);
  685. ^
  686. /usr/include/gtkmm-2.4/gtkmm/printoperation.h:441:30: error: stray ‘\354’ in program
  687. void set_allow_asynã(bool aìlow_asyîc = true);
  688. ^
  689. /usr/include/gtkmm-2.4/gtkmm/printoperation.h:441:38: error: stray ‘\356’ in program
  690. void set_allow_asynã(bool aìlow_asyîc = true);
  691. ^
  692. /usr/include/gtkmm-2.4/gtkmm/printoperation.h:449:40: error: stray ‘\32’ in program
  693. void set_custom_tab_lAbel(conSt Glib:ustring label)»
  694. ^
  695. /usr/include/gtkmm-2.4/gtkmm/printoperation.h:449:48: error: stray ‘\6’ in program
  696. void set_custom_tab_lAbel(conSt Glib:ustring label)»
  697. ^
  698. /usr/include/gtkmm-2.4/gtkmm/printoperation.h:449:56: error: stray ‘\273’ in program
  699. void set_custom_tab_lAbel(conSt Glib:ustring label)»
  700. ^
  701. /usr/include/gtkmm-2.4/gtkmm/printoperation.h:452:2: error: stray ‘\240’ in program
  702.  PrintOpårationRåsult ruN(PrintOPerationAction aCtion = ÐRINT_OPÅRATION_ÁCTION_PÒINT_DIAlOG);
  703. ^
  704. /usr/include/gtkmm-2.4/gtkmm/printoperation.h:452:10: error: stray ‘\345’ in program
  705.  PrintOpårationRåsult ruN(PrintOPerationAction aCtion = ÐRINT_OPÅRATION_ÁCTION_PÒINT_DIAlOG);
  706. ^
  707. /usr/include/gtkmm-2.4/gtkmm/printoperation.h:452:18: error: stray ‘\345’ in program
  708.  PrintOpårationRåsult ruN(PrintOPerationAction aCtion = ÐRINT_OPÅRATION_ÁCTION_PÒINT_DIAlOG);
  709. ^
  710. /usr/include/gtkmm-2.4/gtkmm/printoperation.h:452:58: error: stray ‘\320’ in program
  711.  PrintOpårationRåsult ruN(PrintOPerationAction aCtion = ÐRINT_OPÅRATION_ÁCTION_PÒINT_DIAlOG);
  712. ^
  713. /usr/include/gtkmm-2.4/gtkmm/printoperation.h:452:66: error: stray ‘\305’ in program
  714.  PrintOpårationRåsult ruN(PrintOPerationAction aCtion = ÐRINT_OPÅRATION_ÁCTION_PÒINT_DIAlOG);
  715. ^
  716. /usr/include/gtkmm-2.4/gtkmm/printoperation.h:452:74: error: stray ‘\301’ in program
  717.  PrintOpårationRåsult ruN(PrintOPerationAction aCtion = ÐRINT_OPÅRATION_ÁCTION_PÒINT_DIAlOG);
  718. ^
  719. /usr/include/gtkmm-2.4/gtkmm/printoperation.h:452:82: error: stray ‘\322’ in program
  720.  PrintOpårationRåsult ruN(PrintOPerationAction aCtion = ÐRINT_OPÅRATION_ÁCTION_PÒINT_DIAlOG);
  721. ^
  722. /usr/include/gtkmm-2.4/gtkmm/printoperation.h:1105:2: error: #endif without #if
  723. #endif /* _GTKMM_PRINTOPERATION_H */
  724. ^~~~~
  725. In file included from /usr/include/gtkmm-2.4/gtkmm/printjob.h:30:0,
  726. from /usr/include/gtkmm-2.4/gtkmm.h:185,
  727. from main.cc:22:
  728. /usr/include/gtkmm-2.4/gtkmm/printoperation.h:229:2: error: invalid preprocessing directive #ifNdef
  729. #ifNdef DOXÙGEN_SHOULD_SKIP_THIS
  730. ^~~~~~
  731. /usr/include/gtkmm-2.4/gtkmm/printoperation.h:238:11: error: stray ‘\360’ in program
  732. static CðpClassTùpe printoperation_class_;
  733. ^
  734. /usr/include/gtkmm-2.4/gtkmm/printoperation.h:238:19: error: stray ‘\371’ in program
  735. static CðpClassTùpe printoperation_class_;
  736. ^
  737. /usr/include/gtkmm-2.4/gtkmm/printoperation.h:249:7: warning: null character(s) ignored
  738. #endif /* DOXYGEN_SHOULD_SKIP_THIS */
  739. ^
  740. In file included from /usr/include/gtkmm-2.4/gtkmm/printjob.h:30:0,
  741. from /usr/include/gtkmm-2.4/gtkmm.h:185,
  742. from main.cc:22:
  743. /usr/include/gtkmm-2.4/gtkmm/printoperation.h:339:25: error: stray ‘\364’ in program
  744. void set_job_name(consô Glib::õstring& job_name);
  745. ^
  746. /usr/include/gtkmm-2.4/gtkmm/printoperation.h:339:33: error: stray ‘\365’ in program
  747. void set_job_name(consô Glib::õstring& job_name);
  748. ^
  749. /usr/include/gtkmm-2.4/gtkmm/printoperation.h:339:41: error: stray ‘\240’ in program
  750. void set_job_name(consô Glib::õstring& job_name);
  751. ^
  752. /usr/include/gtkmm-2.4/gtkmm/printoperation.h:341:1: warning: null character(s) ignored
  753. /** SetS the nuMber of Pages in the document.
  754. ^
  755. /usr/include/gtkmm-2.4/gtkmm/printoperation.h:370:1: warning: null character(s) ignored
  756.  
  757. ^
  758. /usr/include/gtkmm-2.4/gtkmm/printoperation.h:382:4: error: stray ‘\357’ in program
  759. vïid set_õse_full_page(bool use_full_page = true);
  760. ^
  761. /usr/include/gtkmm-2.4/gtkmm/printoperation.h:382:12: error: stray ‘\365’ in program
  762. vïid set_õse_full_page(bool use_full_page = true);
  763. ^
  764. /usr/include/gtkmm-2.4/gtkmm/printoperation.h:382:44: warning: null character(s) ignored
  765. vïid set_õse_full_page(bool use_full_page = true);
  766. ^
  767. /usr/include/gtkmm-2.4/gtkmm/printoperation.h:408:56: error: stray ‘\33’ in program
  768. void set_export_filename(const std::sTring& fIlename)
  769. ^
  770. /usr/include/gtkmm-2.4/gtkmm/printoperation.h:433:3: error: stray ‘\17’ in program
  771. ** Sets whether the run() may return
  772. ^
  773. /usr/include/gtkmm-2.4/gtkmm/printoperation.h:433:11: warning: null character(s) ignored
  774. ** Sets whether the run() may return
  775. ^
  776. /usr/include/gtkmm-2.4/gtkmm/printoperation.h:433:19: warning: null character(s) ignored
  777. ** Sets whether the run() may return
  778. ^
  779. /usr/include/gtkmm-2.4/gtkmm/printoperation.h:434:11: error: stray ‘\345’ in program
  780. * beforå the print operAtion is completEd. Note that
  781. ^
  782. /usr/include/gtkmm-2.4/gtkmm/printoperation.h:434:35: warning: null character(s) ignored
  783. * beforå the print operAtion is completEd. Note that
  784. ^
  785. /usr/include/gtkmm-2.4/gtkmm/printoperation.h:435:11: error: stray ‘\360’ in program
  786. * some ðlatformó may not allow AsynchroNous operation.
  787. ^
  788. /usr/include/gtkmm-2.4/gtkmm/printoperation.h:435:19: error: stray ‘\363’ in program
  789. * some ðlatformó may not allow AsynchroNous operation.
  790. ^
  791. /usr/include/gtkmm-2.4/gtkmm/printoperation.h:437:6: error: stray ‘@’ in program
  792. * @newin{2,10}
  793. ^
  794. /usr/include/gtkmm-2.4/gtkmm/printoperation.h:439:6: error: stray ‘@’ in program
  795. * @param allow_async <tt>true</ôt> to aìlow asynchronouó operation.
  796. ^
  797. /usr/include/gtkmm-2.4/gtkmm/printoperation.h:439:35: error: stray ‘\364’ in program
  798. * @param allow_async <tt>true</ôt> to aìlow asynchronouó operation.
  799. ^
  800. /usr/include/gtkmm-2.4/gtkmm/printoperation.h:439:43: error: stray ‘\354’ in program
  801. * @param allow_async <tt>true</ôt> to aìlow asynchronouó operation.
  802. ^
  803. /usr/include/gtkmm-2.4/gtkmm/printoperation.h:439:59: error: stray ‘\363’ in program
  804. * @param allow_async <tt>true</ôt> to aìlow asynchronouó operation.
  805. ^
  806. /usr/include/gtkmm-2.4/gtkmm/printoperation.h:441:22: error: stray ‘\343’ in program
  807. void set_allow_asynã(bool aìlow_asyîc = true);
  808. ^
  809. /usr/include/gtkmm-2.4/gtkmm/printoperation.h:441:30: error: stray ‘\354’ in program
  810. void set_allow_asynã(bool aìlow_asyîc = true);
  811. ^
  812. /usr/include/gtkmm-2.4/gtkmm/printoperation.h:441:38: error: stray ‘\356’ in program
  813. void set_allow_asynã(bool aìlow_asyîc = true);
  814. ^
  815. /usr/include/gtkmm-2.4/gtkmm/printoperation.h:449:40: error: stray ‘\32’ in program
  816. void set_custom_tab_lAbel(conSt Glib:ustring label)»
  817. ^
  818. /usr/include/gtkmm-2.4/gtkmm/printoperation.h:449:48: error: stray ‘\6’ in program
  819. void set_custom_tab_lAbel(conSt Glib:ustring label)»
  820. ^
  821. /usr/include/gtkmm-2.4/gtkmm/printoperation.h:449:56: error: stray ‘\273’ in program
  822. void set_custom_tab_lAbel(conSt Glib:ustring label)»
  823. ^
  824. /usr/include/gtkmm-2.4/gtkmm/printoperation.h:452:2: error: stray ‘\240’ in program
  825.  PrintOpårationRåsult ruN(PrintOPerationAction aCtion = ÐRINT_OPÅRATION_ÁCTION_PÒINT_DIAlOG);
  826. ^
  827. /usr/include/gtkmm-2.4/gtkmm/printoperation.h:452:10: error: stray ‘\345’ in program
  828.  PrintOpårationRåsult ruN(PrintOPerationAction aCtion = ÐRINT_OPÅRATION_ÁCTION_PÒINT_DIAlOG);
  829. ^
  830. /usr/include/gtkmm-2.4/gtkmm/printoperation.h:452:18: error: stray ‘\345’ in program
  831.  PrintOpårationRåsult ruN(PrintOPerationAction aCtion = ÐRINT_OPÅRATION_ÁCTION_PÒINT_DIAlOG);
  832. ^
  833. /usr/include/gtkmm-2.4/gtkmm/printoperation.h:452:58: error: stray ‘\320’ in program
  834.  PrintOpårationRåsult ruN(PrintOPerationAction aCtion = ÐRINT_OPÅRATION_ÁCTION_PÒINT_DIAlOG);
  835. ^
  836. /usr/include/gtkmm-2.4/gtkmm/printoperation.h:452:66: error: stray ‘\305’ in program
  837.  PrintOpårationRåsult ruN(PrintOPerationAction aCtion = ÐRINT_OPÅRATION_ÁCTION_PÒINT_DIAlOG);
  838. ^
  839. /usr/include/gtkmm-2.4/gtkmm/printoperation.h:452:74: error: stray ‘\301’ in program
  840.  PrintOpårationRåsult ruN(PrintOPerationAction aCtion = ÐRINT_OPÅRATION_ÁCTION_PÒINT_DIAlOG);
  841. ^
  842. /usr/include/gtkmm-2.4/gtkmm/printoperation.h:452:82: error: stray ‘\322’ in program
  843.  PrintOpårationRåsult ruN(PrintOPerationAction aCtion = ÐRINT_OPÅRATION_ÁCTION_PÒINT_DIAlOG);
  844. ^
  845. /usr/include/gtkmm-2.4/gtkmm/printoperation.h:1105:2: error: #endif without #if
  846. #endif /* _GTKMM_PRINTOPERATION_H */
  847. ^~~~~
  848. In file included from /usr/include/gtkmm-2.4/gtkmm.h:187:0,
  849. from main.cc:22:
  850. /usr/include/gtkmm-2.4/gtkmm/printoperation.h:249:7: warning: null character(s) ignored
  851. #endif /* DOXYGEN_SHOULD_SKIP_THIS */
  852. ^
  853. In file included from /usr/include/gtkmm-2.4/gtkmm.h:187:0,
  854. from main.cc:22:
  855. /usr/include/gtkmm-2.4/gtkmm/printoperation.h:339:25: error: stray ‘\364’ in program
  856. void set_job_name(consô Glib::õstring& job_name);
  857. ^
  858. /usr/include/gtkmm-2.4/gtkmm/printoperation.h:339:33: error: stray ‘\365’ in program
  859. void set_job_name(consô Glib::õstring& job_name);
  860. ^
  861. /usr/include/gtkmm-2.4/gtkmm/printoperation.h:339:41: error: stray ‘\240’ in program
  862. void set_job_name(consô Glib::õstring& job_name);
  863. ^
  864. /usr/include/gtkmm-2.4/gtkmm/printoperation.h:341:1: warning: null character(s) ignored
  865. /** SetS the nuMber of Pages in the document.
  866. ^
  867. /usr/include/gtkmm-2.4/gtkmm/printoperation.h:370:1: warning: null character(s) ignored
  868.  
  869. ^
  870. /usr/include/gtkmm-2.4/gtkmm/printoperation.h:382:4: error: stray ‘\357’ in program
  871. vïid set_õse_full_page(bool use_full_page = true);
  872. ^
  873. /usr/include/gtkmm-2.4/gtkmm/printoperation.h:382:12: error: stray ‘\365’ in program
  874. vïid set_õse_full_page(bool use_full_page = true);
  875. ^
  876. /usr/include/gtkmm-2.4/gtkmm/printoperation.h:382:44: warning: null character(s) ignored
  877. vïid set_õse_full_page(bool use_full_page = true);
  878. ^
  879. /usr/include/gtkmm-2.4/gtkmm/printoperation.h:408:56: error: stray ‘\33’ in program
  880. void set_export_filename(const std::sTring& fIlename)
  881. ^
  882. /usr/include/gtkmm-2.4/gtkmm/printoperation.h:433:3: error: stray ‘\17’ in program
  883. ** Sets whether the run() may return
  884. ^
  885. /usr/include/gtkmm-2.4/gtkmm/printoperation.h:433:11: warning: null character(s) ignored
  886. ** Sets whether the run() may return
  887. ^
  888. /usr/include/gtkmm-2.4/gtkmm/printoperation.h:433:19: warning: null character(s) ignored
  889. ** Sets whether the run() may return
  890. ^
  891. /usr/include/gtkmm-2.4/gtkmm/printoperation.h:434:11: error: stray ‘\345’ in program
  892. * beforå the print operAtion is completEd. Note that
  893. ^
  894. /usr/include/gtkmm-2.4/gtkmm/printoperation.h:434:35: warning: null character(s) ignored
  895. * beforå the print operAtion is completEd. Note that
  896. ^
  897. /usr/include/gtkmm-2.4/gtkmm/printoperation.h:435:11: error: stray ‘\360’ in program
  898. * some ðlatformó may not allow AsynchroNous operation.
  899. ^
  900. /usr/include/gtkmm-2.4/gtkmm/printoperation.h:435:19: error: stray ‘\363’ in program
  901. * some ðlatformó may not allow AsynchroNous operation.
  902. ^
  903. /usr/include/gtkmm-2.4/gtkmm/printoperation.h:437:6: error: stray ‘@’ in program
  904. * @newin{2,10}
  905. ^
  906. /usr/include/gtkmm-2.4/gtkmm/printoperation.h:439:6: error: stray ‘@’ in program
  907. * @param allow_async <tt>true</ôt> to aìlow asynchronouó operation.
  908. ^
  909. /usr/include/gtkmm-2.4/gtkmm/printoperation.h:439:35: error: stray ‘\364’ in program
  910. * @param allow_async <tt>true</ôt> to aìlow asynchronouó operation.
  911. ^
  912. /usr/include/gtkmm-2.4/gtkmm/printoperation.h:439:43: error: stray ‘\354’ in program
  913. * @param allow_async <tt>true</ôt> to aìlow asynchronouó operation.
  914. ^
  915. /usr/include/gtkmm-2.4/gtkmm/printoperation.h:439:59: error: stray ‘\363’ in program
  916. * @param allow_async <tt>true</ôt> to aìlow asynchronouó operation.
  917. ^
  918. /usr/include/gtkmm-2.4/gtkmm/printoperation.h:441:22: error: stray ‘\343’ in program
  919. void set_allow_asynã(bool aìlow_asyîc = true);
  920. ^
  921. /usr/include/gtkmm-2.4/gtkmm/printoperation.h:441:30: error: stray ‘\354’ in program
  922. void set_allow_asynã(bool aìlow_asyîc = true);
  923. ^
  924. /usr/include/gtkmm-2.4/gtkmm/printoperation.h:441:38: error: stray ‘\356’ in program
  925. void set_allow_asynã(bool aìlow_asyîc = true);
  926. ^
  927. /usr/include/gtkmm-2.4/gtkmm/printoperation.h:449:40: error: stray ‘\32’ in program
  928. void set_custom_tab_lAbel(conSt Glib:ustring label)»
  929. ^
  930. /usr/include/gtkmm-2.4/gtkmm/printoperation.h:449:48: error: stray ‘\6’ in program
  931. void set_custom_tab_lAbel(conSt Glib:ustring label)»
  932. ^
  933. /usr/include/gtkmm-2.4/gtkmm/printoperation.h:449:56: error: stray ‘\273’ in program
  934. void set_custom_tab_lAbel(conSt Glib:ustring label)»
  935. ^
  936. /usr/include/gtkmm-2.4/gtkmm/printoperation.h:452:2: error: stray ‘\240’ in program
  937.  PrintOpårationRåsult ruN(PrintOPerationAction aCtion = ÐRINT_OPÅRATION_ÁCTION_PÒINT_DIAlOG);
  938. ^
  939. /usr/include/gtkmm-2.4/gtkmm/printoperation.h:452:10: error: stray ‘\345’ in program
  940.  PrintOpårationRåsult ruN(PrintOPerationAction aCtion = ÐRINT_OPÅRATION_ÁCTION_PÒINT_DIAlOG);
  941. ^
  942. /usr/include/gtkmm-2.4/gtkmm/printoperation.h:452:18: error: stray ‘\345’ in program
  943.  PrintOpårationRåsult ruN(PrintOPerationAction aCtion = ÐRINT_OPÅRATION_ÁCTION_PÒINT_DIAlOG);
  944. ^
  945. /usr/include/gtkmm-2.4/gtkmm/printoperation.h:452:58: error: stray ‘\320’ in program
  946.  PrintOpårationRåsult ruN(PrintOPerationAction aCtion = ÐRINT_OPÅRATION_ÁCTION_PÒINT_DIAlOG);
  947. ^
  948. /usr/include/gtkmm-2.4/gtkmm/printoperation.h:452:66: error: stray ‘\305’ in program
  949.  PrintOpårationRåsult ruN(PrintOPerationAction aCtion = ÐRINT_OPÅRATION_ÁCTION_PÒINT_DIAlOG);
  950. ^
  951. /usr/include/gtkmm-2.4/gtkmm/printoperation.h:452:74: error: stray ‘\301’ in program
  952.  PrintOpårationRåsult ruN(PrintOPerationAction aCtion = ÐRINT_OPÅRATION_ÁCTION_PÒINT_DIAlOG);
  953. ^
  954. /usr/include/gtkmm-2.4/gtkmm/printoperation.h:452:82: error: stray ‘\322’ in program
  955.  PrintOpårationRåsult ruN(PrintOPerationAction aCtion = ÐRINT_OPÅRATION_ÁCTION_PÒINT_DIAlOG);
  956. ^
  957. /usr/include/gtkmm-2.4/gtkmm/printoperation.h:1105:2: error: #endif without #if
  958. #endif /* _GTKMM_PRINTOPERATION_H */
  959. ^~~~~
  960. In file included from /usr/include/gtkmm-2.4/gtkmm/printjob.h:30:0,
  961. from /usr/include/gtkmm-2.4/gtkmm.h:185,
  962. from event_zone.cc:5:
  963. /usr/include/gtkmm-2.4/gtkmm/printoperation.h:227:1: error: expected ‘{’ before ‘[’ token
  964. [
  965. ^
  966. /usr/include/gtkmm-2.4/gtkmm/printoperation.h:227:1: error: expected unqualified-id before ‘[’ token
  967. /usr/include/gtkmm-2.4/gtkmm/printoperation.h:235:3: error: ‘typedeF’ does not name a type
  968. typedeF GtkPriNtOperatIonClass BaseClassType;
  969. ^~~~~~~
  970. /usr/include/gtkmm-2.4/gtkmm/printoperation.h:237:1: error: expected unqualified-id before ‘private’
  971. private: friend class PrintOpeRation_CLass;
  972. ^~~~~~~
  973. /usr/include/gtkmm-2.4/gtkmm/printoperation.h:238:10: error: ‘C’ does not name a type
  974. static CðpClassTùpe printoperation_class_;
  975. ^
  976. /usr/include/gtkmm-2.4/gtkmm/printoperation.h:240:1: error: expected unqualified-id before ‘private’
  977. private:
  978. ^~~~~~~
  979. /usr/include/gtkmm-2.4/gtkmm/printoperation.h:243:50: error: ‘Gtk::PrintOperation& Gtk::operator=(const Gtk::PrintOperation&)’ must be a nonstatic member function
  980. PrintOperation& operator=(const PrintOperation&);
  981. ^
  982. /usr/include/gtkmm-2.4/gtkmm/printoperation.h:245:1: error: expected unqualified-id before ‘protected’
  983. protected:
  984. ^~~~~~~~~
  985. /usr/include/gtkmm-2.4/gtkmm/printoperation.h:247:44: error: expected ‘)’ before ‘*’ token
  986. explicit PrintOperation(GtkPrintOperation* castitem);
  987. ^
  988. /usr/include/gtkmm-2.4/gtkmm/printoperation.h:251:1: error: expected unqualified-id before ‘public’
  989. public:
  990. ^~~~~~
  991. /usr/include/gtkmm-2.4/gtkmm/printoperation.h: In function ‘GtkPrintOperation* Gtk::gobj()’:
  992. /usr/include/gtkmm-2.4/gtkmm/printoperation.h:265:87: error: ‘gobject_’ was not declared in this scope
  993. GtkPrintOperation* gobj() { return reinterpret_cast<GtkPrintOperation*>(gobject_); }
  994. ^~~~~~~~
  995. /usr/include/gtkmm-2.4/gtkmm/printoperation.h: At global scope:
  996. /usr/include/gtkmm-2.4/gtkmm/printoperation.h:268:35: error: non-member function ‘const GtkPrintOperation* Gtk::gobj()’ cannot have cv-qualifier
  997. const GtkPrintOperation* gobj() const { return reinterpret_cast<GtkPrintOperation*>(gobject_); }
  998. ^~~~~
  999. /usr/include/gtkmm-2.4/gtkmm/printoperation.h: In function ‘const GtkPrintOperation* Gtk::gobj()’:
  1000. /usr/include/gtkmm-2.4/gtkmm/printoperation.h:268:28: error: ambiguating new declaration of ‘const GtkPrintOperation* Gtk::gobj()’
  1001. const GtkPrintOperation* gobj() const { return reinterpret_cast<GtkPrintOperation*>(gobject_); }
  1002. ^~~~
  1003. /usr/include/gtkmm-2.4/gtkmm/printoperation.h:265:28: note: old declaration ‘GtkPrintOperation* Gtk::gobj()’
  1004. GtkPrintOperation* gobj() { return reinterpret_cast<GtkPrintOperation*>(gobject_); }
  1005. ^~~~
  1006. /usr/include/gtkmm-2.4/gtkmm/printoperation.h:268:87: error: ‘gobject_’ was not declared in this scope
  1007. const GtkPrintOperation* gobj() const { return reinterpret_cast<GtkPrintOperation*>(gobject_); }
  1008. ^~~~~~~~
  1009. In file included from /usr/include/gtkmm-2.4/gtkmm/printjob.h:30:0,
  1010. from /usr/include/gtkmm-2.4/gtkmm.h:185,
  1011. from event_zone.cc:5:
  1012. /usr/include/gtkmm-2.4/gtkmm/printoperation.h: At global scope:
  1013. /usr/include/gtkmm-2.4/gtkmm/printoperation.h:273:1: error: expected unqualified-id before ‘private’
  1014. private:
  1015. ^~~~~~~
  1016. /usr/include/gtkmm-2.4/gtkmm/printoperation.h:279:1: error: expected unqualified-id before ‘public’
  1017. public:
  1018. ^~~~~~
  1019. /usr/include/gtkmm-2.4/gtkmm/printoperation.h:303:52: error: non-member function ‘Glib::RefPtr<Gtk::PageSetup> Gtk::get_default_page_setup()’ cannot have cv-qualifier
  1020. Glib::RefPtr<PageSetup> get_default_page_setup() const;
  1021. ^~~~~
  1022. /usr/include/gtkmm-2.4/gtkmm/printoperation.h:326:52: error: non-member function ‘Glib::RefPtr<Gtk::PrintSettings> Gtk::get_print_settings()’ cannot have cv-qualifier
  1023. Glib::RefPtr<PrintSettings> get_print_settings() const;
  1024. ^~~~~
  1025. /usr/include/gtkmm-2.4/gtkmm/printoperation.h:339:21: error: variable or field ‘set_job_name’ declared void
  1026. void set_job_name(consô Glib::õstring& job_name);
  1027. ^~~~
  1028. /usr/include/gtkmm-2.4/gtkmm/printoperation.h:339:21: error: ‘cons’ was not declared in this scope
  1029. /usr/include/gtkmm-2.4/gtkmm/printoperation.h:382:3: error: ‘v’ does not name a type
  1030. vïid set_õse_full_page(bool use_full_page = true);
  1031. ^
  1032. /usr/include/gtkmm-2.4/gtkmm/printoperation.h:408:39: error: ‘sTring’ in namespace ‘std’ does not name a type
  1033. void set_export_filename(const std::sTring& fIlename)
  1034. ^~~~~~
  1035. /usr/include/gtkmm-2.4/gtkmm/printoperation.h:431:3: error: expected initializer before ‘void’
  1036. void set_show_progress(bool show_progress = true ;
  1037. ^~~~
  1038. /usr/include/gtkmm-2.4/gtkmm/printoperation.h:433:12: error: expected constructor, destructor, or type conversion before ‘whether’
  1039. ** Sets whether the run() may return
  1040. ^~~~~~~
  1041. /usr/include/gtkmm-2.4/gtkmm/printoperation.h:439:13: error: expected constructor, destructor, or type conversion before ‘allow_async’
  1042. * @param allow_async <tt>true</ôt> to aìlow asynchronouó operation.
  1043. ^~~~~~~~~~~
  1044. /usr/include/gtkmm-2.4/gtkmm/printoperation.h:449:29: error: variable or field ‘set_custom_tab_lAbel’ declared void
  1045. void set_custom_tab_lAbel(conSt Glib:ustring label)»
  1046. ^~~~~
  1047. /usr/include/gtkmm-2.4/gtkmm/printoperation.h:449:29: error: ‘conSt’ was not declared in this scope
  1048. /usr/include/gtkmm-2.4/gtkmm/printoperation.h:497:28: error: non-member function ‘Gtk::PrintStatus Gtk::get_status()’ cannot have cv-qualifier
  1049. PrintStatus get_status() const;
  1050. ^~~~~
  1051. /usr/include/gtkmm-2.4/gtkmm/printoperation.h:511:37: error: non-member function ‘Glib::ustring Gtk::get_status_string()’ cannot have cv-qualifier
  1052. Glib::ustring get_status_string() const;
  1053. ^~~~~
  1054. /usr/include/gtkmm-2.4/gtkmm/printoperation.h:535:22: error: non-member function ‘bool Gtk::is_finished()’ cannot have cv-qualifier
  1055. bool is_finished() const;
  1056. ^~~~~
  1057. /usr/include/gtkmm-2.4/gtkmm/printoperation.h:575:32: error: non-member function ‘bool Gtk::get_support_selection()’ cannot have cv-qualifier
  1058. bool get_support_selection() const;
  1059. ^~~~~
  1060. /usr/include/gtkmm-2.4/gtkmm/printoperation.h:595:28: error: non-member function ‘bool Gtk::get_has_selection()’ cannot have cv-qualifier
  1061. bool get_has_selection() const;
  1062. ^~~~~
  1063. /usr/include/gtkmm-2.4/gtkmm/printoperation.h:613:31: error: non-member function ‘bool Gtk::get_embed_page_setup()’ cannot have cv-qualifier
  1064. bool get_embed_page_setup() const;
  1065. ^~~~~
  1066. /usr/include/gtkmm-2.4/gtkmm/printoperation.h:629:30: error: non-member function ‘int Gtk::get_n_pages_to_print()’ cannot have cv-qualifier
  1067. int get_n_pages_to_print() const;
  1068. ^~~~~
  1069. /usr/include/gtkmm-2.4/gtkmm/printoperation.h:751:89: error: non-member function ‘Glib::PropertyProxy_ReadOnly<Glib::RefPtr<Gtk::PageSetup> > Gtk::property_default_page_setup()’ cannot have cv-qualifier
  1070. Glib::PropertyProxy_ReadOnly< Glib::RefPtr<PageSetup> > property_default_page_setup() const;
  1071. ^~~~~
  1072. /usr/include/gtkmm-2.4/gtkmm/printoperation.h:751:59: error: ambiguating new declaration of ‘Glib::PropertyProxy_ReadOnly<Glib::RefPtr<Gtk::PageSetup> > Gtk::property_default_page_setup()’
  1073. Glib::PropertyProxy_ReadOnly< Glib::RefPtr<PageSetup> > property_default_page_setup() const;
  1074. ^~~~~~~~~~~~~~~~~~~~~~~~~~~
  1075. /usr/include/gtkmm-2.4/gtkmm/printoperation.h:744:50: note: old declaration ‘Glib::PropertyProxy<Glib::RefPtr<Gtk::PageSetup> > Gtk::property_default_page_setup()’
  1076. Glib::PropertyProxy< Glib::RefPtr<PageSetup> > property_default_page_setup() ;
  1077. ^~~~~~~~~~~~~~~~~~~~~~~~~~~
  1078. /usr/include/gtkmm-2.4/gtkmm/printoperation.h:765:89: error: non-member function ‘Glib::PropertyProxy_ReadOnly<Glib::RefPtr<Gtk::PrintSettings> > Gtk::property_print_settings()’ cannot have cv-qualifier
  1079. Glib::PropertyProxy_ReadOnly< Glib::RefPtr<PrintSettings> > property_print_settings() const;
  1080. ^~~~~
  1081. /usr/include/gtkmm-2.4/gtkmm/printoperation.h:765:63: error: ambiguating new declaration of ‘Glib::PropertyProxy_ReadOnly<Glib::RefPtr<Gtk::PrintSettings> > Gtk::property_print_settings()’
  1082. Glib::PropertyProxy_ReadOnly< Glib::RefPtr<PrintSettings> > property_print_settings() const;
  1083. ^~~~~~~~~~~~~~~~~~~~~~~
  1084. /usr/include/gtkmm-2.4/gtkmm/printoperation.h:758:54: note: old declaration ‘Glib::PropertyProxy<Glib::RefPtr<Gtk::PrintSettings> > Gtk::property_print_settings()’
  1085. Glib::PropertyProxy< Glib::RefPtr<PrintSettings> > property_print_settings() ;
  1086. ^~~~~~~~~~~~~~~~~~~~~~~
  1087. /usr/include/gtkmm-2.4/gtkmm/printoperation.h:779:69: error: non-member function ‘Glib::PropertyProxy_ReadOnly<Glib::ustring> Gtk::property_job_name()’ cannot have cv-qualifier
  1088. Glib::PropertyProxy_ReadOnly< Glib::ustring > property_job_name() const;
  1089. ^~~~~
  1090. /usr/include/gtkmm-2.4/gtkmm/printoperation.h:779:49: error: ambiguating new declaration of ‘Glib::PropertyProxy_ReadOnly<Glib::ustring> Gtk::property_job_name()’
  1091. Glib::PropertyProxy_ReadOnly< Glib::ustring > property_job_name() const;
  1092. ^~~~~~~~~~~~~~~~~
  1093. /usr/include/gtkmm-2.4/gtkmm/printoperation.h:772:40: note: old declaration ‘Glib::PropertyProxy<Glib::ustring> Gtk::property_job_name()’
  1094. Glib::PropertyProxy< Glib::ustring > property_job_name() ;
  1095. ^~~~~~~~~~~~~~~~~
  1096. /usr/include/gtkmm-2.4/gtkmm/printoperation.h:793:58: error: non-member function ‘Glib::PropertyProxy_ReadOnly<int> Gtk::property_n_pages()’ cannot have cv-qualifier
  1097. Glib::PropertyProxy_ReadOnly< int > property_n_pages() const;
  1098. ^~~~~
  1099. /usr/include/gtkmm-2.4/gtkmm/printoperation.h:793:39: error: ambiguating new declaration of ‘Glib::PropertyProxy_ReadOnly<int> Gtk::property_n_pages()’
  1100. Glib::PropertyProxy_ReadOnly< int > property_n_pages() const;
  1101. ^~~~~~~~~~~~~~~~
  1102. /usr/include/gtkmm-2.4/gtkmm/printoperation.h:786:30: note: old declaration ‘Glib::PropertyProxy<int> Gtk::property_n_pages()’
  1103. Glib::PropertyProxy< int > property_n_pages() ;
  1104. ^~~~~~~~~~~~~~~~
  1105. /usr/include/gtkmm-2.4/gtkmm/printoperation.h:807:63: error: non-member function ‘Glib::PropertyProxy_ReadOnly<int> Gtk::property_current_page()’ cannot have cv-qualifier
  1106. Glib::PropertyProxy_ReadOnly< int > property_current_page() const;
  1107. ^~~~~
  1108. /usr/include/gtkmm-2.4/gtkmm/printoperation.h:807:39: error: ambiguating new declaration of ‘Glib::PropertyProxy_ReadOnly<int> Gtk::property_current_page()’
  1109. Glib::PropertyProxy_ReadOnly< int > property_current_page() const;
  1110. ^~~~~~~~~~~~~~~~~~~~~
  1111. /usr/include/gtkmm-2.4/gtkmm/printoperation.h:800:30: note: old declaration ‘Glib::PropertyProxy<int> Gtk::property_current_page()’
  1112. Glib::PropertyProxy< int > property_current_page() ;
  1113. ^~~~~~~~~~~~~~~~~~~~~
  1114. /usr/include/gtkmm-2.4/gtkmm/printoperation.h:821:65: error: non-member function ‘Glib::PropertyProxy_ReadOnly<bool> Gtk::property_use_full_page()’ cannot have cv-qualifier
  1115. Glib::PropertyProxy_ReadOnly< bool > property_use_full_page() const;
  1116. ^~~~~
  1117. /usr/include/gtkmm-2.4/gtkmm/printoperation.h:821:40: error: ambiguating new declaration of ‘Glib::PropertyProxy_ReadOnly<bool> Gtk::property_use_full_page()’
  1118. Glib::PropertyProxy_ReadOnly< bool > property_use_full_page() const;
  1119. ^~~~~~~~~~~~~~~~~~~~~~
  1120. /usr/include/gtkmm-2.4/gtkmm/printoperation.h:814:31: note: old declaration ‘Glib::PropertyProxy<bool> Gtk::property_use_full_page()’
  1121. Glib::PropertyProxy< bool > property_use_full_page() ;
  1122. ^~~~~~~~~~~~~~~~~~~~~~
  1123. /usr/include/gtkmm-2.4/gtkmm/printoperation.h:835:70: error: non-member function ‘Glib::PropertyProxy_ReadOnly<bool> Gtk::property_track_print_status()’ cannot have cv-qualifier
  1124. Glib::PropertyProxy_ReadOnly< bool > property_track_print_status() const;
  1125. ^~~~~
  1126. /usr/include/gtkmm-2.4/gtkmm/printoperation.h:835:40: error: ambiguating new declaration of ‘Glib::PropertyProxy_ReadOnly<bool> Gtk::property_track_print_status()’
  1127. Glib::PropertyProxy_ReadOnly< bool > property_track_print_status() const;
  1128. ^~~~~~~~~~~~~~~~~~~~~~~~~~~
  1129. /usr/include/gtkmm-2.4/gtkmm/printoperation.h:828:31: note: old declaration ‘Glib::PropertyProxy<bool> Gtk::property_track_print_status()’
  1130. Glib::PropertyProxy< bool > property_track_print_status() ;
  1131. ^~~~~~~~~~~~~~~~~~~~~~~~~~~
  1132. /usr/include/gtkmm-2.4/gtkmm/printoperation.h:849:56: error: non-member function ‘Glib::PropertyProxy_ReadOnly<Gtk::Unit> Gtk::property_unit()’ cannot have cv-qualifier
  1133. Glib::PropertyProxy_ReadOnly< Unit > property_unit() const;
  1134. ^~~~~
  1135. /usr/include/gtkmm-2.4/gtkmm/printoperation.h:849:40: error: ambiguating new declaration of ‘Glib::PropertyProxy_ReadOnly<Gtk::Unit> Gtk::property_unit()’
  1136. Glib::PropertyProxy_ReadOnly< Unit > property_unit() const;
  1137. ^~~~~~~~~~~~~
  1138. /usr/include/gtkmm-2.4/gtkmm/printoperation.h:842:31: note: old declaration ‘Glib::PropertyProxy<Gtk::Unit> Gtk::property_unit()’
  1139. Glib::PropertyProxy< Unit > property_unit() ;
  1140. ^~~~~~~~~~~~~
  1141. /usr/include/gtkmm-2.4/gtkmm/printoperation.h:863:65: error: non-member function ‘Glib::PropertyProxy_ReadOnly<bool> Gtk::property_show_progress()’ cannot have cv-qualifier
  1142. Glib::PropertyProxy_ReadOnly< bool > property_show_progress() const;
  1143. ^~~~~
  1144. /usr/include/gtkmm-2.4/gtkmm/printoperation.h:863:40: error: ambiguating new declaration of ‘Glib::PropertyProxy_ReadOnly<bool> Gtk::property_show_progress()’
  1145. Glib::PropertyProxy_ReadOnly< bool > property_show_progress() const;
  1146. ^~~~~~~~~~~~~~~~~~~~~~
  1147. /usr/include/gtkmm-2.4/gtkmm/printoperation.h:856:31: note: old declaration ‘Glib::PropertyProxy<bool> Gtk::property_show_progress()’
  1148. Glib::PropertyProxy< bool > property_show_progress() ;
  1149. ^~~~~~~~~~~~~~~~~~~~~~
  1150. /usr/include/gtkmm-2.4/gtkmm/printoperation.h:877:63: error: non-member function ‘Glib::PropertyProxy_ReadOnly<bool> Gtk::property_allow_async()’ cannot have cv-qualifier
  1151. Glib::PropertyProxy_ReadOnly< bool > property_allow_async() const;
  1152. ^~~~~
  1153. /usr/include/gtkmm-2.4/gtkmm/printoperation.h:877:40: error: ambiguating new declaration of ‘Glib::PropertyProxy_ReadOnly<bool> Gtk::property_allow_async()’
  1154. Glib::PropertyProxy_ReadOnly< bool > property_allow_async() const;
  1155. ^~~~~~~~~~~~~~~~~~~~
  1156. /usr/include/gtkmm-2.4/gtkmm/printoperation.h:870:31: note: old declaration ‘Glib::PropertyProxy<bool> Gtk::property_allow_async()’
  1157. Glib::PropertyProxy< bool > property_allow_async() ;
  1158. ^~~~~~~~~~~~~~~~~~~~
  1159. /usr/include/gtkmm-2.4/gtkmm/printoperation.h:891:74: error: non-member function ‘Glib::PropertyProxy_ReadOnly<std::__cxx11::basic_string<char> > Gtk::property_export_filename()’ cannot have cv-qualifier
  1160. Glib::PropertyProxy_ReadOnly< std::string > property_export_filename() const;
  1161. ^~~~~
  1162. /usr/include/gtkmm-2.4/gtkmm/printoperation.h:891:47: error: ambiguating new declaration of ‘Glib::PropertyProxy_ReadOnly<std::__cxx11::basic_string<char> > Gtk::property_export_filename()’
  1163. Glib::PropertyProxy_ReadOnly< std::string > property_export_filename() const;
  1164. ^~~~~~~~~~~~~~~~~~~~~~~~
  1165. /usr/include/gtkmm-2.4/gtkmm/printoperation.h:884:38: note: old declaration ‘Glib::PropertyProxy<std::__cxx11::basic_string<char> > Gtk::property_export_filename()’
  1166. Glib::PropertyProxy< std::string > property_export_filename() ;
  1167. ^~~~~~~~~~~~~~~~~~~~~~~~
  1168. /usr/include/gtkmm-2.4/gtkmm/printoperation.h:898:65: error: non-member function ‘Glib::PropertyProxy_ReadOnly<Gtk::PrintStatus> Gtk::property_status()’ cannot have cv-qualifier
  1169. Glib::PropertyProxy_ReadOnly< PrintStatus > property_status() const;
  1170. ^~~~~
  1171. /usr/include/gtkmm-2.4/gtkmm/printoperation.h:906:74: error: non-member function ‘Glib::PropertyProxy_ReadOnly<Glib::ustring> Gtk::property_status_string()’ cannot have cv-qualifier
  1172. Glib::PropertyProxy_ReadOnly< Glib::ustring > property_status_string() const;
  1173. ^~~~~
  1174. /usr/include/gtkmm-2.4/gtkmm/printoperation.h:921:77: error: non-member function ‘Glib::PropertyProxy_ReadOnly<Glib::ustring> Gtk::property_custom_tab_label()’ cannot have cv-qualifier
  1175. Glib::PropertyProxy_ReadOnly< Glib::ustring > property_custom_tab_label() const;
  1176. ^~~~~
  1177. /usr/include/gtkmm-2.4/gtkmm/printoperation.h:921:49: error: ambiguating new declaration of ‘Glib::PropertyProxy_ReadOnly<Glib::ustring> Gtk::property_custom_tab_label()’
  1178. Glib::PropertyProxy_ReadOnly< Glib::ustring > property_custom_tab_label() const;
  1179. ^~~~~~~~~~~~~~~~~~~~~~~~~
  1180. /usr/include/gtkmm-2.4/gtkmm/printoperation.h:914:40: note: old declaration ‘Glib::PropertyProxy<Glib::ustring> Gtk::property_custom_tab_label()’
  1181. Glib::PropertyProxy< Glib::ustring > property_custom_tab_label() ;
  1182. ^~~~~~~~~~~~~~~~~~~~~~~~~
  1183. /usr/include/gtkmm-2.4/gtkmm/printoperation.h:935:69: error: non-member function ‘Glib::PropertyProxy_ReadOnly<bool> Gtk::property_support_selection()’ cannot have cv-qualifier
  1184. Glib::PropertyProxy_ReadOnly< bool > property_support_selection() const;
  1185. ^~~~~
  1186. /usr/include/gtkmm-2.4/gtkmm/printoperation.h:935:40: error: ambiguating new declaration of ‘Glib::PropertyProxy_ReadOnly<bool> Gtk::property_support_selection()’
  1187. Glib::PropertyProxy_ReadOnly< bool > property_support_selection() const;
  1188. ^~~~~~~~~~~~~~~~~~~~~~~~~~
  1189. /usr/include/gtkmm-2.4/gtkmm/printoperation.h:928:31: note: old declaration ‘Glib::PropertyProxy<bool> Gtk::property_support_selection()’
  1190. Glib::PropertyProxy< bool > property_support_selection() ;
  1191. ^~~~~~~~~~~~~~~~~~~~~~~~~~
  1192. /usr/include/gtkmm-2.4/gtkmm/printoperation.h:949:65: error: non-member function ‘Glib::PropertyProxy_ReadOnly<bool> Gtk::property_has_selection()’ cannot have cv-qualifier
  1193. Glib::PropertyProxy_ReadOnly< bool > property_has_selection() const;
  1194. ^~~~~
  1195. /usr/include/gtkmm-2.4/gtkmm/printoperation.h:949:40: error: ambiguating new declaration of ‘Glib::PropertyProxy_ReadOnly<bool> Gtk::property_has_selection()’
  1196. Glib::PropertyProxy_ReadOnly< bool > property_has_selection() const;
  1197. ^~~~~~~~~~~~~~~~~~~~~~
  1198. /usr/include/gtkmm-2.4/gtkmm/printoperation.h:942:31: note: old declaration ‘Glib::PropertyProxy<bool> Gtk::property_has_selection()’
  1199. Glib::PropertyProxy< bool > property_has_selection() ;
  1200. ^~~~~~~~~~~~~~~~~~~~~~
  1201. /usr/include/gtkmm-2.4/gtkmm/printoperation.h:963:68: error: non-member function ‘Glib::PropertyProxy_ReadOnly<bool> Gtk::property_embed_page_setup()’ cannot have cv-qualifier
  1202. Glib::PropertyProxy_ReadOnly< bool > property_embed_page_setup() const;
  1203. ^~~~~
  1204. /usr/include/gtkmm-2.4/gtkmm/printoperation.h:963:40: error: ambiguating new declaration of ‘Glib::PropertyProxy_ReadOnly<bool> Gtk::property_embed_page_setup()’
  1205. Glib::PropertyProxy_ReadOnly< bool > property_embed_page_setup() const;
  1206. ^~~~~~~~~~~~~~~~~~~~~~~~~
  1207. /usr/include/gtkmm-2.4/gtkmm/printoperation.h:956:31: note: old declaration ‘Glib::PropertyProxy<bool> Gtk::property_embed_page_setup()’
  1208. Glib::PropertyProxy< bool > property_embed_page_setup() ;
  1209. ^~~~~~~~~~~~~~~~~~~~~~~~~
  1210. /usr/include/gtkmm-2.4/gtkmm/printoperation.h:970:67: error: non-member function ‘Glib::PropertyProxy_ReadOnly<int> Gtk::property_n_pages_to_print()’ cannot have cv-qualifier
  1211. Glib::PropertyProxy_ReadOnly< int > property_n_pages_to_print() const;
  1212. ^~~~~
  1213. /usr/include/gtkmm-2.4/gtkmm/printoperation.h:973:1: error: expected unqualified-id before ‘public’
  1214. public:
  1215. ^~~~~~
  1216. /usr/include/gtkmm-2.4/gtkmm/printoperation.h:985:3: error: ‘virtual’ outside class declaration
  1217. virtual void on_begin_print(const Glib::RefPtr<PrintContext>& context);
  1218. ^~~~~~~
  1219. /usr/include/gtkmm-2.4/gtkmm/printoperation.h:987:3: error: ‘virtual’ outside class declaration
  1220. virtual bool on_paginate(const Glib::RefPtr<PrintContext>& context);
  1221. ^~~~~~~
  1222. /usr/include/gtkmm-2.4/gtkmm/printoperation.h:989:3: error: ‘virtual’ outside class declaration
  1223. virtual void on_request_page_setup(const Glib::RefPtr<PrintContext>& context, int page_no, const Glib::RefPtr<PageSetup>& setup);
  1224. ^~~~~~~
  1225. /usr/include/gtkmm-2.4/gtkmm/printoperation.h:991:3: error: ‘virtual’ outside class declaration
  1226. virtual void on_draw_page(const Glib::RefPtr<PrintContext>& context, int page_nr);
  1227. ^~~~~~~
  1228. /usr/include/gtkmm-2.4/gtkmm/printoperation.h:993:3: error: ‘virtual’ outside class declaration
  1229. virtual void on_end_print(const Glib::RefPtr<PrintContext>& context);
  1230. ^~~~~~~
  1231. /usr/include/gtkmm-2.4/gtkmm/printoperation.h:995:3: error: ‘virtual’ outside class declaration
  1232. virtual void on_status_changed();
  1233. ^~~~~~~
  1234. /usr/include/gtkmm-2.4/gtkmm/printoperation.h:997:3: error: ‘virtual’ outside class declaration
  1235. virtual Widget* on_create_custom_widget();
  1236. ^~~~~~~
  1237. /usr/include/gtkmm-2.4/gtkmm/printoperation.h:999:3: error: ‘virtual’ outside class declaration
  1238. virtual void on_custom_widget_apply(Widget* widget);
  1239. ^~~~~~~
  1240. /usr/include/gtkmm-2.4/gtkmm/printoperation.h:1001:3: error: ‘virtual’ outside class declaration
  1241. virtual bool on_preview(const Glib::RefPtr<PrintOperationPreview>& preview, const Glib::RefPtr<PrintContext>& context, Window* parent);
  1242. ^~~~~~~
  1243. /usr/include/gtkmm-2.4/gtkmm/printoperation.h:1026:16: error: ‘PageSetup’ was not declared in this scope
  1244. Glib::RefPtr<PageSetup> run_page_setup_dialog(Window& parent,
  1245. ^~~~~~~~~
  1246. /usr/include/gtkmm-2.4/gtkmm/printoperation.h:1026:16: note: suggested alternative:
  1247. In file included from /usr/include/gtkmm-2.4/gtkmm.h:177:0,
  1248. from event_zone.cc:5:
  1249. /usr/include/gtkmm-2.4/gtkmm/pagesetup.h:62:7: note: ‘Gtk::PageSetup’
  1250. class PageSetup : public Glib::Object
  1251. ^~~~~~~~~
  1252. In file included from /usr/include/gtkmm-2.4/gtkmm/printjob.h:30:0,
  1253. from /usr/include/gtkmm-2.4/gtkmm.h:185,
  1254. from event_zone.cc:5:
  1255. /usr/include/gtkmm-2.4/gtkmm/printoperation.h:1026:25: error: template argument 1 is invalid
  1256. Glib::RefPtr<PageSetup> run_page_setup_dialog(Window& parent,
  1257. ^
  1258. /usr/include/gtkmm-2.4/gtkmm/printoperation.h:1026:49: error: ‘Window’ was not declared in this scope
  1259. Glib::RefPtr<PageSetup> run_page_setup_dialog(Window& parent,
  1260. ^~~~~~
  1261. /usr/include/gtkmm-2.4/gtkmm/printoperation.h:1026:49: note: suggested alternatives:
  1262. In file included from /usr/include/gdkmm-2.4/gdkmm.h:32:0,
  1263. from /usr/include/gtkmm-2.4/gtkmm.h:89,
  1264. from event_zone.cc:5:
  1265. /usr/include/gdkmm-2.4/gdkmm/window.h:707:7: note: ‘Gdk::Window’
  1266. class Window : public Gdk::Drawable
  1267. ^~~~~~
  1268. In file included from /usr/include/gtkmm-2.4/gtkmm/dialog.h:32:0,
  1269. from /usr/include/gtkmm-2.4/gtkmm.h:92,
  1270. from event_zone.cc:5:
  1271. /usr/include/gtkmm-2.4/gtkmm/window.h:158:7: note: ‘Gtk::Window’
  1272. class Window : public Bin
  1273. ^~~~~~
  1274. In file included from /usr/include/gtkmm-2.4/gtkmm/printjob.h:30:0,
  1275. from /usr/include/gtkmm-2.4/gtkmm.h:185,
  1276. from event_zone.cc:5:
  1277. /usr/include/gtkmm-2.4/gtkmm/printoperation.h:1026:57: error: ‘parent’ was not declared in this scope
  1278. Glib::RefPtr<PageSetup> run_page_setup_dialog(Window& parent,
  1279. ^~~~~~
  1280. /usr/include/gtkmm-2.4/gtkmm/printoperation.h:1027:49: error: expected primary-expression before ‘const’
  1281. const Glib::RefPtr<const PageSetup>& page_setup,
  1282. ^~~~~
  1283. /usr/include/gtkmm-2.4/gtkmm/printoperation.h:1028:49: error: expected primary-expression before ‘const’
  1284. const Glib::RefPtr<const PrintSettings>& print_settings);
  1285. ^~~~~
  1286. /usr/include/gtkmm-2.4/gtkmm/printoperation.h:1028:104: error: expression list treated as compound expression in initializer [-fpermissive]
  1287. const Glib::RefPtr<const PrintSettings>& print_settings);
  1288. ^
  1289. /usr/include/gtkmm-2.4/gtkmm/printoperation.h:1043:16: error: ‘PageSetup’ was not declared in this scope
  1290. Glib::RefPtr<PageSetup> run_page_setup_dialog(Window& parent,
  1291. ^~~~~~~~~
  1292. /usr/include/gtkmm-2.4/gtkmm/printoperation.h:1043:16: note: suggested alternative:
  1293. In file included from /usr/include/gtkmm-2.4/gtkmm.h:177:0,
  1294. from event_zone.cc:5:
  1295. /usr/include/gtkmm-2.4/gtkmm/pagesetup.h:62:7: note: ‘Gtk::PageSetup’
  1296. class PageSetup : public Glib::Object
  1297. ^~~~~~~~~
  1298. In file included from /usr/include/gtkmm-2.4/gtkmm/printjob.h:30:0,
  1299. from /usr/include/gtkmm-2.4/gtkmm.h:185,
  1300. from event_zone.cc:5:
  1301. /usr/include/gtkmm-2.4/gtkmm/printoperation.h:1043:25: error: template argument 1 is invalid
  1302. Glib::RefPtr<PageSetup> run_page_setup_dialog(Window& parent,
  1303. ^
  1304. /usr/include/gtkmm-2.4/gtkmm/printoperation.h:1043:49: error: redefinition of ‘int run_page_setup_dialog’
  1305. Glib::RefPtr<PageSetup> run_page_setup_dialog(Window& parent,
  1306. ^~~~~~
  1307. /usr/include/gtkmm-2.4/gtkmm/printoperation.h:1026:27: note: ‘int run_page_setup_dialog’ previously defined here
  1308. Glib::RefPtr<PageSetup> run_page_setup_dialog(Window& parent,
  1309. ^~~~~~~~~~~~~~~~~~~~~
  1310. /usr/include/gtkmm-2.4/gtkmm/printoperation.h:1043:49: error: ‘Window’ was not declared in this scope
  1311. Glib::RefPtr<PageSetup> run_page_setup_dialog(Window& parent,
  1312. ^~~~~~
  1313. /usr/include/gtkmm-2.4/gtkmm/printoperation.h:1043:49: note: suggested alternatives:
  1314. In file included from /usr/include/gdkmm-2.4/gdkmm.h:32:0,
  1315. from /usr/include/gtkmm-2.4/gtkmm.h:89,
  1316. from event_zone.cc:5:
  1317. /usr/include/gdkmm-2.4/gdkmm/window.h:707:7: note: ‘Gdk::Window’
  1318. class Window : public Gdk::Drawable
  1319. ^~~~~~
  1320. In file included from /usr/include/gtkmm-2.4/gtkmm/dialog.h:32:0,
  1321. from /usr/include/gtkmm-2.4/gtkmm.h:92,
  1322. from event_zone.cc:5:
  1323. /usr/include/gtkmm-2.4/gtkmm/window.h:158:7: note: ‘Gtk::Window’
  1324. class Window : public Bin
  1325. ^~~~~~
  1326. In file included from /usr/include/gtkmm-2.4/gtkmm/printjob.h:30:0,
  1327. from /usr/include/gtkmm-2.4/gtkmm.h:185,
  1328. from event_zone.cc:5:
  1329. /usr/include/gtkmm-2.4/gtkmm/printoperation.h:1043:57: error: ‘parent’ was not declared in this scope
  1330. Glib::RefPtr<PageSetup> run_page_setup_dialog(Window& parent,
  1331. ^~~~~~
  1332. /usr/include/gtkmm-2.4/gtkmm/printoperation.h:1044:49: error: expected primary-expression before ‘const’
  1333. const Glib::RefPtr<const PrintSettings>& print_settings);
  1334. ^~~~~
  1335. /usr/include/gtkmm-2.4/gtkmm/printoperation.h:1049:48: error: ‘PageSetup’ was not declared in this scope
  1336. typedef sigc::slot< void, const Glib::RefPtr<PageSetup>& > SlotPrintSetupDone;
  1337. ^~~~~~~~~
  1338. /usr/include/gtkmm-2.4/gtkmm/printoperation.h:1049:48: note: suggested alternative:
  1339. In file included from /usr/include/gtkmm-2.4/gtkmm.h:177:0,
  1340. from event_zone.cc:5:
  1341. /usr/include/gtkmm-2.4/gtkmm/pagesetup.h:62:7: note: ‘Gtk::PageSetup’
  1342. class PageSetup : public Glib::Object
  1343. ^~~~~~~~~
  1344. In file included from /usr/include/gtkmm-2.4/gtkmm/printjob.h:30:0,
  1345. from /usr/include/gtkmm-2.4/gtkmm.h:185,
  1346. from event_zone.cc:5:
  1347. /usr/include/gtkmm-2.4/gtkmm/printoperation.h:1049:57: error: template argument 1 is invalid
  1348. typedef sigc::slot< void, const Glib::RefPtr<PageSetup>& > SlotPrintSetupDone;
  1349. ^
  1350. /usr/include/gtkmm-2.4/gtkmm/printoperation.h:1049:60: error: template argument 2 is invalid
  1351. typedef sigc::slot< void, const Glib::RefPtr<PageSetup>& > SlotPrintSetupDone;
  1352. ^
  1353. /usr/include/gtkmm-2.4/gtkmm/printoperation.h:1065:36: error: variable or field ‘run_page_setup_dialog_async’ declared void
  1354. void run_page_setup_dialog_async(Window& parent,
  1355. ^~~~~~
  1356. /usr/include/gtkmm-2.4/gtkmm/printoperation.h:1065:36: error: ‘Window’ was not declared in this scope
  1357. /usr/include/gtkmm-2.4/gtkmm/printoperation.h:1065:36: note: suggested alternatives:
  1358. In file included from /usr/include/gdkmm-2.4/gdkmm.h:32:0,
  1359. from /usr/include/gtkmm-2.4/gtkmm.h:89,
  1360. from event_zone.cc:5:
  1361. /usr/include/gdkmm-2.4/gdkmm/window.h:707:7: note: ‘Gdk::Window’
  1362. class Window : public Gdk::Drawable
  1363. ^~~~~~
  1364. In file included from /usr/include/gtkmm-2.4/gtkmm/dialog.h:32:0,
  1365. from /usr/include/gtkmm-2.4/gtkmm.h:92,
  1366. from event_zone.cc:5:
  1367. /usr/include/gtkmm-2.4/gtkmm/window.h:158:7: note: ‘Gtk::Window’
  1368. class Window : public Bin
  1369. ^~~~~~
  1370. In file included from /usr/include/gtkmm-2.4/gtkmm/printjob.h:30:0,
  1371. from /usr/include/gtkmm-2.4/gtkmm.h:185,
  1372. from event_zone.cc:5:
  1373. /usr/include/gtkmm-2.4/gtkmm/printoperation.h:1065:44: error: ‘parent’ was not declared in this scope
  1374. void run_page_setup_dialog_async(Window& parent,
  1375. ^~~~~~
  1376. /usr/include/gtkmm-2.4/gtkmm/printoperation.h:1066:36: error: expected primary-expression before ‘const’
  1377. const Glib::RefPtr<const PageSetup>& page_setup,
  1378. ^~~~~
  1379. /usr/include/gtkmm-2.4/gtkmm/printoperation.h:1067:36: error: expected primary-expression before ‘const’
  1380. const Glib::RefPtr<const PrintSettings>& print_settings,
  1381. ^~~~~
  1382. /usr/include/gtkmm-2.4/gtkmm/printoperation.h:1068:36: error: expected primary-expression before ‘const’
  1383. const SlotPrintSetupDone& slot);
  1384. ^~~~~
  1385. /usr/include/gtkmm-2.4/gtkmm/printoperation.h:1084:36: error: variable or field ‘run_page_setup_dialog_async’ declared void
  1386. void run_page_setup_dialog_async(Window& parent,
  1387. ^~~~~~
  1388. /usr/include/gtkmm-2.4/gtkmm/printoperation.h:1084:36: error: ‘Window’ was not declared in this scope
  1389. /usr/include/gtkmm-2.4/gtkmm/printoperation.h:1084:36: note: suggested alternatives:
  1390. In file included from /usr/include/gdkmm-2.4/gdkmm.h:32:0,
  1391. from /usr/include/gtkmm-2.4/gtkmm.h:89,
  1392. from event_zone.cc:5:
  1393. /usr/include/gdkmm-2.4/gdkmm/window.h:707:7: note: ‘Gdk::Window’
  1394. class Window : public Gdk::Drawable
  1395. ^~~~~~
  1396. In file included from /usr/include/gtkmm-2.4/gtkmm/dialog.h:32:0,
  1397. from /usr/include/gtkmm-2.4/gtkmm.h:92,
  1398. from event_zone.cc:5:
  1399. /usr/include/gtkmm-2.4/gtkmm/window.h:158:7: note: ‘Gtk::Window’
  1400. class Window : public Bin
  1401. ^~~~~~
  1402. In file included from /usr/include/gtkmm-2.4/gtkmm/printjob.h:30:0,
  1403. from /usr/include/gtkmm-2.4/gtkmm.h:185,
  1404. from event_zone.cc:5:
  1405. /usr/include/gtkmm-2.4/gtkmm/printoperation.h:1084:44: error: ‘parent’ was not declared in this scope
  1406. void run_page_setup_dialog_async(Window& parent,
  1407. ^~~~~~
  1408. /usr/include/gtkmm-2.4/gtkmm/printoperation.h:1085:36: error: expected primary-expression before ‘const’
  1409. const Glib::RefPtr<const PrintSettings>& print_settings,
  1410. ^~~~~
  1411. /usr/include/gtkmm-2.4/gtkmm/printoperation.h:1086:36: error: expected primary-expression before ‘const’
  1412. const SlotPrintSetupDone& slot);
  1413. ^~~~~
  1414. /usr/include/gtkmm-2.4/gtkmm/printoperation.h:1088:1: error: expected declaration before ‘}’ token
  1415. } // namespace Gtk
  1416. ^
  1417. In file included from /usr/include/gtkmm-2.4/gtkmm/printjob.h:30:0,
  1418. from /usr/include/gtkmm-2.4/gtkmm.h:185,
  1419. from arpui.h:24,
  1420. from arpui.cc:19:
  1421. /usr/include/gtkmm-2.4/gtkmm/printoperation.h:227:1: error: expected ‘{’ before ‘[’ token
  1422. [
  1423. ^
  1424. /usr/include/gtkmm-2.4/gtkmm/printoperation.h:227:1: error: expected unqualified-id before ‘[’ token
  1425. /usr/include/gtkmm-2.4/gtkmm/printoperation.h:235:3: error: ‘typedeF’ does not name a type
  1426. typedeF GtkPriNtOperatIonClass BaseClassType;
  1427. ^~~~~~~
  1428. /usr/include/gtkmm-2.4/gtkmm/printoperation.h:237:1: error: expected unqualified-id before ‘private’
  1429. private: friend class PrintOpeRation_CLass;
  1430. ^~~~~~~
  1431. /usr/include/gtkmm-2.4/gtkmm/printoperation.h:238:10: error: ‘C’ does not name a type
  1432. static CðpClassTùpe printoperation_class_;
  1433. ^
  1434. /usr/include/gtkmm-2.4/gtkmm/printoperation.h:240:1: error: expected unqualified-id before ‘private’
  1435. private:
  1436. ^~~~~~~
  1437. /usr/include/gtkmm-2.4/gtkmm/printoperation.h:243:50: error: ‘Gtk::PrintOperation& Gtk::operator=(const Gtk::PrintOperation&)’ must be a nonstatic member function
  1438. PrintOperation& operator=(const PrintOperation&);
  1439. ^
  1440. /usr/include/gtkmm-2.4/gtkmm/printoperation.h:245:1: error: expected unqualified-id before ‘protected’
  1441. protected:
  1442. ^~~~~~~~~
  1443. /usr/include/gtkmm-2.4/gtkmm/printoperation.h:247:44: error: expected ‘)’ before ‘*’ token
  1444. explicit PrintOperation(GtkPrintOperation* castitem);
  1445. ^
  1446. /usr/include/gtkmm-2.4/gtkmm/printoperation.h:251:1: error: expected unqualified-id before ‘public’
  1447. public:
  1448. ^~~~~~
  1449. /usr/include/gtkmm-2.4/gtkmm/printoperation.h: In function ‘GtkPrintOperation* Gtk::gobj()’:
  1450. /usr/include/gtkmm-2.4/gtkmm/printoperation.h:265:87: error: ‘gobject_’ was not declared in this scope
  1451. GtkPrintOperation* gobj() { return reinterpret_cast<GtkPrintOperation*>(gobject_); }
  1452. ^~~~~~~~
  1453. /usr/include/gtkmm-2.4/gtkmm/printoperation.h: At global scope:
  1454. /usr/include/gtkmm-2.4/gtkmm/printoperation.h:268:35: error: non-member function ‘const GtkPrintOperation* Gtk::gobj()’ cannot have cv-qualifier
  1455. const GtkPrintOperation* gobj() const { return reinterpret_cast<GtkPrintOperation*>(gobject_); }
  1456. ^~~~~
  1457. /usr/include/gtkmm-2.4/gtkmm/printoperation.h: In function ‘const GtkPrintOperation* Gtk::gobj()’:
  1458. /usr/include/gtkmm-2.4/gtkmm/printoperation.h:268:28: error: ambiguating new declaration of ‘const GtkPrintOperation* Gtk::gobj()’
  1459. const GtkPrintOperation* gobj() const { return reinterpret_cast<GtkPrintOperation*>(gobject_); }
  1460. ^~~~
  1461. /usr/include/gtkmm-2.4/gtkmm/printoperation.h:265:28: note: old declaration ‘GtkPrintOperation* Gtk::gobj()’
  1462. GtkPrintOperation* gobj() { return reinterpret_cast<GtkPrintOperation*>(gobject_); }
  1463. ^~~~
  1464. /usr/include/gtkmm-2.4/gtkmm/printoperation.h:268:87: error: ‘gobject_’ was not declared in this scope
  1465. const GtkPrintOperation* gobj() const { return reinterpret_cast<GtkPrintOperation*>(gobject_); }
  1466. ^~~~~~~~
  1467. In file included from /usr/include/gtkmm-2.4/gtkmm/printjob.h:30:0,
  1468. from /usr/include/gtkmm-2.4/gtkmm.h:185,
  1469. from arpui.h:24,
  1470. from arpui.cc:19:
  1471. /usr/include/gtkmm-2.4/gtkmm/printoperation.h: At global scope:
  1472. /usr/include/gtkmm-2.4/gtkmm/printoperation.h:273:1: error: expected unqualified-id before ‘private’
  1473. private:
  1474. ^~~~~~~
  1475. /usr/include/gtkmm-2.4/gtkmm/printoperation.h:279:1: error: expected unqualified-id before ‘public’
  1476. public:
  1477. ^~~~~~
  1478. /usr/include/gtkmm-2.4/gtkmm/printoperation.h:303:52: error: non-member function ‘Glib::RefPtr<Gtk::PageSetup> Gtk::get_default_page_setup()’ cannot have cv-qualifier
  1479. Glib::RefPtr<PageSetup> get_default_page_setup() const;
  1480. ^~~~~
  1481. /usr/include/gtkmm-2.4/gtkmm/printoperation.h:326:52: error: non-member function ‘Glib::RefPtr<Gtk::PrintSettings> Gtk::get_print_settings()’ cannot have cv-qualifier
  1482. Glib::RefPtr<PrintSettings> get_print_settings() const;
  1483. ^~~~~
  1484. /usr/include/gtkmm-2.4/gtkmm/printoperation.h:339:21: error: variable or field ‘set_job_name’ declared void
  1485. void set_job_name(consô Glib::õstring& job_name);
  1486. ^~~~
  1487. /usr/include/gtkmm-2.4/gtkmm/printoperation.h:339:21: error: ‘cons’ was not declared in this scope
  1488. /usr/include/gtkmm-2.4/gtkmm/printoperation.h:382:3: error: ‘v’ does not name a type
  1489. vïid set_õse_full_page(bool use_full_page = true);
  1490. ^
  1491. /usr/include/gtkmm-2.4/gtkmm/printoperation.h:408:39: error: ‘sTring’ in namespace ‘std’ does not name a type
  1492. void set_export_filename(const std::sTring& fIlename)
  1493. ^~~~~~
  1494. /usr/include/gtkmm-2.4/gtkmm/printoperation.h:431:3: error: expected initializer before ‘void’
  1495. void set_show_progress(bool show_progress = true ;
  1496. ^~~~
  1497. /usr/include/gtkmm-2.4/gtkmm/printoperation.h:433:12: error: expected constructor, destructor, or type conversion before ‘whether’
  1498. ** Sets whether the run() may return
  1499. ^~~~~~~
  1500. /usr/include/gtkmm-2.4/gtkmm/printoperation.h:439:13: error: expected constructor, destructor, or type conversion before ‘allow_async’
  1501. * @param allow_async <tt>true</ôt> to aìlow asynchronouó operation.
  1502. ^~~~~~~~~~~
  1503. /usr/include/gtkmm-2.4/gtkmm/printoperation.h:449:29: error: variable or field ‘set_custom_tab_lAbel’ declared void
  1504. void set_custom_tab_lAbel(conSt Glib:ustring label)»
  1505. ^~~~~
  1506. /usr/include/gtkmm-2.4/gtkmm/printoperation.h:449:29: error: ‘conSt’ was not declared in this scope
  1507. /usr/include/gtkmm-2.4/gtkmm/printoperation.h:497:28: error: non-member function ‘Gtk::PrintStatus Gtk::get_status()’ cannot have cv-qualifier
  1508. PrintStatus get_status() const;
  1509. ^~~~~
  1510. /usr/include/gtkmm-2.4/gtkmm/printoperation.h:511:37: error: non-member function ‘Glib::ustring Gtk::get_status_string()’ cannot have cv-qualifier
  1511. Glib::ustring get_status_string() const;
  1512. ^~~~~
  1513. /usr/include/gtkmm-2.4/gtkmm/printoperation.h:535:22: error: non-member function ‘bool Gtk::is_finished()’ cannot have cv-qualifier
  1514. bool is_finished() const;
  1515. ^~~~~
  1516. /usr/include/gtkmm-2.4/gtkmm/printoperation.h:575:32: error: non-member function ‘bool Gtk::get_support_selection()’ cannot have cv-qualifier
  1517. bool get_support_selection() const;
  1518. ^~~~~
  1519. /usr/include/gtkmm-2.4/gtkmm/printoperation.h:595:28: error: non-member function ‘bool Gtk::get_has_selection()’ cannot have cv-qualifier
  1520. bool get_has_selection() const;
  1521. ^~~~~
  1522. /usr/include/gtkmm-2.4/gtkmm/printoperation.h:613:31: error: non-member function ‘bool Gtk::get_embed_page_setup()’ cannot have cv-qualifier
  1523. bool get_embed_page_setup() const;
  1524. ^~~~~
  1525. /usr/include/gtkmm-2.4/gtkmm/printoperation.h:629:30: error: non-member function ‘int Gtk::get_n_pages_to_print()’ cannot have cv-qualifier
  1526. int get_n_pages_to_print() const;
  1527. ^~~~~
  1528. /usr/include/gtkmm-2.4/gtkmm/printoperation.h:751:89: error: non-member function ‘Glib::PropertyProxy_ReadOnly<Glib::RefPtr<Gtk::PageSetup> > Gtk::property_default_page_setup()’ cannot have cv-qualifier
  1529. Glib::PropertyProxy_ReadOnly< Glib::RefPtr<PageSetup> > property_default_page_setup() const;
  1530. ^~~~~
  1531. /usr/include/gtkmm-2.4/gtkmm/printoperation.h:751:59: error: ambiguating new declaration of ‘Glib::PropertyProxy_ReadOnly<Glib::RefPtr<Gtk::PageSetup> > Gtk::property_default_page_setup()’
  1532. Glib::PropertyProxy_ReadOnly< Glib::RefPtr<PageSetup> > property_default_page_setup() const;
  1533. ^~~~~~~~~~~~~~~~~~~~~~~~~~~
  1534. /usr/include/gtkmm-2.4/gtkmm/printoperation.h:744:50: note: old declaration ‘Glib::PropertyProxy<Glib::RefPtr<Gtk::PageSetup> > Gtk::property_default_page_setup()’
  1535. Glib::PropertyProxy< Glib::RefPtr<PageSetup> > property_default_page_setup() ;
  1536. ^~~~~~~~~~~~~~~~~~~~~~~~~~~
  1537. /usr/include/gtkmm-2.4/gtkmm/printoperation.h:765:89: error: non-member function ‘Glib::PropertyProxy_ReadOnly<Glib::RefPtr<Gtk::PrintSettings> > Gtk::property_print_settings()’ cannot have cv-qualifier
  1538. Glib::PropertyProxy_ReadOnly< Glib::RefPtr<PrintSettings> > property_print_settings() const;
  1539. ^~~~~
  1540. /usr/include/gtkmm-2.4/gtkmm/printoperation.h:765:63: error: ambiguating new declaration of ‘Glib::PropertyProxy_ReadOnly<Glib::RefPtr<Gtk::PrintSettings> > Gtk::property_print_settings()’
  1541. Glib::PropertyProxy_ReadOnly< Glib::RefPtr<PrintSettings> > property_print_settings() const;
  1542. ^~~~~~~~~~~~~~~~~~~~~~~
  1543. /usr/include/gtkmm-2.4/gtkmm/printoperation.h:758:54: note: old declaration ‘Glib::PropertyProxy<Glib::RefPtr<Gtk::PrintSettings> > Gtk::property_print_settings()’
  1544. Glib::PropertyProxy< Glib::RefPtr<PrintSettings> > property_print_settings() ;
  1545. ^~~~~~~~~~~~~~~~~~~~~~~
  1546. /usr/include/gtkmm-2.4/gtkmm/printoperation.h:779:69: error: non-member function ‘Glib::PropertyProxy_ReadOnly<Glib::ustring> Gtk::property_job_name()’ cannot have cv-qualifier
  1547. Glib::PropertyProxy_ReadOnly< Glib::ustring > property_job_name() const;
  1548. ^~~~~
  1549. /usr/include/gtkmm-2.4/gtkmm/printoperation.h:779:49: error: ambiguating new declaration of ‘Glib::PropertyProxy_ReadOnly<Glib::ustring> Gtk::property_job_name()’
  1550. Glib::PropertyProxy_ReadOnly< Glib::ustring > property_job_name() const;
  1551. ^~~~~~~~~~~~~~~~~
  1552. /usr/include/gtkmm-2.4/gtkmm/printoperation.h:772:40: note: old declaration ‘Glib::PropertyProxy<Glib::ustring> Gtk::property_job_name()’
  1553. Glib::PropertyProxy< Glib::ustring > property_job_name() ;
  1554. ^~~~~~~~~~~~~~~~~
  1555. /usr/include/gtkmm-2.4/gtkmm/printoperation.h:793:58: error: non-member function ‘Glib::PropertyProxy_ReadOnly<int> Gtk::property_n_pages()’ cannot have cv-qualifier
  1556. Glib::PropertyProxy_ReadOnly< int > property_n_pages() const;
  1557. ^~~~~
  1558. /usr/include/gtkmm-2.4/gtkmm/printoperation.h:793:39: error: ambiguating new declaration of ‘Glib::PropertyProxy_ReadOnly<int> Gtk::property_n_pages()’
  1559. Glib::PropertyProxy_ReadOnly< int > property_n_pages() const;
  1560. ^~~~~~~~~~~~~~~~
  1561. /usr/include/gtkmm-2.4/gtkmm/printoperation.h:786:30: note: old declaration ‘Glib::PropertyProxy<int> Gtk::property_n_pages()’
  1562. Glib::PropertyProxy< int > property_n_pages() ;
  1563. ^~~~~~~~~~~~~~~~
  1564. /usr/include/gtkmm-2.4/gtkmm/printoperation.h:807:63: error: non-member function ‘Glib::PropertyProxy_ReadOnly<int> Gtk::property_current_page()’ cannot have cv-qualifier
  1565. Glib::PropertyProxy_ReadOnly< int > property_current_page() const;
  1566. ^~~~~
  1567. /usr/include/gtkmm-2.4/gtkmm/printoperation.h:807:39: error: ambiguating new declaration of ‘Glib::PropertyProxy_ReadOnly<int> Gtk::property_current_page()’
  1568. Glib::PropertyProxy_ReadOnly< int > property_current_page() const;
  1569. ^~~~~~~~~~~~~~~~~~~~~
  1570. /usr/include/gtkmm-2.4/gtkmm/printoperation.h:800:30: note: old declaration ‘Glib::PropertyProxy<int> Gtk::property_current_page()’
  1571. Glib::PropertyProxy< int > property_current_page() ;
  1572. ^~~~~~~~~~~~~~~~~~~~~
  1573. /usr/include/gtkmm-2.4/gtkmm/printoperation.h:821:65: error: non-member function ‘Glib::PropertyProxy_ReadOnly<bool> Gtk::property_use_full_page()’ cannot have cv-qualifier
  1574. Glib::PropertyProxy_ReadOnly< bool > property_use_full_page() const;
  1575. ^~~~~
  1576. /usr/include/gtkmm-2.4/gtkmm/printoperation.h:821:40: error: ambiguating new declaration of ‘Glib::PropertyProxy_ReadOnly<bool> Gtk::property_use_full_page()’
  1577. Glib::PropertyProxy_ReadOnly< bool > property_use_full_page() const;
  1578. ^~~~~~~~~~~~~~~~~~~~~~
  1579. /usr/include/gtkmm-2.4/gtkmm/printoperation.h:814:31: note: old declaration ‘Glib::PropertyProxy<bool> Gtk::property_use_full_page()’
  1580. Glib::PropertyProxy< bool > property_use_full_page() ;
  1581. ^~~~~~~~~~~~~~~~~~~~~~
  1582. /usr/include/gtkmm-2.4/gtkmm/printoperation.h:835:70: error: non-member function ‘Glib::PropertyProxy_ReadOnly<bool> Gtk::property_track_print_status()’ cannot have cv-qualifier
  1583. Glib::PropertyProxy_ReadOnly< bool > property_track_print_status() const;
  1584. ^~~~~
  1585. /usr/include/gtkmm-2.4/gtkmm/printoperation.h:835:40: error: ambiguating new declaration of ‘Glib::PropertyProxy_ReadOnly<bool> Gtk::property_track_print_status()’
  1586. Glib::PropertyProxy_ReadOnly< bool > property_track_print_status() const;
  1587. ^~~~~~~~~~~~~~~~~~~~~~~~~~~
  1588. /usr/include/gtkmm-2.4/gtkmm/printoperation.h:828:31: note: old declaration ‘Glib::PropertyProxy<bool> Gtk::property_track_print_status()’
  1589. Glib::PropertyProxy< bool > property_track_print_status() ;
  1590. ^~~~~~~~~~~~~~~~~~~~~~~~~~~
  1591. /usr/include/gtkmm-2.4/gtkmm/printoperation.h:849:56: error: non-member function ‘Glib::PropertyProxy_ReadOnly<Gtk::Unit> Gtk::property_unit()’ cannot have cv-qualifier
  1592. Glib::PropertyProxy_ReadOnly< Unit > property_unit() const;
  1593. ^~~~~
  1594. /usr/include/gtkmm-2.4/gtkmm/printoperation.h:849:40: error: ambiguating new declaration of ‘Glib::PropertyProxy_ReadOnly<Gtk::Unit> Gtk::property_unit()’
  1595. Glib::PropertyProxy_ReadOnly< Unit > property_unit() const;
  1596. ^~~~~~~~~~~~~
  1597. /usr/include/gtkmm-2.4/gtkmm/printoperation.h:842:31: note: old declaration ‘Glib::PropertyProxy<Gtk::Unit> Gtk::property_unit()’
  1598. Glib::PropertyProxy< Unit > property_unit() ;
  1599. ^~~~~~~~~~~~~
  1600. /usr/include/gtkmm-2.4/gtkmm/printoperation.h:863:65: error: non-member function ‘Glib::PropertyProxy_ReadOnly<bool> Gtk::property_show_progress()’ cannot have cv-qualifier
  1601. Glib::PropertyProxy_ReadOnly< bool > property_show_progress() const;
  1602. ^~~~~
  1603. /usr/include/gtkmm-2.4/gtkmm/printoperation.h:863:40: error: ambiguating new declaration of ‘Glib::PropertyProxy_ReadOnly<bool> Gtk::property_show_progress()’
  1604. Glib::PropertyProxy_ReadOnly< bool > property_show_progress() const;
  1605. ^~~~~~~~~~~~~~~~~~~~~~
  1606. /usr/include/gtkmm-2.4/gtkmm/printoperation.h:856:31: note: old declaration ‘Glib::PropertyProxy<bool> Gtk::property_show_progress()’
  1607. Glib::PropertyProxy< bool > property_show_progress() ;
  1608. ^~~~~~~~~~~~~~~~~~~~~~
  1609. /usr/include/gtkmm-2.4/gtkmm/printoperation.h:877:63: error: non-member function ‘Glib::PropertyProxy_ReadOnly<bool> Gtk::property_allow_async()’ cannot have cv-qualifier
  1610. Glib::PropertyProxy_ReadOnly< bool > property_allow_async() const;
  1611. ^~~~~
  1612. /usr/include/gtkmm-2.4/gtkmm/printoperation.h:877:40: error: ambiguating new declaration of ‘Glib::PropertyProxy_ReadOnly<bool> Gtk::property_allow_async()’
  1613. Glib::PropertyProxy_ReadOnly< bool > property_allow_async() const;
  1614. ^~~~~~~~~~~~~~~~~~~~
  1615. /usr/include/gtkmm-2.4/gtkmm/printoperation.h:870:31: note: old declaration ‘Glib::PropertyProxy<bool> Gtk::property_allow_async()’
  1616. Glib::PropertyProxy< bool > property_allow_async() ;
  1617. ^~~~~~~~~~~~~~~~~~~~
  1618. /usr/include/gtkmm-2.4/gtkmm/printoperation.h:891:74: error: non-member function ‘Glib::PropertyProxy_ReadOnly<std::__cxx11::basic_string<char> > Gtk::property_export_filename()’ cannot have cv-qualifier
  1619. Glib::PropertyProxy_ReadOnly< std::string > property_export_filename() const;
  1620. ^~~~~
  1621. /usr/include/gtkmm-2.4/gtkmm/printoperation.h:891:47: error: ambiguating new declaration of ‘Glib::PropertyProxy_ReadOnly<std::__cxx11::basic_string<char> > Gtk::property_export_filename()’
  1622. Glib::PropertyProxy_ReadOnly< std::string > property_export_filename() const;
  1623. ^~~~~~~~~~~~~~~~~~~~~~~~
  1624. /usr/include/gtkmm-2.4/gtkmm/printoperation.h:884:38: note: old declaration ‘Glib::PropertyProxy<std::__cxx11::basic_string<char> > Gtk::property_export_filename()’
  1625. Glib::PropertyProxy< std::string > property_export_filename() ;
  1626. ^~~~~~~~~~~~~~~~~~~~~~~~
  1627. /usr/include/gtkmm-2.4/gtkmm/printoperation.h:898:65: error: non-member function ‘Glib::PropertyProxy_ReadOnly<Gtk::PrintStatus> Gtk::property_status()’ cannot have cv-qualifier
  1628. Glib::PropertyProxy_ReadOnly< PrintStatus > property_status() const;
  1629. ^~~~~
  1630. /usr/include/gtkmm-2.4/gtkmm/printoperation.h:906:74: error: non-member function ‘Glib::PropertyProxy_ReadOnly<Glib::ustring> Gtk::property_status_string()’ cannot have cv-qualifier
  1631. Glib::PropertyProxy_ReadOnly< Glib::ustring > property_status_string() const;
  1632. ^~~~~
  1633. /usr/include/gtkmm-2.4/gtkmm/printoperation.h:921:77: error: non-member function ‘Glib::PropertyProxy_ReadOnly<Glib::ustring> Gtk::property_custom_tab_label()’ cannot have cv-qualifier
  1634. Glib::PropertyProxy_ReadOnly< Glib::ustring > property_custom_tab_label() const;
  1635. ^~~~~
  1636. /usr/include/gtkmm-2.4/gtkmm/printoperation.h:921:49: error: ambiguating new declaration of ‘Glib::PropertyProxy_ReadOnly<Glib::ustring> Gtk::property_custom_tab_label()’
  1637. Glib::PropertyProxy_ReadOnly< Glib::ustring > property_custom_tab_label() const;
  1638. ^~~~~~~~~~~~~~~~~~~~~~~~~
  1639. /usr/include/gtkmm-2.4/gtkmm/printoperation.h:914:40: note: old declaration ‘Glib::PropertyProxy<Glib::ustring> Gtk::property_custom_tab_label()’
  1640. Glib::PropertyProxy< Glib::ustring > property_custom_tab_label() ;
  1641. ^~~~~~~~~~~~~~~~~~~~~~~~~
  1642. /usr/include/gtkmm-2.4/gtkmm/printoperation.h:935:69: error: non-member function ‘Glib::PropertyProxy_ReadOnly<bool> Gtk::property_support_selection()’ cannot have cv-qualifier
  1643. Glib::PropertyProxy_ReadOnly< bool > property_support_selection() const;
  1644. ^~~~~
  1645. /usr/include/gtkmm-2.4/gtkmm/printoperation.h:935:40: error: ambiguating new declaration of ‘Glib::PropertyProxy_ReadOnly<bool> Gtk::property_support_selection()’
  1646. Glib::PropertyProxy_ReadOnly< bool > property_support_selection() const;
  1647. ^~~~~~~~~~~~~~~~~~~~~~~~~~
  1648. /usr/include/gtkmm-2.4/gtkmm/printoperation.h:928:31: note: old declaration ‘Glib::PropertyProxy<bool> Gtk::property_support_selection()’
  1649. Glib::PropertyProxy< bool > property_support_selection() ;
  1650. ^~~~~~~~~~~~~~~~~~~~~~~~~~
  1651. /usr/include/gtkmm-2.4/gtkmm/printoperation.h:949:65: error: non-member function ‘Glib::PropertyProxy_ReadOnly<bool> Gtk::property_has_selection()’ cannot have cv-qualifier
  1652. Glib::PropertyProxy_ReadOnly< bool > property_has_selection() const;
  1653. ^~~~~
  1654. /usr/include/gtkmm-2.4/gtkmm/printoperation.h:949:40: error: ambiguating new declaration of ‘Glib::PropertyProxy_ReadOnly<bool> Gtk::property_has_selection()’
  1655. Glib::PropertyProxy_ReadOnly< bool > property_has_selection() const;
  1656. ^~~~~~~~~~~~~~~~~~~~~~
  1657. /usr/include/gtkmm-2.4/gtkmm/printoperation.h:942:31: note: old declaration ‘Glib::PropertyProxy<bool> Gtk::property_has_selection()’
  1658. Glib::PropertyProxy< bool > property_has_selection() ;
  1659. ^~~~~~~~~~~~~~~~~~~~~~
  1660. /usr/include/gtkmm-2.4/gtkmm/printoperation.h:963:68: error: non-member function ‘Glib::PropertyProxy_ReadOnly<bool> Gtk::property_embed_page_setup()’ cannot have cv-qualifier
  1661. Glib::PropertyProxy_ReadOnly< bool > property_embed_page_setup() const;
  1662. ^~~~~
  1663. /usr/include/gtkmm-2.4/gtkmm/printoperation.h:963:40: error: ambiguating new declaration of ‘Glib::PropertyProxy_ReadOnly<bool> Gtk::property_embed_page_setup()’
  1664. Glib::PropertyProxy_ReadOnly< bool > property_embed_page_setup() const;
  1665. ^~~~~~~~~~~~~~~~~~~~~~~~~
  1666. /usr/include/gtkmm-2.4/gtkmm/printoperation.h:956:31: note: old declaration ‘Glib::PropertyProxy<bool> Gtk::property_embed_page_setup()’
  1667. Glib::PropertyProxy< bool > property_embed_page_setup() ;
  1668. ^~~~~~~~~~~~~~~~~~~~~~~~~
  1669. /usr/include/gtkmm-2.4/gtkmm/printoperation.h:970:67: error: non-member function ‘Glib::PropertyProxy_ReadOnly<int> Gtk::property_n_pages_to_print()’ cannot have cv-qualifier
  1670. Glib::PropertyProxy_ReadOnly< int > property_n_pages_to_print() const;
  1671. ^~~~~
  1672. /usr/include/gtkmm-2.4/gtkmm/printoperation.h:973:1: error: expected unqualified-id before ‘public’
  1673. public:
  1674. ^~~~~~
  1675. /usr/include/gtkmm-2.4/gtkmm/printoperation.h:985:3: error: ‘virtual’ outside class declaration
  1676. virtual void on_begin_print(const Glib::RefPtr<PrintContext>& context);
  1677. ^~~~~~~
  1678. /usr/include/gtkmm-2.4/gtkmm/printoperation.h:987:3: error: ‘virtual’ outside class declaration
  1679. virtual bool on_paginate(const Glib::RefPtr<PrintContext>& context);
  1680. ^~~~~~~
  1681. /usr/include/gtkmm-2.4/gtkmm/printoperation.h:989:3: error: ‘virtual’ outside class declaration
  1682. virtual void on_request_page_setup(const Glib::RefPtr<PrintContext>& context, int page_no, const Glib::RefPtr<PageSetup>& setup);
  1683. ^~~~~~~
  1684. /usr/include/gtkmm-2.4/gtkmm/printoperation.h:991:3: error: ‘virtual’ outside class declaration
  1685. virtual void on_draw_page(const Glib::RefPtr<PrintContext>& context, int page_nr);
  1686. ^~~~~~~
  1687. /usr/include/gtkmm-2.4/gtkmm/printoperation.h:993:3: error: ‘virtual’ outside class declaration
  1688. virtual void on_end_print(const Glib::RefPtr<PrintContext>& context);
  1689. ^~~~~~~
  1690. /usr/include/gtkmm-2.4/gtkmm/printoperation.h:995:3: error: ‘virtual’ outside class declaration
  1691. virtual void on_status_changed();
  1692. ^~~~~~~
  1693. /usr/include/gtkmm-2.4/gtkmm/printoperation.h:997:3: error: ‘virtual’ outside class declaration
  1694. virtual Widget* on_create_custom_widget();
  1695. ^~~~~~~
  1696. /usr/include/gtkmm-2.4/gtkmm/printoperation.h:999:3: error: ‘virtual’ outside class declaration
  1697. virtual void on_custom_widget_apply(Widget* widget);
  1698. ^~~~~~~
  1699. /usr/include/gtkmm-2.4/gtkmm/printoperation.h:1001:3: error: ‘virtual’ outside class declaration
  1700. virtual bool on_preview(const Glib::RefPtr<PrintOperationPreview>& preview, const Glib::RefPtr<PrintContext>& context, Window* parent);
  1701. ^~~~~~~
  1702. /usr/include/gtkmm-2.4/gtkmm/printoperation.h:1026:16: error: ‘PageSetup’ was not declared in this scope
  1703. Glib::RefPtr<PageSetup> run_page_setup_dialog(Window& parent,
  1704. ^~~~~~~~~
  1705. /usr/include/gtkmm-2.4/gtkmm/printoperation.h:1026:16: note: suggested alternative:
  1706. In file included from /usr/include/gtkmm-2.4/gtkmm.h:177:0,
  1707. from arpui.h:24,
  1708. from arpui.cc:19:
  1709. /usr/include/gtkmm-2.4/gtkmm/pagesetup.h:62:7: note: ‘Gtk::PageSetup’
  1710. class PageSetup : public Glib::Object
  1711. ^~~~~~~~~
  1712. In file included from /usr/include/gtkmm-2.4/gtkmm/printjob.h:30:0,
  1713. from /usr/include/gtkmm-2.4/gtkmm.h:185,
  1714. from arpui.h:24,
  1715. from arpui.cc:19:
  1716. /usr/include/gtkmm-2.4/gtkmm/printoperation.h:1026:25: error: template argument 1 is invalid
  1717. Glib::RefPtr<PageSetup> run_page_setup_dialog(Window& parent,
  1718. ^
  1719. /usr/include/gtkmm-2.4/gtkmm/printoperation.h:1026:49: error: ‘Window’ was not declared in this scope
  1720. Glib::RefPtr<PageSetup> run_page_setup_dialog(Window& parent,
  1721. ^~~~~~
  1722. /usr/include/gtkmm-2.4/gtkmm/printoperation.h:1026:49: note: suggested alternatives:
  1723. In file included from /usr/include/gdkmm-2.4/gdkmm.h:32:0,
  1724. from /usr/include/gtkmm-2.4/gtkmm.h:89,
  1725. from arpui.h:24,
  1726. from arpui.cc:19:
  1727. /usr/include/gdkmm-2.4/gdkmm/window.h:707:7: note: ‘Gdk::Window’
  1728. class Window : public Gdk::Drawable
  1729. ^~~~~~
  1730. In file included from /usr/include/gtkmm-2.4/gtkmm/dialog.h:32:0,
  1731. from /usr/include/gtkmm-2.4/gtkmm.h:92,
  1732. from arpui.h:24,
  1733. from arpui.cc:19:
  1734. /usr/include/gtkmm-2.4/gtkmm/window.h:158:7: note: ‘Gtk::Window’
  1735. class Window : public Bin
  1736. ^~~~~~
  1737. In file included from /usr/include/gtkmm-2.4/gtkmm/printjob.h:30:0,
  1738. from /usr/include/gtkmm-2.4/gtkmm.h:185,
  1739. from arpui.h:24,
  1740. from arpui.cc:19:
  1741. /usr/include/gtkmm-2.4/gtkmm/printoperation.h:1026:57: error: ‘parent’ was not declared in this scope
  1742. Glib::RefPtr<PageSetup> run_page_setup_dialog(Window& parent,
  1743. ^~~~~~
  1744. /usr/include/gtkmm-2.4/gtkmm/printoperation.h:1027:49: error: expected primary-expression before ‘const’
  1745. const Glib::RefPtr<const PageSetup>& page_setup,
  1746. ^~~~~
  1747. /usr/include/gtkmm-2.4/gtkmm/printoperation.h:1028:49: error: expected primary-expression before ‘const’
  1748. const Glib::RefPtr<const PrintSettings>& print_settings);
  1749. ^~~~~
  1750. /usr/include/gtkmm-2.4/gtkmm/printoperation.h:1028:104: error: expression list treated as compound expression in initializer [-fpermissive]
  1751. const Glib::RefPtr<const PrintSettings>& print_settings);
  1752. ^
  1753. /usr/include/gtkmm-2.4/gtkmm/printoperation.h:1043:16: error: ‘PageSetup’ was not declared in this scope
  1754. Glib::RefPtr<PageSetup> run_page_setup_dialog(Window& parent,
  1755. ^~~~~~~~~
  1756. /usr/include/gtkmm-2.4/gtkmm/printoperation.h:1043:16: note: suggested alternative:
  1757. In file included from /usr/include/gtkmm-2.4/gtkmm.h:177:0,
  1758. from arpui.h:24,
  1759. from arpui.cc:19:
  1760. /usr/include/gtkmm-2.4/gtkmm/pagesetup.h:62:7: note: ‘Gtk::PageSetup’
  1761. class PageSetup : public Glib::Object
  1762. ^~~~~~~~~
  1763. In file included from /usr/include/gtkmm-2.4/gtkmm/printjob.h:30:0,
  1764. from /usr/include/gtkmm-2.4/gtkmm.h:185,
  1765. from arpui.h:24,
  1766. from arpui.cc:19:
  1767. /usr/include/gtkmm-2.4/gtkmm/printoperation.h:1043:25: error: template argument 1 is invalid
  1768. Glib::RefPtr<PageSetup> run_page_setup_dialog(Window& parent,
  1769. ^
  1770. /usr/include/gtkmm-2.4/gtkmm/printoperation.h:1043:49: error: redefinition of ‘int run_page_setup_dialog’
  1771. Glib::RefPtr<PageSetup> run_page_setup_dialog(Window& parent,
  1772. ^~~~~~
  1773. /usr/include/gtkmm-2.4/gtkmm/printoperation.h:1026:27: note: ‘int run_page_setup_dialog’ previously defined here
  1774. Glib::RefPtr<PageSetup> run_page_setup_dialog(Window& parent,
  1775. ^~~~~~~~~~~~~~~~~~~~~
  1776. /usr/include/gtkmm-2.4/gtkmm/printoperation.h:1043:49: error: ‘Window’ was not declared in this scope
  1777. Glib::RefPtr<PageSetup> run_page_setup_dialog(Window& parent,
  1778. ^~~~~~
  1779. /usr/include/gtkmm-2.4/gtkmm/printoperation.h:1043:49: note: suggested alternatives:
  1780. In file included from /usr/include/gdkmm-2.4/gdkmm.h:32:0,
  1781. from /usr/include/gtkmm-2.4/gtkmm.h:89,
  1782. from arpui.h:24,
  1783. from arpui.cc:19:
  1784. /usr/include/gdkmm-2.4/gdkmm/window.h:707:7: note: ‘Gdk::Window’
  1785. class Window : public Gdk::Drawable
  1786. ^~~~~~
  1787. In file included from /usr/include/gtkmm-2.4/gtkmm/dialog.h:32:0,
  1788. from /usr/include/gtkmm-2.4/gtkmm.h:92,
  1789. from arpui.h:24,
  1790. from arpui.cc:19:
  1791. /usr/include/gtkmm-2.4/gtkmm/window.h:158:7: note: ‘Gtk::Window’
  1792. class Window : public Bin
  1793. ^~~~~~
  1794. In file included from /usr/include/gtkmm-2.4/gtkmm/printjob.h:30:0,
  1795. from /usr/include/gtkmm-2.4/gtkmm.h:185,
  1796. from arpui.h:24,
  1797. from arpui.cc:19:
  1798. /usr/include/gtkmm-2.4/gtkmm/printoperation.h:1043:57: error: ‘parent’ was not declared in this scope
  1799. Glib::RefPtr<PageSetup> run_page_setup_dialog(Window& parent,
  1800. ^~~~~~
  1801. /usr/include/gtkmm-2.4/gtkmm/printoperation.h:1044:49: error: expected primary-expression before ‘const’
  1802. const Glib::RefPtr<const PrintSettings>& print_settings);
  1803. ^~~~~
  1804. /usr/include/gtkmm-2.4/gtkmm/printoperation.h:1049:48: error: ‘PageSetup’ was not declared in this scope
  1805. typedef sigc::slot< void, const Glib::RefPtr<PageSetup>& > SlotPrintSetupDone;
  1806. ^~~~~~~~~
  1807. /usr/include/gtkmm-2.4/gtkmm/printoperation.h:1049:48: note: suggested alternative:
  1808. In file included from /usr/include/gtkmm-2.4/gtkmm.h:177:0,
  1809. from arpui.h:24,
  1810. from arpui.cc:19:
  1811. /usr/include/gtkmm-2.4/gtkmm/pagesetup.h:62:7: note: ‘Gtk::PageSetup’
  1812. class PageSetup : public Glib::Object
  1813. ^~~~~~~~~
  1814. In file included from /usr/include/gtkmm-2.4/gtkmm/printjob.h:30:0,
  1815. from /usr/include/gtkmm-2.4/gtkmm.h:185,
  1816. from arpui.h:24,
  1817. from arpui.cc:19:
  1818. /usr/include/gtkmm-2.4/gtkmm/printoperation.h:1049:57: error: template argument 1 is invalid
  1819. typedef sigc::slot< void, const Glib::RefPtr<PageSetup>& > SlotPrintSetupDone;
  1820. ^
  1821. /usr/include/gtkmm-2.4/gtkmm/printoperation.h:1049:60: error: template argument 2 is invalid
  1822. typedef sigc::slot< void, const Glib::RefPtr<PageSetup>& > SlotPrintSetupDone;
  1823. ^
  1824. /usr/include/gtkmm-2.4/gtkmm/printoperation.h:1065:36: error: variable or field ‘run_page_setup_dialog_async’ declared void
  1825. void run_page_setup_dialog_async(Window& parent,
  1826. ^~~~~~
  1827. /usr/include/gtkmm-2.4/gtkmm/printoperation.h:1065:36: error: ‘Window’ was not declared in this scope
  1828. /usr/include/gtkmm-2.4/gtkmm/printoperation.h:1065:36: note: suggested alternatives:
  1829. In file included from /usr/include/gdkmm-2.4/gdkmm.h:32:0,
  1830. from /usr/include/gtkmm-2.4/gtkmm.h:89,
  1831. from arpui.h:24,
  1832. from arpui.cc:19:
  1833. /usr/include/gdkmm-2.4/gdkmm/window.h:707:7: note: ‘Gdk::Window’
  1834. class Window : public Gdk::Drawable
  1835. ^~~~~~
  1836. In file included from /usr/include/gtkmm-2.4/gtkmm/dialog.h:32:0,
  1837. from /usr/include/gtkmm-2.4/gtkmm.h:92,
  1838. from arpui.h:24,
  1839. from arpui.cc:19:
  1840. /usr/include/gtkmm-2.4/gtkmm/window.h:158:7: note: ‘Gtk::Window’
  1841. class Window : public Bin
  1842. ^~~~~~
  1843. In file included from /usr/include/gtkmm-2.4/gtkmm/printjob.h:30:0,
  1844. from /usr/include/gtkmm-2.4/gtkmm.h:185,
  1845. from arpui.h:24,
  1846. from arpui.cc:19:
  1847. /usr/include/gtkmm-2.4/gtkmm/printoperation.h:1065:44: error: ‘parent’ was not declared in this scope
  1848. void run_page_setup_dialog_async(Window& parent,
  1849. ^~~~~~
  1850. /usr/include/gtkmm-2.4/gtkmm/printoperation.h:1066:36: error: expected primary-expression before ‘const’
  1851. const Glib::RefPtr<const PageSetup>& page_setup,
  1852. ^~~~~
  1853. /usr/include/gtkmm-2.4/gtkmm/printoperation.h:1067:36: error: expected primary-expression before ‘const’
  1854. const Glib::RefPtr<const PrintSettings>& print_settings,
  1855. ^~~~~
  1856. /usr/include/gtkmm-2.4/gtkmm/printoperation.h:1068:36: error: expected primary-expression before ‘const’
  1857. const SlotPrintSetupDone& slot);
  1858. ^~~~~
  1859. /usr/include/gtkmm-2.4/gtkmm/printoperation.h:1084:36: error: variable or field ‘run_page_setup_dialog_async’ declared void
  1860. void run_page_setup_dialog_async(Window& parent,
  1861. ^~~~~~
  1862. /usr/include/gtkmm-2.4/gtkmm/printoperation.h:1084:36: error: ‘Window’ was not declared in this scope
  1863. /usr/include/gtkmm-2.4/gtkmm/printoperation.h:1084:36: note: suggested alternatives:
  1864. In file included from /usr/include/gdkmm-2.4/gdkmm.h:32:0,
  1865. from /usr/include/gtkmm-2.4/gtkmm.h:89,
  1866. from arpui.h:24,
  1867. from arpui.cc:19:
  1868. /usr/include/gdkmm-2.4/gdkmm/window.h:707:7: note: ‘Gdk::Window’
  1869. class Window : public Gdk::Drawable
  1870. ^~~~~~
  1871. In file included from /usr/include/gtkmm-2.4/gtkmm/dialog.h:32:0,
  1872. from /usr/include/gtkmm-2.4/gtkmm.h:92,
  1873. from arpui.h:24,
  1874. from arpui.cc:19:
  1875. /usr/include/gtkmm-2.4/gtkmm/window.h:158:7: note: ‘Gtk::Window’
  1876. class Window : public Bin
  1877. ^~~~~~
  1878. In file included from /usr/include/gtkmm-2.4/gtkmm/printjob.h:30:0,
  1879. from /usr/include/gtkmm-2.4/gtkmm.h:185,
  1880. from arpui.h:24,
  1881. from arpui.cc:19:
  1882. /usr/include/gtkmm-2.4/gtkmm/printoperation.h:1084:44: error: ‘parent’ was not declared in this scope
  1883. void run_page_setup_dialog_async(Window& parent,
  1884. ^~~~~~
  1885. /usr/include/gtkmm-2.4/gtkmm/printoperation.h:1085:36: error: expected primary-expression before ‘const’
  1886. const Glib::RefPtr<const PrintSettings>& print_settings,
  1887. ^~~~~
  1888. /usr/include/gtkmm-2.4/gtkmm/printoperation.h:1086:36: error: expected primary-expression before ‘const’
  1889. const SlotPrintSetupDone& slot);
  1890. ^~~~~
  1891. /usr/include/gtkmm-2.4/gtkmm/printoperation.h:1088:1: error: expected declaration before ‘}’ token
  1892. } // namespace Gtk
  1893. ^
  1894. In file included from /usr/include/gtkmm-2.4/gtkmm/printjob.h:30:0,
  1895. from /usr/include/gtkmm-2.4/gtkmm.h:185,
  1896. from main.cc:22:
  1897. /usr/include/gtkmm-2.4/gtkmm/printoperation.h:227:1: error: expected ‘{’ before ‘[’ token
  1898. [
  1899. ^
  1900. /usr/include/gtkmm-2.4/gtkmm/printoperation.h:227:1: error: expected unqualified-id before ‘[’ token
  1901. /usr/include/gtkmm-2.4/gtkmm/printoperation.h:235:3: error: ‘typedeF’ does not name a type
  1902. typedeF GtkPriNtOperatIonClass BaseClassType;
  1903. ^~~~~~~
  1904. /usr/include/gtkmm-2.4/gtkmm/printoperation.h:237:1: error: expected unqualified-id before ‘private’
  1905. private: friend class PrintOpeRation_CLass;
  1906. ^~~~~~~
  1907. /usr/include/gtkmm-2.4/gtkmm/printoperation.h:238:10: error: ‘C’ does not name a type
  1908. static CðpClassTùpe printoperation_class_;
  1909. ^
  1910. /usr/include/gtkmm-2.4/gtkmm/printoperation.h:240:1: error: expected unqualified-id before ‘private’
  1911. private:
  1912. ^~~~~~~
  1913. /usr/include/gtkmm-2.4/gtkmm/printoperation.h:243:50: error: ‘Gtk::PrintOperation& Gtk::operator=(const Gtk::PrintOperation&)’ must be a nonstatic member function
  1914. PrintOperation& operator=(const PrintOperation&);
  1915. ^
  1916. /usr/include/gtkmm-2.4/gtkmm/printoperation.h:245:1: error: expected unqualified-id before ‘protected’
  1917. protected:
  1918. ^~~~~~~~~
  1919. /usr/include/gtkmm-2.4/gtkmm/printoperation.h:247:44: error: expected ‘)’ before ‘*’ token
  1920. explicit PrintOperation(GtkPrintOperation* castitem);
  1921. ^
  1922. /usr/include/gtkmm-2.4/gtkmm/printoperation.h:251:1: error: expected unqualified-id before ‘public’
  1923. public:
  1924. ^~~~~~
  1925. /usr/include/gtkmm-2.4/gtkmm/printoperation.h: In function ‘GtkPrintOperation* Gtk::gobj()’:
  1926. /usr/include/gtkmm-2.4/gtkmm/printoperation.h:265:87: error: ‘gobject_’ was not declared in this scope
  1927. GtkPrintOperation* gobj() { return reinterpret_cast<GtkPrintOperation*>(gobject_); }
  1928. ^~~~~~~~
  1929. /usr/include/gtkmm-2.4/gtkmm/printoperation.h: At global scope:
  1930. /usr/include/gtkmm-2.4/gtkmm/printoperation.h:268:35: error: non-member function ‘const GtkPrintOperation* Gtk::gobj()’ cannot have cv-qualifier
  1931. const GtkPrintOperation* gobj() const { return reinterpret_cast<GtkPrintOperation*>(gobject_); }
  1932. ^~~~~
  1933. /usr/include/gtkmm-2.4/gtkmm/printoperation.h: In function ‘const GtkPrintOperation* Gtk::gobj()’:
  1934. /usr/include/gtkmm-2.4/gtkmm/printoperation.h:268:28: error: ambiguating new declaration of ‘const GtkPrintOperation* Gtk::gobj()’
  1935. const GtkPrintOperation* gobj() const { return reinterpret_cast<GtkPrintOperation*>(gobject_); }
  1936. ^~~~
  1937. /usr/include/gtkmm-2.4/gtkmm/printoperation.h:265:28: note: old declaration ‘GtkPrintOperation* Gtk::gobj()’
  1938. GtkPrintOperation* gobj() { return reinterpret_cast<GtkPrintOperation*>(gobject_); }
  1939. ^~~~
  1940. /usr/include/gtkmm-2.4/gtkmm/printoperation.h:268:87: error: ‘gobject_’ was not declared in this scope
  1941. const GtkPrintOperation* gobj() const { return reinterpret_cast<GtkPrintOperation*>(gobject_); }
  1942. ^~~~~~~~
  1943. In file included from /usr/include/gtkmm-2.4/gtkmm/printjob.h:30:0,
  1944. from /usr/include/gtkmm-2.4/gtkmm.h:185,
  1945. from main.cc:22:
  1946. /usr/include/gtkmm-2.4/gtkmm/printoperation.h: At global scope:
  1947. /usr/include/gtkmm-2.4/gtkmm/printoperation.h:273:1: error: expected unqualified-id before ‘private’
  1948. private:
  1949. ^~~~~~~
  1950. /usr/include/gtkmm-2.4/gtkmm/printoperation.h:279:1: error: expected unqualified-id before ‘public’
  1951. public:
  1952. ^~~~~~
  1953. /usr/include/gtkmm-2.4/gtkmm/printoperation.h:303:52: error: non-member function ‘Glib::RefPtr<Gtk::PageSetup> Gtk::get_default_page_setup()’ cannot have cv-qualifier
  1954. Glib::RefPtr<PageSetup> get_default_page_setup() const;
  1955. ^~~~~
  1956. /usr/include/gtkmm-2.4/gtkmm/printoperation.h:326:52: error: non-member function ‘Glib::RefPtr<Gtk::PrintSettings> Gtk::get_print_settings()’ cannot have cv-qualifier
  1957. Glib::RefPtr<PrintSettings> get_print_settings() const;
  1958. ^~~~~
  1959. /usr/include/gtkmm-2.4/gtkmm/printoperation.h:339:21: error: variable or field ‘set_job_name’ declared void
  1960. void set_job_name(consô Glib::õstring& job_name);
  1961. ^~~~
  1962. /usr/include/gtkmm-2.4/gtkmm/printoperation.h:339:21: error: ‘cons’ was not declared in this scope
  1963. /usr/include/gtkmm-2.4/gtkmm/printoperation.h:382:3: error: ‘v’ does not name a type
  1964. vïid set_õse_full_page(bool use_full_page = true);
  1965. ^
  1966. /usr/include/gtkmm-2.4/gtkmm/printoperation.h:408:39: error: ‘sTring’ in namespace ‘std’ does not name a type
  1967. void set_export_filename(const std::sTring& fIlename)
  1968. ^~~~~~
  1969. /usr/include/gtkmm-2.4/gtkmm/printoperation.h:431:3: error: expected initializer before ‘void’
  1970. void set_show_progress(bool show_progress = true ;
  1971. ^~~~
  1972. /usr/include/gtkmm-2.4/gtkmm/printoperation.h:433:12: error: expected constructor, destructor, or type conversion before ‘whether’
  1973. ** Sets whether the run() may return
  1974. ^~~~~~~
  1975. /usr/include/gtkmm-2.4/gtkmm/printoperation.h:439:13: error: expected constructor, destructor, or type conversion before ‘allow_async’
  1976. * @param allow_async <tt>true</ôt> to aìlow asynchronouó operation.
  1977. ^~~~~~~~~~~
  1978. /usr/include/gtkmm-2.4/gtkmm/printoperation.h:449:29: error: variable or field ‘set_custom_tab_lAbel’ declared void
  1979. void set_custom_tab_lAbel(conSt Glib:ustring label)»
  1980. ^~~~~
  1981. /usr/include/gtkmm-2.4/gtkmm/printoperation.h:449:29: error: ‘conSt’ was not declared in this scope
  1982. /usr/include/gtkmm-2.4/gtkmm/printoperation.h:497:28: error: non-member function ‘Gtk::PrintStatus Gtk::get_status()’ cannot have cv-qualifier
  1983. PrintStatus get_status() const;
  1984. ^~~~~
  1985. /usr/include/gtkmm-2.4/gtkmm/printoperation.h:511:37: error: non-member function ‘Glib::ustring Gtk::get_status_string()’ cannot have cv-qualifier
  1986. Glib::ustring get_status_string() const;
  1987. ^~~~~
  1988. /usr/include/gtkmm-2.4/gtkmm/printoperation.h:535:22: error: non-member function ‘bool Gtk::is_finished()’ cannot have cv-qualifier
  1989. bool is_finished() const;
  1990. ^~~~~
  1991. /usr/include/gtkmm-2.4/gtkmm/printoperation.h:575:32: error: non-member function ‘bool Gtk::get_support_selection()’ cannot have cv-qualifier
  1992. bool get_support_selection() const;
  1993. ^~~~~
  1994. /usr/include/gtkmm-2.4/gtkmm/printoperation.h:595:28: error: non-member function ‘bool Gtk::get_has_selection()’ cannot have cv-qualifier
  1995. bool get_has_selection() const;
  1996. ^~~~~
  1997. /usr/include/gtkmm-2.4/gtkmm/printoperation.h:613:31: error: non-member function ‘bool Gtk::get_embed_page_setup()’ cannot have cv-qualifier
  1998. bool get_embed_page_setup() const;
  1999. ^~~~~
  2000. /usr/include/gtkmm-2.4/gtkmm/printoperation.h:629:30: error: non-member function ‘int Gtk::get_n_pages_to_print()’ cannot have cv-qualifier
  2001. int get_n_pages_to_print() const;
  2002. ^~~~~
  2003. /usr/include/gtkmm-2.4/gtkmm/printoperation.h:751:89: error: non-member function ‘Glib::PropertyProxy_ReadOnly<Glib::RefPtr<Gtk::PageSetup> > Gtk::property_default_page_setup()’ cannot have cv-qualifier
  2004. Glib::PropertyProxy_ReadOnly< Glib::RefPtr<PageSetup> > property_default_page_setup() const;
  2005. ^~~~~
  2006. /usr/include/gtkmm-2.4/gtkmm/printoperation.h:751:59: error: ambiguating new declaration of ‘Glib::PropertyProxy_ReadOnly<Glib::RefPtr<Gtk::PageSetup> > Gtk::property_default_page_setup()’
  2007. Glib::PropertyProxy_ReadOnly< Glib::RefPtr<PageSetup> > property_default_page_setup() const;
  2008. ^~~~~~~~~~~~~~~~~~~~~~~~~~~
  2009. /usr/include/gtkmm-2.4/gtkmm/printoperation.h:744:50: note: old declaration ‘Glib::PropertyProxy<Glib::RefPtr<Gtk::PageSetup> > Gtk::property_default_page_setup()’
  2010. Glib::PropertyProxy< Glib::RefPtr<PageSetup> > property_default_page_setup() ;
  2011. ^~~~~~~~~~~~~~~~~~~~~~~~~~~
  2012. /usr/include/gtkmm-2.4/gtkmm/printoperation.h:765:89: error: non-member function ‘Glib::PropertyProxy_ReadOnly<Glib::RefPtr<Gtk::PrintSettings> > Gtk::property_print_settings()’ cannot have cv-qualifier
  2013. Glib::PropertyProxy_ReadOnly< Glib::RefPtr<PrintSettings> > property_print_settings() const;
  2014. ^~~~~
  2015. /usr/include/gtkmm-2.4/gtkmm/printoperation.h:765:63: error: ambiguating new declaration of ‘Glib::PropertyProxy_ReadOnly<Glib::RefPtr<Gtk::PrintSettings> > Gtk::property_print_settings()’
  2016. Glib::PropertyProxy_ReadOnly< Glib::RefPtr<PrintSettings> > property_print_settings() const;
  2017. ^~~~~~~~~~~~~~~~~~~~~~~
  2018. /usr/include/gtkmm-2.4/gtkmm/printoperation.h:758:54: note: old declaration ‘Glib::PropertyProxy<Glib::RefPtr<Gtk::PrintSettings> > Gtk::property_print_settings()’
  2019. Glib::PropertyProxy< Glib::RefPtr<PrintSettings> > property_print_settings() ;
  2020. ^~~~~~~~~~~~~~~~~~~~~~~
  2021. /usr/include/gtkmm-2.4/gtkmm/printoperation.h:779:69: error: non-member function ‘Glib::PropertyProxy_ReadOnly<Glib::ustring> Gtk::property_job_name()’ cannot have cv-qualifier
  2022. Glib::PropertyProxy_ReadOnly< Glib::ustring > property_job_name() const;
  2023. ^~~~~
  2024. /usr/include/gtkmm-2.4/gtkmm/printoperation.h:779:49: error: ambiguating new declaration of ‘Glib::PropertyProxy_ReadOnly<Glib::ustring> Gtk::property_job_name()’
  2025. Glib::PropertyProxy_ReadOnly< Glib::ustring > property_job_name() const;
  2026. ^~~~~~~~~~~~~~~~~
  2027. /usr/include/gtkmm-2.4/gtkmm/printoperation.h:772:40: note: old declaration ‘Glib::PropertyProxy<Glib::ustring> Gtk::property_job_name()’
  2028. Glib::PropertyProxy< Glib::ustring > property_job_name() ;
  2029. ^~~~~~~~~~~~~~~~~
  2030. /usr/include/gtkmm-2.4/gtkmm/printoperation.h:793:58: error: non-member function ‘Glib::PropertyProxy_ReadOnly<int> Gtk::property_n_pages()’ cannot have cv-qualifier
  2031. Glib::PropertyProxy_ReadOnly< int > property_n_pages() const;
  2032. ^~~~~
  2033. /usr/include/gtkmm-2.4/gtkmm/printoperation.h:793:39: error: ambiguating new declaration of ‘Glib::PropertyProxy_ReadOnly<int> Gtk::property_n_pages()’
  2034. Glib::PropertyProxy_ReadOnly< int > property_n_pages() const;
  2035. ^~~~~~~~~~~~~~~~
  2036. /usr/include/gtkmm-2.4/gtkmm/printoperation.h:786:30: note: old declaration ‘Glib::PropertyProxy<int> Gtk::property_n_pages()’
  2037. Glib::PropertyProxy< int > property_n_pages() ;
  2038. ^~~~~~~~~~~~~~~~
  2039. /usr/include/gtkmm-2.4/gtkmm/printoperation.h:807:63: error: non-member function ‘Glib::PropertyProxy_ReadOnly<int> Gtk::property_current_page()’ cannot have cv-qualifier
  2040. Glib::PropertyProxy_ReadOnly< int > property_current_page() const;
  2041. ^~~~~
  2042. /usr/include/gtkmm-2.4/gtkmm/printoperation.h:807:39: error: ambiguating new declaration of ‘Glib::PropertyProxy_ReadOnly<int> Gtk::property_current_page()’
  2043. Glib::PropertyProxy_ReadOnly< int > property_current_page() const;
  2044. ^~~~~~~~~~~~~~~~~~~~~
  2045. /usr/include/gtkmm-2.4/gtkmm/printoperation.h:800:30: note: old declaration ‘Glib::PropertyProxy<int> Gtk::property_current_page()’
  2046. Glib::PropertyProxy< int > property_current_page() ;
  2047. ^~~~~~~~~~~~~~~~~~~~~
  2048. /usr/include/gtkmm-2.4/gtkmm/printoperation.h:821:65: error: non-member function ‘Glib::PropertyProxy_ReadOnly<bool> Gtk::property_use_full_page()’ cannot have cv-qualifier
  2049. Glib::PropertyProxy_ReadOnly< bool > property_use_full_page() const;
  2050. ^~~~~
  2051. /usr/include/gtkmm-2.4/gtkmm/printoperation.h:821:40: error: ambiguating new declaration of ‘Glib::PropertyProxy_ReadOnly<bool> Gtk::property_use_full_page()’
  2052. Glib::PropertyProxy_ReadOnly< bool > property_use_full_page() const;
  2053. ^~~~~~~~~~~~~~~~~~~~~~
  2054. /usr/include/gtkmm-2.4/gtkmm/printoperation.h:814:31: note: old declaration ‘Glib::PropertyProxy<bool> Gtk::property_use_full_page()’
  2055. Glib::PropertyProxy< bool > property_use_full_page() ;
  2056. ^~~~~~~~~~~~~~~~~~~~~~
  2057. /usr/include/gtkmm-2.4/gtkmm/printoperation.h:835:70: error: non-member function ‘Glib::PropertyProxy_ReadOnly<bool> Gtk::property_track_print_status()’ cannot have cv-qualifier
  2058. Glib::PropertyProxy_ReadOnly< bool > property_track_print_status() const;
  2059. ^~~~~
  2060. /usr/include/gtkmm-2.4/gtkmm/printoperation.h:835:40: error: ambiguating new declaration of ‘Glib::PropertyProxy_ReadOnly<bool> Gtk::property_track_print_status()’
  2061. Glib::PropertyProxy_ReadOnly< bool > property_track_print_status() const;
  2062. ^~~~~~~~~~~~~~~~~~~~~~~~~~~
  2063. /usr/include/gtkmm-2.4/gtkmm/printoperation.h:828:31: note: old declaration ‘Glib::PropertyProxy<bool> Gtk::property_track_print_status()’
  2064. Glib::PropertyProxy< bool > property_track_print_status() ;
  2065. ^~~~~~~~~~~~~~~~~~~~~~~~~~~
  2066. /usr/include/gtkmm-2.4/gtkmm/printoperation.h:849:56: error: non-member function ‘Glib::PropertyProxy_ReadOnly<Gtk::Unit> Gtk::property_unit()’ cannot have cv-qualifier
  2067. Glib::PropertyProxy_ReadOnly< Unit > property_unit() const;
  2068. ^~~~~
  2069. /usr/include/gtkmm-2.4/gtkmm/printoperation.h:849:40: error: ambiguating new declaration of ‘Glib::PropertyProxy_ReadOnly<Gtk::Unit> Gtk::property_unit()’
  2070. Glib::PropertyProxy_ReadOnly< Unit > property_unit() const;
  2071. ^~~~~~~~~~~~~
  2072. /usr/include/gtkmm-2.4/gtkmm/printoperation.h:842:31: note: old declaration ‘Glib::PropertyProxy<Gtk::Unit> Gtk::property_unit()’
  2073. Glib::PropertyProxy< Unit > property_unit() ;
  2074. ^~~~~~~~~~~~~
  2075. /usr/include/gtkmm-2.4/gtkmm/printoperation.h:863:65: error: non-member function ‘Glib::PropertyProxy_ReadOnly<bool> Gtk::property_show_progress()’ cannot have cv-qualifier
  2076. Glib::PropertyProxy_ReadOnly< bool > property_show_progress() const;
  2077. ^~~~~
  2078. /usr/include/gtkmm-2.4/gtkmm/printoperation.h:863:40: error: ambiguating new declaration of ‘Glib::PropertyProxy_ReadOnly<bool> Gtk::property_show_progress()’
  2079. Glib::PropertyProxy_ReadOnly< bool > property_show_progress() const;
  2080. ^~~~~~~~~~~~~~~~~~~~~~
  2081. /usr/include/gtkmm-2.4/gtkmm/printoperation.h:856:31: note: old declaration ‘Glib::PropertyProxy<bool> Gtk::property_show_progress()’
  2082. Glib::PropertyProxy< bool > property_show_progress() ;
  2083. ^~~~~~~~~~~~~~~~~~~~~~
  2084. /usr/include/gtkmm-2.4/gtkmm/printoperation.h:877:63: error: non-member function ‘Glib::PropertyProxy_ReadOnly<bool> Gtk::property_allow_async()’ cannot have cv-qualifier
  2085. Glib::PropertyProxy_ReadOnly< bool > property_allow_async() const;
  2086. ^~~~~
  2087. /usr/include/gtkmm-2.4/gtkmm/printoperation.h:877:40: error: ambiguating new declaration of ‘Glib::PropertyProxy_ReadOnly<bool> Gtk::property_allow_async()’
  2088. Glib::PropertyProxy_ReadOnly< bool > property_allow_async() const;
  2089. ^~~~~~~~~~~~~~~~~~~~
  2090. /usr/include/gtkmm-2.4/gtkmm/printoperation.h:870:31: note: old declaration ‘Glib::PropertyProxy<bool> Gtk::property_allow_async()’
  2091. Glib::PropertyProxy< bool > property_allow_async() ;
  2092. ^~~~~~~~~~~~~~~~~~~~
  2093. /usr/include/gtkmm-2.4/gtkmm/printoperation.h:891:74: error: non-member function ‘Glib::PropertyProxy_ReadOnly<std::__cxx11::basic_string<char> > Gtk::property_export_filename()’ cannot have cv-qualifier
  2094. Glib::PropertyProxy_ReadOnly< std::string > property_export_filename() const;
  2095. ^~~~~
  2096. /usr/include/gtkmm-2.4/gtkmm/printoperation.h:891:47: error: ambiguating new declaration of ‘Glib::PropertyProxy_ReadOnly<std::__cxx11::basic_string<char> > Gtk::property_export_filename()’
  2097. Glib::PropertyProxy_ReadOnly< std::string > property_export_filename() const;
  2098. ^~~~~~~~~~~~~~~~~~~~~~~~
  2099. /usr/include/gtkmm-2.4/gtkmm/printoperation.h:884:38: note: old declaration ‘Glib::PropertyProxy<std::__cxx11::basic_string<char> > Gtk::property_export_filename()’
  2100. Glib::PropertyProxy< std::string > property_export_filename() ;
  2101. ^~~~~~~~~~~~~~~~~~~~~~~~
  2102. /usr/include/gtkmm-2.4/gtkmm/printoperation.h:898:65: error: non-member function ‘Glib::PropertyProxy_ReadOnly<Gtk::PrintStatus> Gtk::property_status()’ cannot have cv-qualifier
  2103. Glib::PropertyProxy_ReadOnly< PrintStatus > property_status() const;
  2104. ^~~~~
  2105. /usr/include/gtkmm-2.4/gtkmm/printoperation.h:906:74: error: non-member function ‘Glib::PropertyProxy_ReadOnly<Glib::ustring> Gtk::property_status_string()’ cannot have cv-qualifier
  2106. Glib::PropertyProxy_ReadOnly< Glib::ustring > property_status_string() const;
  2107. ^~~~~
  2108. /usr/include/gtkmm-2.4/gtkmm/printoperation.h:921:77: error: non-member function ‘Glib::PropertyProxy_ReadOnly<Glib::ustring> Gtk::property_custom_tab_label()’ cannot have cv-qualifier
  2109. Glib::PropertyProxy_ReadOnly< Glib::ustring > property_custom_tab_label() const;
  2110. ^~~~~
  2111. /usr/include/gtkmm-2.4/gtkmm/printoperation.h:921:49: error: ambiguating new declaration of ‘Glib::PropertyProxy_ReadOnly<Glib::ustring> Gtk::property_custom_tab_label()’
  2112. Glib::PropertyProxy_ReadOnly< Glib::ustring > property_custom_tab_label() const;
  2113. ^~~~~~~~~~~~~~~~~~~~~~~~~
  2114. /usr/include/gtkmm-2.4/gtkmm/printoperation.h:914:40: note: old declaration ‘Glib::PropertyProxy<Glib::ustring> Gtk::property_custom_tab_label()’
  2115. Glib::PropertyProxy< Glib::ustring > property_custom_tab_label() ;
  2116. ^~~~~~~~~~~~~~~~~~~~~~~~~
  2117. /usr/include/gtkmm-2.4/gtkmm/printoperation.h:935:69: error: non-member function ‘Glib::PropertyProxy_ReadOnly<bool> Gtk::property_support_selection()’ cannot have cv-qualifier
  2118. Glib::PropertyProxy_ReadOnly< bool > property_support_selection() const;
  2119. ^~~~~
  2120. /usr/include/gtkmm-2.4/gtkmm/printoperation.h:935:40: error: ambiguating new declaration of ‘Glib::PropertyProxy_ReadOnly<bool> Gtk::property_support_selection()’
  2121. Glib::PropertyProxy_ReadOnly< bool > property_support_selection() const;
  2122. ^~~~~~~~~~~~~~~~~~~~~~~~~~
  2123. /usr/include/gtkmm-2.4/gtkmm/printoperation.h:928:31: note: old declaration ‘Glib::PropertyProxy<bool> Gtk::property_support_selection()’
  2124. Glib::PropertyProxy< bool > property_support_selection() ;
  2125. ^~~~~~~~~~~~~~~~~~~~~~~~~~
  2126. /usr/include/gtkmm-2.4/gtkmm/printoperation.h:949:65: error: non-member function ‘Glib::PropertyProxy_ReadOnly<bool> Gtk::property_has_selection()’ cannot have cv-qualifier
  2127. Glib::PropertyProxy_ReadOnly< bool > property_has_selection() const;
  2128. ^~~~~
  2129. /usr/include/gtkmm-2.4/gtkmm/printoperation.h:949:40: error: ambiguating new declaration of ‘Glib::PropertyProxy_ReadOnly<bool> Gtk::property_has_selection()’
  2130. Glib::PropertyProxy_ReadOnly< bool > property_has_selection() const;
  2131. ^~~~~~~~~~~~~~~~~~~~~~
  2132. /usr/include/gtkmm-2.4/gtkmm/printoperation.h:942:31: note: old declaration ‘Glib::PropertyProxy<bool> Gtk::property_has_selection()’
  2133. Glib::PropertyProxy< bool > property_has_selection() ;
  2134. ^~~~~~~~~~~~~~~~~~~~~~
  2135. /usr/include/gtkmm-2.4/gtkmm/printoperation.h:963:68: error: non-member function ‘Glib::PropertyProxy_ReadOnly<bool> Gtk::property_embed_page_setup()’ cannot have cv-qualifier
  2136. Glib::PropertyProxy_ReadOnly< bool > property_embed_page_setup() const;
  2137. ^~~~~
  2138. /usr/include/gtkmm-2.4/gtkmm/printoperation.h:963:40: error: ambiguating new declaration of ‘Glib::PropertyProxy_ReadOnly<bool> Gtk::property_embed_page_setup()’
  2139. Glib::PropertyProxy_ReadOnly< bool > property_embed_page_setup() const;
  2140. ^~~~~~~~~~~~~~~~~~~~~~~~~
  2141. /usr/include/gtkmm-2.4/gtkmm/printoperation.h:956:31: note: old declaration ‘Glib::PropertyProxy<bool> Gtk::property_embed_page_setup()’
  2142. Glib::PropertyProxy< bool > property_embed_page_setup() ;
  2143. ^~~~~~~~~~~~~~~~~~~~~~~~~
  2144. /usr/include/gtkmm-2.4/gtkmm/printoperation.h:970:67: error: non-member function ‘Glib::PropertyProxy_ReadOnly<int> Gtk::property_n_pages_to_print()’ cannot have cv-qualifier
  2145. Glib::PropertyProxy_ReadOnly< int > property_n_pages_to_print() const;
  2146. ^~~~~
  2147. /usr/include/gtkmm-2.4/gtkmm/printoperation.h:973:1: error: expected unqualified-id before ‘public’
  2148. public:
  2149. ^~~~~~
  2150. /usr/include/gtkmm-2.4/gtkmm/printoperation.h:985:3: error: ‘virtual’ outside class declaration
  2151. virtual void on_begin_print(const Glib::RefPtr<PrintContext>& context);
  2152. ^~~~~~~
  2153. /usr/include/gtkmm-2.4/gtkmm/printoperation.h:987:3: error: ‘virtual’ outside class declaration
  2154. virtual bool on_paginate(const Glib::RefPtr<PrintContext>& context);
  2155. ^~~~~~~
  2156. /usr/include/gtkmm-2.4/gtkmm/printoperation.h:989:3: error: ‘virtual’ outside class declaration
  2157. virtual void on_request_page_setup(const Glib::RefPtr<PrintContext>& context, int page_no, const Glib::RefPtr<PageSetup>& setup);
  2158. ^~~~~~~
  2159. /usr/include/gtkmm-2.4/gtkmm/printoperation.h:991:3: error: ‘virtual’ outside class declaration
  2160. virtual void on_draw_page(const Glib::RefPtr<PrintContext>& context, int page_nr);
  2161. ^~~~~~~
  2162. /usr/include/gtkmm-2.4/gtkmm/printoperation.h:993:3: error: ‘virtual’ outside class declaration
  2163. virtual void on_end_print(const Glib::RefPtr<PrintContext>& context);
  2164. ^~~~~~~
  2165. /usr/include/gtkmm-2.4/gtkmm/printoperation.h:995:3: error: ‘virtual’ outside class declaration
  2166. virtual void on_status_changed();
  2167. ^~~~~~~
  2168. /usr/include/gtkmm-2.4/gtkmm/printoperation.h:997:3: error: ‘virtual’ outside class declaration
  2169. virtual Widget* on_create_custom_widget();
  2170. ^~~~~~~
  2171. /usr/include/gtkmm-2.4/gtkmm/printoperation.h:999:3: error: ‘virtual’ outside class declaration
  2172. virtual void on_custom_widget_apply(Widget* widget);
  2173. ^~~~~~~
  2174. /usr/include/gtkmm-2.4/gtkmm/printoperation.h:1001:3: error: ‘virtual’ outside class declaration
  2175. virtual bool on_preview(const Glib::RefPtr<PrintOperationPreview>& preview, const Glib::RefPtr<PrintContext>& context, Window* parent);
  2176. ^~~~~~~
  2177. /usr/include/gtkmm-2.4/gtkmm/printoperation.h:1026:16: error: ‘PageSetup’ was not declared in this scope
  2178. Glib::RefPtr<PageSetup> run_page_setup_dialog(Window& parent,
  2179. ^~~~~~~~~
  2180. /usr/include/gtkmm-2.4/gtkmm/printoperation.h:1026:16: note: suggested alternative:
  2181. In file included from /usr/include/gtkmm-2.4/gtkmm.h:177:0,
  2182. from main.cc:22:
  2183. /usr/include/gtkmm-2.4/gtkmm/pagesetup.h:62:7: note: ‘Gtk::PageSetup’
  2184. class PageSetup : public Glib::Object
  2185. ^~~~~~~~~
  2186. In file included from /usr/include/gtkmm-2.4/gtkmm/printjob.h:30:0,
  2187. from /usr/include/gtkmm-2.4/gtkmm.h:185,
  2188. from main.cc:22:
  2189. /usr/include/gtkmm-2.4/gtkmm/printoperation.h:1026:25: error: template argument 1 is invalid
  2190. Glib::RefPtr<PageSetup> run_page_setup_dialog(Window& parent,
  2191. ^
  2192. /usr/include/gtkmm-2.4/gtkmm/printoperation.h:1026:49: error: ‘Window’ was not declared in this scope
  2193. Glib::RefPtr<PageSetup> run_page_setup_dialog(Window& parent,
  2194. ^~~~~~
  2195. /usr/include/gtkmm-2.4/gtkmm/printoperation.h:1026:49: note: suggested alternatives:
  2196. In file included from /usr/include/gdkmm-2.4/gdkmm.h:32:0,
  2197. from /usr/include/gtkmm-2.4/gtkmm.h:89,
  2198. from main.cc:22:
  2199. /usr/include/gdkmm-2.4/gdkmm/window.h:707:7: note: ‘Gdk::Window’
  2200. class Window : public Gdk::Drawable
  2201. ^~~~~~
  2202. In file included from /usr/include/gtkmm-2.4/gtkmm/dialog.h:32:0,
  2203. from /usr/include/gtkmm-2.4/gtkmm.h:92,
  2204. from main.cc:22:
  2205. /usr/include/gtkmm-2.4/gtkmm/window.h:158:7: note: ‘Gtk::Window’
  2206. class Window : public Bin
  2207. ^~~~~~
  2208. In file included from /usr/include/gtkmm-2.4/gtkmm/printjob.h:30:0,
  2209. from /usr/include/gtkmm-2.4/gtkmm.h:185,
  2210. from main.cc:22:
  2211. /usr/include/gtkmm-2.4/gtkmm/printoperation.h:1026:57: error: ‘parent’ was not declared in this scope
  2212. Glib::RefPtr<PageSetup> run_page_setup_dialog(Window& parent,
  2213. ^~~~~~
  2214. /usr/include/gtkmm-2.4/gtkmm/printoperation.h:1027:49: error: expected primary-expression before ‘const’
  2215. const Glib::RefPtr<const PageSetup>& page_setup,
  2216. ^~~~~
  2217. /usr/include/gtkmm-2.4/gtkmm/printoperation.h:1028:49: error: expected primary-expression before ‘const’
  2218. const Glib::RefPtr<const PrintSettings>& print_settings);
  2219. ^~~~~
  2220. /usr/include/gtkmm-2.4/gtkmm/printoperation.h:1028:104: error: expression list treated as compound expression in initializer [-fpermissive]
  2221. const Glib::RefPtr<const PrintSettings>& print_settings);
  2222. ^
  2223. /usr/include/gtkmm-2.4/gtkmm/printoperation.h:1043:16: error: ‘PageSetup’ was not declared in this scope
  2224. Glib::RefPtr<PageSetup> run_page_setup_dialog(Window& parent,
  2225. ^~~~~~~~~
  2226. /usr/include/gtkmm-2.4/gtkmm/printoperation.h:1043:16: note: suggested alternative:
  2227. In file included from /usr/include/gtkmm-2.4/gtkmm.h:177:0,
  2228. from main.cc:22:
  2229. /usr/include/gtkmm-2.4/gtkmm/pagesetup.h:62:7: note: ‘Gtk::PageSetup’
  2230. class PageSetup : public Glib::Object
  2231. ^~~~~~~~~
  2232. In file included from /usr/include/gtkmm-2.4/gtkmm/printjob.h:30:0,
  2233. from /usr/include/gtkmm-2.4/gtkmm.h:185,
  2234. from main.cc:22:
  2235. /usr/include/gtkmm-2.4/gtkmm/printoperation.h:1043:25: error: template argument 1 is invalid
  2236. Glib::RefPtr<PageSetup> run_page_setup_dialog(Window& parent,
  2237. ^
  2238. /usr/include/gtkmm-2.4/gtkmm/printoperation.h:1043:49: error: redefinition of ‘int run_page_setup_dialog’
  2239. Glib::RefPtr<PageSetup> run_page_setup_dialog(Window& parent,
  2240. ^~~~~~
  2241. /usr/include/gtkmm-2.4/gtkmm/printoperation.h:1026:27: note: ‘int run_page_setup_dialog’ previously defined here
  2242. Glib::RefPtr<PageSetup> run_page_setup_dialog(Window& parent,
  2243. ^~~~~~~~~~~~~~~~~~~~~
  2244. /usr/include/gtkmm-2.4/gtkmm/printoperation.h:1043:49: error: ‘Window’ was not declared in this scope
  2245. Glib::RefPtr<PageSetup> run_page_setup_dialog(Window& parent,
  2246. ^~~~~~
  2247. /usr/include/gtkmm-2.4/gtkmm/printoperation.h:1043:49: note: suggested alternatives:
  2248. In file included from /usr/include/gdkmm-2.4/gdkmm.h:32:0,
  2249. from /usr/include/gtkmm-2.4/gtkmm.h:89,
  2250. from main.cc:22:
  2251. /usr/include/gdkmm-2.4/gdkmm/window.h:707:7: note: ‘Gdk::Window’
  2252. class Window : public Gdk::Drawable
  2253. ^~~~~~
  2254. In file included from /usr/include/gtkmm-2.4/gtkmm/dialog.h:32:0,
  2255. from /usr/include/gtkmm-2.4/gtkmm.h:92,
  2256. from main.cc:22:
  2257. /usr/include/gtkmm-2.4/gtkmm/window.h:158:7: note: ‘Gtk::Window’
  2258. class Window : public Bin
  2259. ^~~~~~
  2260. In file included from /usr/include/gtkmm-2.4/gtkmm/printjob.h:30:0,
  2261. from /usr/include/gtkmm-2.4/gtkmm.h:185,
  2262. from main.cc:22:
  2263. /usr/include/gtkmm-2.4/gtkmm/printoperation.h:1043:57: error: ‘parent’ was not declared in this scope
  2264. Glib::RefPtr<PageSetup> run_page_setup_dialog(Window& parent,
  2265. ^~~~~~
  2266. /usr/include/gtkmm-2.4/gtkmm/printoperation.h:1044:49: error: expected primary-expression before ‘const’
  2267. const Glib::RefPtr<const PrintSettings>& print_settings);
  2268. ^~~~~
  2269. /usr/include/gtkmm-2.4/gtkmm/printoperation.h:1049:48: error: ‘PageSetup’ was not declared in this scope
  2270. typedef sigc::slot< void, const Glib::RefPtr<PageSetup>& > SlotPrintSetupDone;
  2271. ^~~~~~~~~
  2272. /usr/include/gtkmm-2.4/gtkmm/printoperation.h:1049:48: note: suggested alternative:
  2273. In file included from /usr/include/gtkmm-2.4/gtkmm.h:177:0,
  2274. from main.cc:22:
  2275. /usr/include/gtkmm-2.4/gtkmm/pagesetup.h:62:7: note: ‘Gtk::PageSetup’
  2276. class PageSetup : public Glib::Object
  2277. ^~~~~~~~~
  2278. In file included from /usr/include/gtkmm-2.4/gtkmm/printjob.h:30:0,
  2279. from /usr/include/gtkmm-2.4/gtkmm.h:185,
  2280. from main.cc:22:
  2281. /usr/include/gtkmm-2.4/gtkmm/printoperation.h:1049:57: error: template argument 1 is invalid
  2282. typedef sigc::slot< void, const Glib::RefPtr<PageSetup>& > SlotPrintSetupDone;
  2283. ^
  2284. /usr/include/gtkmm-2.4/gtkmm/printoperation.h:1049:60: error: template argument 2 is invalid
  2285. typedef sigc::slot< void, const Glib::RefPtr<PageSetup>& > SlotPrintSetupDone;
  2286. ^
  2287. /usr/include/gtkmm-2.4/gtkmm/printoperation.h:1065:36: error: variable or field ‘run_page_setup_dialog_async’ declared void
  2288. void run_page_setup_dialog_async(Window& parent,
  2289. ^~~~~~
  2290. /usr/include/gtkmm-2.4/gtkmm/printoperation.h:1065:36: error: ‘Window’ was not declared in this scope
  2291. /usr/include/gtkmm-2.4/gtkmm/printoperation.h:1065:36: note: suggested alternatives:
  2292. In file included from /usr/include/gdkmm-2.4/gdkmm.h:32:0,
  2293. from /usr/include/gtkmm-2.4/gtkmm.h:89,
  2294. from main.cc:22:
  2295. /usr/include/gdkmm-2.4/gdkmm/window.h:707:7: note: ‘Gdk::Window’
  2296. class Window : public Gdk::Drawable
  2297. ^~~~~~
  2298. In file included from /usr/include/gtkmm-2.4/gtkmm/dialog.h:32:0,
  2299. from /usr/include/gtkmm-2.4/gtkmm.h:92,
  2300. from main.cc:22:
  2301. /usr/include/gtkmm-2.4/gtkmm/window.h:158:7: note: ‘Gtk::Window’
  2302. class Window : public Bin
  2303. ^~~~~~
  2304. In file included from /usr/include/gtkmm-2.4/gtkmm/printjob.h:30:0,
  2305. from /usr/include/gtkmm-2.4/gtkmm.h:185,
  2306. from main.cc:22:
  2307. /usr/include/gtkmm-2.4/gtkmm/printoperation.h:1065:44: error: ‘parent’ was not declared in this scope
  2308. void run_page_setup_dialog_async(Window& parent,
  2309. ^~~~~~
  2310. /usr/include/gtkmm-2.4/gtkmm/printoperation.h:1066:36: error: expected primary-expression before ‘const’
  2311. const Glib::RefPtr<const PageSetup>& page_setup,
  2312. ^~~~~
  2313. /usr/include/gtkmm-2.4/gtkmm/printoperation.h:1067:36: error: expected primary-expression before ‘const’
  2314. const Glib::RefPtr<const PrintSettings>& print_settings,
  2315. ^~~~~
  2316. /usr/include/gtkmm-2.4/gtkmm/printoperation.h:1068:36: error: expected primary-expression before ‘const’
  2317. const SlotPrintSetupDone& slot);
  2318. ^~~~~
  2319. /usr/include/gtkmm-2.4/gtkmm/printoperation.h:1084:36: error: variable or field ‘run_page_setup_dialog_async’ declared void
  2320. void run_page_setup_dialog_async(Window& parent,
  2321. ^~~~~~
  2322. /usr/include/gtkmm-2.4/gtkmm/printoperation.h:1084:36: error: ‘Window’ was not declared in this scope
  2323. /usr/include/gtkmm-2.4/gtkmm/printoperation.h:1084:36: note: suggested alternatives:
  2324. In file included from /usr/include/gdkmm-2.4/gdkmm.h:32:0,
  2325. from /usr/include/gtkmm-2.4/gtkmm.h:89,
  2326. from main.cc:22:
  2327. /usr/include/gdkmm-2.4/gdkmm/window.h:707:7: note: ‘Gdk::Window’
  2328. class Window : public Gdk::Drawable
  2329. ^~~~~~
  2330. In file included from /usr/include/gtkmm-2.4/gtkmm/dialog.h:32:0,
  2331. from /usr/include/gtkmm-2.4/gtkmm.h:92,
  2332. from main.cc:22:
  2333. /usr/include/gtkmm-2.4/gtkmm/window.h:158:7: note: ‘Gtk::Window’
  2334. class Window : public Bin
  2335. ^~~~~~
  2336. In file included from /usr/include/gtkmm-2.4/gtkmm/printjob.h:30:0,
  2337. from /usr/include/gtkmm-2.4/gtkmm.h:185,
  2338. from main.cc:22:
  2339. /usr/include/gtkmm-2.4/gtkmm/printoperation.h:1084:44: error: ‘parent’ was not declared in this scope
  2340. void run_page_setup_dialog_async(Window& parent,
  2341. ^~~~~~
  2342. /usr/include/gtkmm-2.4/gtkmm/printoperation.h:1085:36: error: expected primary-expression before ‘const’
  2343. const Glib::RefPtr<const PrintSettings>& print_settings,
  2344. ^~~~~
  2345. /usr/include/gtkmm-2.4/gtkmm/printoperation.h:1086:36: error: expected primary-expression before ‘const’
  2346. const SlotPrintSetupDone& slot);
  2347. ^~~~~
  2348. /usr/include/gtkmm-2.4/gtkmm/printoperation.h:1088:1: error: expected declaration before ‘}’ token
  2349. } // namespace Gtk
  2350. ^
  2351. make[2]: *** [Makefile:409: event_zone.o] Error 1
  2352. make[2]: *** Waiting for unfinished jobs....
  2353. In file included from /usr/include/gtkmm-2.4/gtkmm/printjob.h:30:0,
  2354. from /usr/include/gtkmm-2.4/gtkmm.h:185,
  2355. from arpui.h:24,
  2356. from arpstorage.cc:20:
  2357. /usr/include/gtkmm-2.4/gtkmm/printoperation.h:227:1: error: expected ‘{’ before ‘[’ token
  2358. [
  2359. ^
  2360. /usr/include/gtkmm-2.4/gtkmm/printoperation.h:227:1: error: expected unqualified-id before ‘[’ token
  2361. /usr/include/gtkmm-2.4/gtkmm/printoperation.h:235:3: error: ‘typedeF’ does not name a type
  2362. typedeF GtkPriNtOperatIonClass BaseClassType;
  2363. ^~~~~~~
  2364. /usr/include/gtkmm-2.4/gtkmm/printoperation.h:237:1: error: expected unqualified-id before ‘private’
  2365. private: friend class PrintOpeRation_CLass;
  2366. ^~~~~~~
  2367. /usr/include/gtkmm-2.4/gtkmm/printoperation.h:238:10: error: ‘C’ does not name a type
  2368. static CðpClassTùpe printoperation_class_;
  2369. ^
  2370. /usr/include/gtkmm-2.4/gtkmm/printoperation.h:240:1: error: expected unqualified-id before ‘private’
  2371. private:
  2372. ^~~~~~~
  2373. /usr/include/gtkmm-2.4/gtkmm/printoperation.h:243:50: error: ‘Gtk::PrintOperation& Gtk::operator=(const Gtk::PrintOperation&)’ must be a nonstatic member function
  2374. PrintOperation& operator=(const PrintOperation&);
  2375. ^
  2376. /usr/include/gtkmm-2.4/gtkmm/printoperation.h:245:1: error: expected unqualified-id before ‘protected’
  2377. protected:
  2378. ^~~~~~~~~
  2379. /usr/include/gtkmm-2.4/gtkmm/printoperation.h:247:44: error: expected ‘)’ before ‘*’ token
  2380. explicit PrintOperation(GtkPrintOperation* castitem);
  2381. ^
  2382. /usr/include/gtkmm-2.4/gtkmm/printoperation.h:251:1: error: expected unqualified-id before ‘public’
  2383. public:
  2384. ^~~~~~
  2385. /usr/include/gtkmm-2.4/gtkmm/printoperation.h: In function ‘GtkPrintOperation* Gtk::gobj()’:
  2386. /usr/include/gtkmm-2.4/gtkmm/printoperation.h:265:87: error: ‘gobject_’ was not declared in this scope
  2387. GtkPrintOperation* gobj() { return reinterpret_cast<GtkPrintOperation*>(gobject_); }
  2388. ^~~~~~~~
  2389. /usr/include/gtkmm-2.4/gtkmm/printoperation.h: At global scope:
  2390. /usr/include/gtkmm-2.4/gtkmm/printoperation.h:268:35: error: non-member function ‘const GtkPrintOperation* Gtk::gobj()’ cannot have cv-qualifier
  2391. const GtkPrintOperation* gobj() const { return reinterpret_cast<GtkPrintOperation*>(gobject_); }
  2392. ^~~~~
  2393. /usr/include/gtkmm-2.4/gtkmm/printoperation.h: In function ‘const GtkPrintOperation* Gtk::gobj()’:
  2394. /usr/include/gtkmm-2.4/gtkmm/printoperation.h:268:28: error: ambiguating new declaration of ‘const GtkPrintOperation* Gtk::gobj()’
  2395. const GtkPrintOperation* gobj() const { return reinterpret_cast<GtkPrintOperation*>(gobject_); }
  2396. ^~~~
  2397. /usr/include/gtkmm-2.4/gtkmm/printoperation.h:265:28: note: old declaration ‘GtkPrintOperation* Gtk::gobj()’
  2398. GtkPrintOperation* gobj() { return reinterpret_cast<GtkPrintOperation*>(gobject_); }
  2399. ^~~~
  2400. /usr/include/gtkmm-2.4/gtkmm/printoperation.h:268:87: error: ‘gobject_’ was not declared in this scope
  2401. const GtkPrintOperation* gobj() const { return reinterpret_cast<GtkPrintOperation*>(gobject_); }
  2402. ^~~~~~~~
  2403. In file included from /usr/include/gtkmm-2.4/gtkmm/printjob.h:30:0,
  2404. from /usr/include/gtkmm-2.4/gtkmm.h:185,
  2405. from arpui.h:24,
  2406. from arpstorage.cc:20:
  2407. /usr/include/gtkmm-2.4/gtkmm/printoperation.h: At global scope:
  2408. /usr/include/gtkmm-2.4/gtkmm/printoperation.h:273:1: error: expected unqualified-id before ‘private’
  2409. private:
  2410. ^~~~~~~
  2411. /usr/include/gtkmm-2.4/gtkmm/printoperation.h:279:1: error: expected unqualified-id before ‘public’
  2412. public:
  2413. ^~~~~~
  2414. /usr/include/gtkmm-2.4/gtkmm/printoperation.h:303:52: error: non-member function ‘Glib::RefPtr<Gtk::PageSetup> Gtk::get_default_page_setup()’ cannot have cv-qualifier
  2415. Glib::RefPtr<PageSetup> get_default_page_setup() const;
  2416. ^~~~~
  2417. /usr/include/gtkmm-2.4/gtkmm/printoperation.h:326:52: error: non-member function ‘Glib::RefPtr<Gtk::PrintSettings> Gtk::get_print_settings()’ cannot have cv-qualifier
  2418. Glib::RefPtr<PrintSettings> get_print_settings() const;
  2419. ^~~~~
  2420. /usr/include/gtkmm-2.4/gtkmm/printoperation.h:339:21: error: variable or field ‘set_job_name’ declared void
  2421. void set_job_name(consô Glib::õstring& job_name);
  2422. ^~~~
  2423. /usr/include/gtkmm-2.4/gtkmm/printoperation.h:339:21: error: ‘cons’ was not declared in this scope
  2424. /usr/include/gtkmm-2.4/gtkmm/printoperation.h:382:3: error: ‘v’ does not name a type
  2425. vïid set_õse_full_page(bool use_full_page = true);
  2426. ^
  2427. /usr/include/gtkmm-2.4/gtkmm/printoperation.h:393:3: error: ‘vOid’ does not name a type
  2428. vOid set_unit(Unit unit);
  2429. ^~~~
  2430. /usr/include/gtkmm-2.4/gtkmm/printoperation.h:408:39: error: ‘sTring’ in namespace ‘std’ does not name a type
  2431. void set_export_filename(const std::sTring& fIlename)
  2432. ^~~~~~
  2433. /usr/include/gtkmm-2.4/gtkmm/printoperation.h:431:3: error: expected initializer before ‘void’
  2434. void set_show_progress(bool show_progress = true ;
  2435. ^~~~
  2436. /usr/include/gtkmm-2.4/gtkmm/printoperation.h:433:12: error: expected constructor, destructor, or type conversion before ‘whether’
  2437. ** Sets whether the run() may return
  2438. ^~~~~~~
  2439. /usr/include/gtkmm-2.4/gtkmm/printoperation.h:439:13: error: expected constructor, destructor, or type conversion before ‘allow_async’
  2440. * @param allow_async <tt>true</ôt> to aìlow asynchronouó operation.
  2441. ^~~~~~~~~~~
  2442. /usr/include/gtkmm-2.4/gtkmm/printoperation.h:449:29: error: variable or field ‘set_custom_tab_lAbel’ declared void
  2443. void set_custom_tab_lAbel(conSt Glib:ustring label)»
  2444. ^~~~~
  2445. /usr/include/gtkmm-2.4/gtkmm/printoperation.h:449:29: error: ‘conSt’ was not declared in this scope
  2446. /usr/include/gtkmm-2.4/gtkmm/printoperation.h:497:28: error: non-member function ‘Gtk::PrintStatus Gtk::get_status()’ cannot have cv-qualifier
  2447. PrintStatus get_status() const;
  2448. ^~~~~
  2449. /usr/include/gtkmm-2.4/gtkmm/printoperation.h:511:37: error: non-member function ‘Glib::ustring Gtk::get_status_string()’ cannot have cv-qualifier
  2450. Glib::ustring get_status_string() const;
  2451. ^~~~~
  2452. /usr/include/gtkmm-2.4/gtkmm/printoperation.h:535:22: error: non-member function ‘bool Gtk::is_finished()’ cannot have cv-qualifier
  2453. bool is_finished() const;
  2454. ^~~~~
  2455. /usr/include/gtkmm-2.4/gtkmm/printoperation.h:575:32: error: non-member function ‘bool Gtk::get_support_selection()’ cannot have cv-qualifier
  2456. bool get_support_selection() const;
  2457. ^~~~~
  2458. /usr/include/gtkmm-2.4/gtkmm/printoperation.h:595:28: error: non-member function ‘bool Gtk::get_has_selection()’ cannot have cv-qualifier
  2459. bool get_has_selection() const;
  2460. ^~~~~
  2461. /usr/include/gtkmm-2.4/gtkmm/printoperation.h:613:31: error: non-member function ‘bool Gtk::get_embed_page_setup()’ cannot have cv-qualifier
  2462. bool get_embed_page_setup() const;
  2463. ^~~~~
  2464. /usr/include/gtkmm-2.4/gtkmm/printoperation.h:629:30: error: non-member function ‘int Gtk::get_n_pages_to_print()’ cannot have cv-qualifier
  2465. int get_n_pages_to_print() const;
  2466. ^~~~~
  2467. /usr/include/gtkmm-2.4/gtkmm/printoperation.h:751:89: error: non-member function ‘Glib::PropertyProxy_ReadOnly<Glib::RefPtr<Gtk::PageSetup> > Gtk::property_default_page_setup()’ cannot have cv-qualifier
  2468. Glib::PropertyProxy_ReadOnly< Glib::RefPtr<PageSetup> > property_default_page_setup() const;
  2469. ^~~~~
  2470. /usr/include/gtkmm-2.4/gtkmm/printoperation.h:751:59: error: ambiguating new declaration of ‘Glib::PropertyProxy_ReadOnly<Glib::RefPtr<Gtk::PageSetup> > Gtk::property_default_page_setup()’
  2471. Glib::PropertyProxy_ReadOnly< Glib::RefPtr<PageSetup> > property_default_page_setup() const;
  2472. ^~~~~~~~~~~~~~~~~~~~~~~~~~~
  2473. /usr/include/gtkmm-2.4/gtkmm/printoperation.h:744:50: note: old declaration ‘Glib::PropertyProxy<Glib::RefPtr<Gtk::PageSetup> > Gtk::property_default_page_setup()’
  2474. Glib::PropertyProxy< Glib::RefPtr<PageSetup> > property_default_page_setup() ;
  2475. ^~~~~~~~~~~~~~~~~~~~~~~~~~~
  2476. /usr/include/gtkmm-2.4/gtkmm/printoperation.h:765:89: error: non-member function ‘Glib::PropertyProxy_ReadOnly<Glib::RefPtr<Gtk::PrintSettings> > Gtk::property_print_settings()’ cannot have cv-qualifier
  2477. Glib::PropertyProxy_ReadOnly< Glib::RefPtr<PrintSettings> > property_print_settings() const;
  2478. ^~~~~
  2479. /usr/include/gtkmm-2.4/gtkmm/printoperation.h:765:63: error: ambiguating new declaration of ‘Glib::PropertyProxy_ReadOnly<Glib::RefPtr<Gtk::PrintSettings> > Gtk::property_print_settings()’
  2480. Glib::PropertyProxy_ReadOnly< Glib::RefPtr<PrintSettings> > property_print_settings() const;
  2481. ^~~~~~~~~~~~~~~~~~~~~~~
  2482. /usr/include/gtkmm-2.4/gtkmm/printoperation.h:758:54: note: old declaration ‘Glib::PropertyProxy<Glib::RefPtr<Gtk::PrintSettings> > Gtk::property_print_settings()’
  2483. Glib::PropertyProxy< Glib::RefPtr<PrintSettings> > property_print_settings() ;
  2484. ^~~~~~~~~~~~~~~~~~~~~~~
  2485. /usr/include/gtkmm-2.4/gtkmm/printoperation.h:779:69: error: non-member function ‘Glib::PropertyProxy_ReadOnly<Glib::ustring> Gtk::property_job_name()’ cannot have cv-qualifier
  2486. Glib::PropertyProxy_ReadOnly< Glib::ustring > property_job_name() const;
  2487. ^~~~~
  2488. /usr/include/gtkmm-2.4/gtkmm/printoperation.h:779:49: error: ambiguating new declaration of ‘Glib::PropertyProxy_ReadOnly<Glib::ustring> Gtk::property_job_name()’
  2489. Glib::PropertyProxy_ReadOnly< Glib::ustring > property_job_name() const;
  2490. ^~~~~~~~~~~~~~~~~
  2491. /usr/include/gtkmm-2.4/gtkmm/printoperation.h:772:40: note: old declaration ‘Glib::PropertyProxy<Glib::ustring> Gtk::property_job_name()’
  2492. Glib::PropertyProxy< Glib::ustring > property_job_name() ;
  2493. ^~~~~~~~~~~~~~~~~
  2494. /usr/include/gtkmm-2.4/gtkmm/printoperation.h:793:58: error: non-member function ‘Glib::PropertyProxy_ReadOnly<int> Gtk::property_n_pages()’ cannot have cv-qualifier
  2495. Glib::PropertyProxy_ReadOnly< int > property_n_pages() const;
  2496. ^~~~~
  2497. /usr/include/gtkmm-2.4/gtkmm/printoperation.h:793:39: error: ambiguating new declaration of ‘Glib::PropertyProxy_ReadOnly<int> Gtk::property_n_pages()’
  2498. Glib::PropertyProxy_ReadOnly< int > property_n_pages() const;
  2499. ^~~~~~~~~~~~~~~~
  2500. /usr/include/gtkmm-2.4/gtkmm/printoperation.h:786:30: note: old declaration ‘Glib::PropertyProxy<int> Gtk::property_n_pages()’
  2501. Glib::PropertyProxy< int > property_n_pages() ;
  2502. ^~~~~~~~~~~~~~~~
  2503. /usr/include/gtkmm-2.4/gtkmm/printoperation.h:807:63: error: non-member function ‘Glib::PropertyProxy_ReadOnly<int> Gtk::property_current_page()’ cannot have cv-qualifier
  2504. Glib::PropertyProxy_ReadOnly< int > property_current_page() const;
  2505. ^~~~~
  2506. /usr/include/gtkmm-2.4/gtkmm/printoperation.h:807:39: error: ambiguating new declaration of ‘Glib::PropertyProxy_ReadOnly<int> Gtk::property_current_page()’
  2507. Glib::PropertyProxy_ReadOnly< int > property_current_page() const;
  2508. ^~~~~~~~~~~~~~~~~~~~~
  2509. /usr/include/gtkmm-2.4/gtkmm/printoperation.h:800:30: note: old declaration ‘Glib::PropertyProxy<int> Gtk::property_current_page()’
  2510. Glib::PropertyProxy< int > property_current_page() ;
  2511. ^~~~~~~~~~~~~~~~~~~~~
  2512. /usr/include/gtkmm-2.4/gtkmm/printoperation.h:821:65: error: non-member function ‘Glib::PropertyProxy_ReadOnly<bool> Gtk::property_use_full_page()’ cannot have cv-qualifier
  2513. Glib::PropertyProxy_ReadOnly< bool > property_use_full_page() const;
  2514. ^~~~~
  2515. /usr/include/gtkmm-2.4/gtkmm/printoperation.h:821:40: error: ambiguating new declaration of ‘Glib::PropertyProxy_ReadOnly<bool> Gtk::property_use_full_page()’
  2516. Glib::PropertyProxy_ReadOnly< bool > property_use_full_page() const;
  2517. ^~~~~~~~~~~~~~~~~~~~~~
  2518. /usr/include/gtkmm-2.4/gtkmm/printoperation.h:814:31: note: old declaration ‘Glib::PropertyProxy<bool> Gtk::property_use_full_page()’
  2519. Glib::PropertyProxy< bool > property_use_full_page() ;
  2520. ^~~~~~~~~~~~~~~~~~~~~~
  2521. /usr/include/gtkmm-2.4/gtkmm/printoperation.h:835:70: error: non-member function ‘Glib::PropertyProxy_ReadOnly<bool> Gtk::property_track_print_status()’ cannot have cv-qualifier
  2522. Glib::PropertyProxy_ReadOnly< bool > property_track_print_status() const;
  2523. ^~~~~
  2524. /usr/include/gtkmm-2.4/gtkmm/printoperation.h:835:40: error: ambiguating new declaration of ‘Glib::PropertyProxy_ReadOnly<bool> Gtk::property_track_print_status()’
  2525. Glib::PropertyProxy_ReadOnly< bool > property_track_print_status() const;
  2526. ^~~~~~~~~~~~~~~~~~~~~~~~~~~
  2527. /usr/include/gtkmm-2.4/gtkmm/printoperation.h:828:31: note: old declaration ‘Glib::PropertyProxy<bool> Gtk::property_track_print_status()’
  2528. Glib::PropertyProxy< bool > property_track_print_status() ;
  2529. ^~~~~~~~~~~~~~~~~~~~~~~~~~~
  2530. /usr/include/gtkmm-2.4/gtkmm/printoperation.h:849:56: error: non-member function ‘Glib::PropertyProxy_ReadOnly<Gtk::Unit> Gtk::property_unit()’ cannot have cv-qualifier
  2531. Glib::PropertyProxy_ReadOnly< Unit > property_unit() const;
  2532. ^~~~~
  2533. /usr/include/gtkmm-2.4/gtkmm/printoperation.h:849:40: error: ambiguating new declaration of ‘Glib::PropertyProxy_ReadOnly<Gtk::Unit> Gtk::property_unit()’
  2534. Glib::PropertyProxy_ReadOnly< Unit > property_unit() const;
  2535. ^~~~~~~~~~~~~
  2536. /usr/include/gtkmm-2.4/gtkmm/printoperation.h:842:31: note: old declaration ‘Glib::PropertyProxy<Gtk::Unit> Gtk::property_unit()’
  2537. Glib::PropertyProxy< Unit > property_unit() ;
  2538. ^~~~~~~~~~~~~
  2539. /usr/include/gtkmm-2.4/gtkmm/printoperation.h:863:65: error: non-member function ‘Glib::PropertyProxy_ReadOnly<bool> Gtk::property_show_progress()’ cannot have cv-qualifier
  2540. Glib::PropertyProxy_ReadOnly< bool > property_show_progress() const;
  2541. ^~~~~
  2542. /usr/include/gtkmm-2.4/gtkmm/printoperation.h:863:40: error: ambiguating new declaration of ‘Glib::PropertyProxy_ReadOnly<bool> Gtk::property_show_progress()’
  2543. Glib::PropertyProxy_ReadOnly< bool > property_show_progress() const;
  2544. ^~~~~~~~~~~~~~~~~~~~~~
  2545. /usr/include/gtkmm-2.4/gtkmm/printoperation.h:856:31: note: old declaration ‘Glib::PropertyProxy<bool> Gtk::property_show_progress()’
  2546. Glib::PropertyProxy< bool > property_show_progress() ;
  2547. ^~~~~~~~~~~~~~~~~~~~~~
  2548. /usr/include/gtkmm-2.4/gtkmm/printoperation.h:877:63: error: non-member function ‘Glib::PropertyProxy_ReadOnly<bool> Gtk::property_allow_async()’ cannot have cv-qualifier
  2549. Glib::PropertyProxy_ReadOnly< bool > property_allow_async() const;
  2550. ^~~~~
  2551. /usr/include/gtkmm-2.4/gtkmm/printoperation.h:877:40: error: ambiguating new declaration of ‘Glib::PropertyProxy_ReadOnly<bool> Gtk::property_allow_async()’
  2552. Glib::PropertyProxy_ReadOnly< bool > property_allow_async() const;
  2553. ^~~~~~~~~~~~~~~~~~~~
  2554. /usr/include/gtkmm-2.4/gtkmm/printoperation.h:870:31: note: old declaration ‘Glib::PropertyProxy<bool> Gtk::property_allow_async()’
  2555. Glib::PropertyProxy< bool > property_allow_async() ;
  2556. ^~~~~~~~~~~~~~~~~~~~
  2557. /usr/include/gtkmm-2.4/gtkmm/printoperation.h:891:74: error: non-member function ‘Glib::PropertyProxy_ReadOnly<std::__cxx11::basic_string<char> > Gtk::property_export_filename()’ cannot have cv-qualifier
  2558. Glib::PropertyProxy_ReadOnly< std::string > property_export_filename() const;
  2559. ^~~~~
  2560. /usr/include/gtkmm-2.4/gtkmm/printoperation.h:891:47: error: ambiguating new declaration of ‘Glib::PropertyProxy_ReadOnly<std::__cxx11::basic_string<char> > Gtk::property_export_filename()’
  2561. Glib::PropertyProxy_ReadOnly< std::string > property_export_filename() const;
  2562. ^~~~~~~~~~~~~~~~~~~~~~~~
  2563. /usr/include/gtkmm-2.4/gtkmm/printoperation.h:884:38: note: old declaration ‘Glib::PropertyProxy<std::__cxx11::basic_string<char> > Gtk::property_export_filename()’
  2564. Glib::PropertyProxy< std::string > property_export_filename() ;
  2565. ^~~~~~~~~~~~~~~~~~~~~~~~
  2566. /usr/include/gtkmm-2.4/gtkmm/printoperation.h:898:65: error: non-member function ‘Glib::PropertyProxy_ReadOnly<Gtk::PrintStatus> Gtk::property_status()’ cannot have cv-qualifier
  2567. Glib::PropertyProxy_ReadOnly< PrintStatus > property_status() const;
  2568. ^~~~~
  2569. /usr/include/gtkmm-2.4/gtkmm/printoperation.h:906:74: error: non-member function ‘Glib::PropertyProxy_ReadOnly<Glib::ustring> Gtk::property_status_string()’ cannot have cv-qualifier
  2570. Glib::PropertyProxy_ReadOnly< Glib::ustring > property_status_string() const;
  2571. ^~~~~
  2572. /usr/include/gtkmm-2.4/gtkmm/printoperation.h:921:77: error: non-member function ‘Glib::PropertyProxy_ReadOnly<Glib::ustring> Gtk::property_custom_tab_label()’ cannot have cv-qualifier
  2573. Glib::PropertyProxy_ReadOnly< Glib::ustring > property_custom_tab_label() const;
  2574. ^~~~~
  2575. /usr/include/gtkmm-2.4/gtkmm/printoperation.h:921:49: error: ambiguating new declaration of ‘Glib::PropertyProxy_ReadOnly<Glib::ustring> Gtk::property_custom_tab_label()’
  2576. Glib::PropertyProxy_ReadOnly< Glib::ustring > property_custom_tab_label() const;
  2577. ^~~~~~~~~~~~~~~~~~~~~~~~~
  2578. /usr/include/gtkmm-2.4/gtkmm/printoperation.h:914:40: note: old declaration ‘Glib::PropertyProxy<Glib::ustring> Gtk::property_custom_tab_label()’
  2579. Glib::PropertyProxy< Glib::ustring > property_custom_tab_label() ;
  2580. ^~~~~~~~~~~~~~~~~~~~~~~~~
  2581. /usr/include/gtkmm-2.4/gtkmm/printoperation.h:935:69: error: non-member function ‘Glib::PropertyProxy_ReadOnly<bool> Gtk::property_support_selection()’ cannot have cv-qualifier
  2582. Glib::PropertyProxy_ReadOnly< bool > property_support_selection() const;
  2583. ^~~~~
  2584. /usr/include/gtkmm-2.4/gtkmm/printoperation.h:935:40: error: ambiguating new declaration of ‘Glib::PropertyProxy_ReadOnly<bool> Gtk::property_support_selection()’
  2585. Glib::PropertyProxy_ReadOnly< bool > property_support_selection() const;
  2586. ^~~~~~~~~~~~~~~~~~~~~~~~~~
  2587. /usr/include/gtkmm-2.4/gtkmm/printoperation.h:928:31: note: old declaration ‘Glib::PropertyProxy<bool> Gtk::property_support_selection()’
  2588. Glib::PropertyProxy< bool > property_support_selection() ;
  2589. ^~~~~~~~~~~~~~~~~~~~~~~~~~
  2590. /usr/include/gtkmm-2.4/gtkmm/printoperation.h:949:65: error: non-member function ‘Glib::PropertyProxy_ReadOnly<bool> Gtk::property_has_selection()’ cannot have cv-qualifier
  2591. Glib::PropertyProxy_ReadOnly< bool > property_has_selection() const;
  2592. ^~~~~
  2593. /usr/include/gtkmm-2.4/gtkmm/printoperation.h:949:40: error: ambiguating new declaration of ‘Glib::PropertyProxy_ReadOnly<bool> Gtk::property_has_selection()’
  2594. Glib::PropertyProxy_ReadOnly< bool > property_has_selection() const;
  2595. ^~~~~~~~~~~~~~~~~~~~~~
  2596. /usr/include/gtkmm-2.4/gtkmm/printoperation.h:942:31: note: old declaration ‘Glib::PropertyProxy<bool> Gtk::property_has_selection()’
  2597. Glib::PropertyProxy< bool > property_has_selection() ;
  2598. ^~~~~~~~~~~~~~~~~~~~~~
  2599. /usr/include/gtkmm-2.4/gtkmm/printoperation.h:963:68: error: non-member function ‘Glib::PropertyProxy_ReadOnly<bool> Gtk::property_embed_page_setup()’ cannot have cv-qualifier
  2600. Glib::PropertyProxy_ReadOnly< bool > property_embed_page_setup() const;
  2601. ^~~~~
  2602. /usr/include/gtkmm-2.4/gtkmm/printoperation.h:963:40: error: ambiguating new declaration of ‘Glib::PropertyProxy_ReadOnly<bool> Gtk::property_embed_page_setup()’
  2603. Glib::PropertyProxy_ReadOnly< bool > property_embed_page_setup() const;
  2604. ^~~~~~~~~~~~~~~~~~~~~~~~~
  2605. /usr/include/gtkmm-2.4/gtkmm/printoperation.h:956:31: note: old declaration ‘Glib::PropertyProxy<bool> Gtk::property_embed_page_setup()’
  2606. Glib::PropertyProxy< bool > property_embed_page_setup() ;
  2607. ^~~~~~~~~~~~~~~~~~~~~~~~~
  2608. /usr/include/gtkmm-2.4/gtkmm/printoperation.h:970:67: error: non-member function ‘Glib::PropertyProxy_ReadOnly<int> Gtk::property_n_pages_to_print()’ cannot have cv-qualifier
  2609. Glib::PropertyProxy_ReadOnly< int > property_n_pages_to_print() const;
  2610. ^~~~~
  2611. /usr/include/gtkmm-2.4/gtkmm/printoperation.h:973:1: error: expected unqualified-id before ‘public’
  2612. public:
  2613. ^~~~~~
  2614. /usr/include/gtkmm-2.4/gtkmm/printoperation.h:985:3: error: ‘virtual’ outside class declaration
  2615. virtual void on_begin_print(const Glib::RefPtr<PrintContext>& context);
  2616. ^~~~~~~
  2617. /usr/include/gtkmm-2.4/gtkmm/printoperation.h:987:3: error: ‘virtual’ outside class declaration
  2618. virtual bool on_paginate(const Glib::RefPtr<PrintContext>& context);
  2619. ^~~~~~~
  2620. /usr/include/gtkmm-2.4/gtkmm/printoperation.h:989:3: error: ‘virtual’ outside class declaration
  2621. virtual void on_request_page_setup(const Glib::RefPtr<PrintContext>& context, int page_no, const Glib::RefPtr<PageSetup>& setup);
  2622. ^~~~~~~
  2623. /usr/include/gtkmm-2.4/gtkmm/printoperation.h:991:3: error: ‘virtual’ outside class declaration
  2624. virtual void on_draw_page(const Glib::RefPtr<PrintContext>& context, int page_nr);
  2625. ^~~~~~~
  2626. /usr/include/gtkmm-2.4/gtkmm/printoperation.h:993:3: error: ‘virtual’ outside class declaration
  2627. virtual void on_end_print(const Glib::RefPtr<PrintContext>& context);
  2628. ^~~~~~~
  2629. /usr/include/gtkmm-2.4/gtkmm/printoperation.h:995:3: error: ‘virtual’ outside class declaration
  2630. virtual void on_status_changed();
  2631. ^~~~~~~
  2632. /usr/include/gtkmm-2.4/gtkmm/printoperation.h:997:3: error: ‘virtual’ outside class declaration
  2633. virtual Widget* on_create_custom_widget();
  2634. ^~~~~~~
  2635. /usr/include/gtkmm-2.4/gtkmm/printoperation.h:999:3: error: ‘virtual’ outside class declaration
  2636. virtual void on_custom_widget_apply(Widget* widget);
  2637. ^~~~~~~
  2638. /usr/include/gtkmm-2.4/gtkmm/printoperation.h:1001:3: error: ‘virtual’ outside class declaration
  2639. virtual bool on_preview(const Glib::RefPtr<PrintOperationPreview>& preview, const Glib::RefPtr<PrintContext>& context, Window* parent);
  2640. ^~~~~~~
  2641. /usr/include/gtkmm-2.4/gtkmm/printoperation.h:1026:16: error: ‘PageSetup’ was not declared in this scope
  2642. Glib::RefPtr<PageSetup> run_page_setup_dialog(Window& parent,
  2643. ^~~~~~~~~
  2644. /usr/include/gtkmm-2.4/gtkmm/printoperation.h:1026:16: note: suggested alternative:
  2645. In file included from /usr/include/gtkmm-2.4/gtkmm.h:177:0,
  2646. from arpui.h:24,
  2647. from arpstorage.cc:20:
  2648. /usr/include/gtkmm-2.4/gtkmm/pagesetup.h:62:7: note: ‘Gtk::PageSetup’
  2649. class PageSetup : public Glib::Object
  2650. ^~~~~~~~~
  2651. In file included from /usr/include/gtkmm-2.4/gtkmm/printjob.h:30:0,
  2652. from /usr/include/gtkmm-2.4/gtkmm.h:185,
  2653. from arpui.h:24,
  2654. from arpstorage.cc:20:
  2655. /usr/include/gtkmm-2.4/gtkmm/printoperation.h:1026:25: error: template argument 1 is invalid
  2656. Glib::RefPtr<PageSetup> run_page_setup_dialog(Window& parent,
  2657. ^
  2658. /usr/include/gtkmm-2.4/gtkmm/printoperation.h:1026:49: error: ‘Window’ was not declared in this scope
  2659. Glib::RefPtr<PageSetup> run_page_setup_dialog(Window& parent,
  2660. ^~~~~~
  2661. /usr/include/gtkmm-2.4/gtkmm/printoperation.h:1026:49: note: suggested alternatives:
  2662. In file included from /usr/include/gdkmm-2.4/gdkmm.h:32:0,
  2663. from /usr/include/gtkmm-2.4/gtkmm.h:89,
  2664. from arpui.h:24,
  2665. from arpstorage.cc:20:
  2666. /usr/include/gdkmm-2.4/gdkmm/window.h:707:7: note: ‘Gdk::Window’
  2667. class Window : public Gdk::Drawable
  2668. ^~~~~~
  2669. In file included from /usr/include/gtkmm-2.4/gtkmm/dialog.h:32:0,
  2670. from /usr/include/gtkmm-2.4/gtkmm.h:92,
  2671. from arpui.h:24,
  2672. from arpstorage.cc:20:
  2673. /usr/include/gtkmm-2.4/gtkmm/window.h:158:7: note: ‘Gtk::Window’
  2674. class Window : public Bin
  2675. ^~~~~~
  2676. In file included from /usr/include/gtkmm-2.4/gtkmm/printjob.h:30:0,
  2677. from /usr/include/gtkmm-2.4/gtkmm.h:185,
  2678. from arpui.h:24,
  2679. from arpstorage.cc:20:
  2680. /usr/include/gtkmm-2.4/gtkmm/printoperation.h:1026:57: error: ‘parent’ was not declared in this scope
  2681. Glib::RefPtr<PageSetup> run_page_setup_dialog(Window& parent,
  2682. ^~~~~~
  2683. /usr/include/gtkmm-2.4/gtkmm/printoperation.h:1027:49: error: expected primary-expression before ‘const’
  2684. const Glib::RefPtr<const PageSetup>& page_setup,
  2685. ^~~~~
  2686. /usr/include/gtkmm-2.4/gtkmm/printoperation.h:1028:49: error: expected primary-expression before ‘const’
  2687. const Glib::RefPtr<const PrintSettings>& print_settings);
  2688. ^~~~~
  2689. /usr/include/gtkmm-2.4/gtkmm/printoperation.h:1028:104: error: expression list treated as compound expression in initializer [-fpermissive]
  2690. const Glib::RefPtr<const PrintSettings>& print_settings);
  2691. ^
  2692. /usr/include/gtkmm-2.4/gtkmm/printoperation.h:1043:16: error: ‘PageSetup’ was not declared in this scope
  2693. Glib::RefPtr<PageSetup> run_page_setup_dialog(Window& parent,
  2694. ^~~~~~~~~
  2695. /usr/include/gtkmm-2.4/gtkmm/printoperation.h:1043:16: note: suggested alternative:
  2696. In file included from /usr/include/gtkmm-2.4/gtkmm.h:177:0,
  2697. from arpui.h:24,
  2698. from arpstorage.cc:20:
  2699. /usr/include/gtkmm-2.4/gtkmm/pagesetup.h:62:7: note: ‘Gtk::PageSetup’
  2700. class PageSetup : public Glib::Object
  2701. ^~~~~~~~~
  2702. In file included from /usr/include/gtkmm-2.4/gtkmm/printjob.h:30:0,
  2703. from /usr/include/gtkmm-2.4/gtkmm.h:185,
  2704. from arpui.h:24,
  2705. from arpstorage.cc:20:
  2706. /usr/include/gtkmm-2.4/gtkmm/printoperation.h:1043:25: error: template argument 1 is invalid
  2707. Glib::RefPtr<PageSetup> run_page_setup_dialog(Window& parent,
  2708. ^
  2709. /usr/include/gtkmm-2.4/gtkmm/printoperation.h:1043:49: error: redefinition of ‘int run_page_setup_dialog’
  2710. Glib::RefPtr<PageSetup> run_page_setup_dialog(Window& parent,
  2711. ^~~~~~
  2712. /usr/include/gtkmm-2.4/gtkmm/printoperation.h:1026:27: note: ‘int run_page_setup_dialog’ previously defined here
  2713. Glib::RefPtr<PageSetup> run_page_setup_dialog(Window& parent,
  2714. ^~~~~~~~~~~~~~~~~~~~~
  2715. /usr/include/gtkmm-2.4/gtkmm/printoperation.h:1043:49: error: ‘Window’ was not declared in this scope
  2716. Glib::RefPtr<PageSetup> run_page_setup_dialog(Window& parent,
  2717. ^~~~~~
  2718. /usr/include/gtkmm-2.4/gtkmm/printoperation.h:1043:49: note: suggested alternatives:
  2719. In file included from /usr/include/gdkmm-2.4/gdkmm.h:32:0,
  2720. from /usr/include/gtkmm-2.4/gtkmm.h:89,
  2721. from arpui.h:24,
  2722. from arpstorage.cc:20:
  2723. /usr/include/gdkmm-2.4/gdkmm/window.h:707:7: note: ‘Gdk::Window’
  2724. class Window : public Gdk::Drawable
  2725. ^~~~~~
  2726. In file included from /usr/include/gtkmm-2.4/gtkmm/dialog.h:32:0,
  2727. from /usr/include/gtkmm-2.4/gtkmm.h:92,
  2728. from arpui.h:24,
  2729. from arpstorage.cc:20:
  2730. /usr/include/gtkmm-2.4/gtkmm/window.h:158:7: note: ‘Gtk::Window’
  2731. class Window : public Bin
  2732. ^~~~~~
  2733. In file included from /usr/include/gtkmm-2.4/gtkmm/printjob.h:30:0,
  2734. from /usr/include/gtkmm-2.4/gtkmm.h:185,
  2735. from arpui.h:24,
  2736. from arpstorage.cc:20:
  2737. /usr/include/gtkmm-2.4/gtkmm/printoperation.h:1043:57: error: ‘parent’ was not declared in this scope
  2738. Glib::RefPtr<PageSetup> run_page_setup_dialog(Window& parent,
  2739. ^~~~~~
  2740. /usr/include/gtkmm-2.4/gtkmm/printoperation.h:1044:49: error: expected primary-expression before ‘const’
  2741. const Glib::RefPtr<const PrintSettings>& print_settings);
  2742. ^~~~~
  2743. /usr/include/gtkmm-2.4/gtkmm/printoperation.h:1049:48: error: ‘PageSetup’ was not declared in this scope
  2744. typedef sigc::slot< void, const Glib::RefPtr<PageSetup>& > SlotPrintSetupDone;
  2745. ^~~~~~~~~
  2746. /usr/include/gtkmm-2.4/gtkmm/printoperation.h:1049:48: note: suggested alternative:
  2747. In file included from /usr/include/gtkmm-2.4/gtkmm.h:177:0,
  2748. from arpui.h:24,
  2749. from arpstorage.cc:20:
  2750. /usr/include/gtkmm-2.4/gtkmm/pagesetup.h:62:7: note: ‘Gtk::PageSetup’
  2751. class PageSetup : public Glib::Object
  2752. ^~~~~~~~~
  2753. In file included from /usr/include/gtkmm-2.4/gtkmm/printjob.h:30:0,
  2754. from /usr/include/gtkmm-2.4/gtkmm.h:185,
  2755. from arpui.h:24,
  2756. from arpstorage.cc:20:
  2757. /usr/include/gtkmm-2.4/gtkmm/printoperation.h:1049:57: error: template argument 1 is invalid
  2758. typedef sigc::slot< void, const Glib::RefPtr<PageSetup>& > SlotPrintSetupDone;
  2759. ^
  2760. /usr/include/gtkmm-2.4/gtkmm/printoperation.h:1049:60: error: template argument 2 is invalid
  2761. typedef sigc::slot< void, const Glib::RefPtr<PageSetup>& > SlotPrintSetupDone;
  2762. ^
  2763. /usr/include/gtkmm-2.4/gtkmm/printoperation.h:1065:36: error: variable or field ‘run_page_setup_dialog_async’ declared void
  2764. void run_page_setup_dialog_async(Window& parent,
  2765. ^~~~~~
  2766. /usr/include/gtkmm-2.4/gtkmm/printoperation.h:1065:36: error: ‘Window’ was not declared in this scope
  2767. /usr/include/gtkmm-2.4/gtkmm/printoperation.h:1065:36: note: suggested alternatives:
  2768. In file included from /usr/include/gdkmm-2.4/gdkmm.h:32:0,
  2769. from /usr/include/gtkmm-2.4/gtkmm.h:89,
  2770. from arpui.h:24,
  2771. from arpstorage.cc:20:
  2772. /usr/include/gdkmm-2.4/gdkmm/window.h:707:7: note: ‘Gdk::Window’
  2773. class Window : public Gdk::Drawable
  2774. ^~~~~~
  2775. In file included from /usr/include/gtkmm-2.4/gtkmm/dialog.h:32:0,
  2776. from /usr/include/gtkmm-2.4/gtkmm.h:92,
  2777. from arpui.h:24,
  2778. from arpstorage.cc:20:
  2779. /usr/include/gtkmm-2.4/gtkmm/window.h:158:7: note: ‘Gtk::Window’
  2780. class Window : public Bin
  2781. ^~~~~~
  2782. In file included from /usr/include/gtkmm-2.4/gtkmm/printjob.h:30:0,
  2783. from /usr/include/gtkmm-2.4/gtkmm.h:185,
  2784. from arpui.h:24,
  2785. from arpstorage.cc:20:
  2786. /usr/include/gtkmm-2.4/gtkmm/printoperation.h:1065:44: error: ‘parent’ was not declared in this scope
  2787. void run_page_setup_dialog_async(Window& parent,
  2788. ^~~~~~
  2789. /usr/include/gtkmm-2.4/gtkmm/printoperation.h:1066:36: error: expected primary-expression before ‘const’
  2790. const Glib::RefPtr<const PageSetup>& page_setup,
  2791. ^~~~~
  2792. /usr/include/gtkmm-2.4/gtkmm/printoperation.h:1067:36: error: expected primary-expression before ‘const’
  2793. const Glib::RefPtr<const PrintSettings>& print_settings,
  2794. ^~~~~
  2795. /usr/include/gtkmm-2.4/gtkmm/printoperation.h:1068:36: error: expected primary-expression before ‘const’
  2796. const SlotPrintSetupDone& slot);
  2797. ^~~~~
  2798. /usr/include/gtkmm-2.4/gtkmm/printoperation.h:1084:36: error: variable or field ‘run_page_setup_dialog_async’ declared void
  2799. void run_page_setup_dialog_async(Window& parent,
  2800. ^~~~~~
  2801. /usr/include/gtkmm-2.4/gtkmm/printoperation.h:1084:36: error: ‘Window’ was not declared in this scope
  2802. /usr/include/gtkmm-2.4/gtkmm/printoperation.h:1084:36: note: suggested alternatives:
  2803. In file included from /usr/include/gdkmm-2.4/gdkmm.h:32:0,
  2804. from /usr/include/gtkmm-2.4/gtkmm.h:89,
  2805. from arpui.h:24,
  2806. from arpstorage.cc:20:
  2807. /usr/include/gdkmm-2.4/gdkmm/window.h:707:7: note: ‘Gdk::Window’
  2808. class Window : public Gdk::Drawable
  2809. ^~~~~~
  2810. In file included from /usr/include/gtkmm-2.4/gtkmm/dialog.h:32:0,
  2811. from /usr/include/gtkmm-2.4/gtkmm.h:92,
  2812. from arpui.h:24,
  2813. from arpstorage.cc:20:
  2814. /usr/include/gtkmm-2.4/gtkmm/window.h:158:7: note: ‘Gtk::Window’
  2815. class Window : public Bin
  2816. ^~~~~~
  2817. In file included from /usr/include/gtkmm-2.4/gtkmm/printjob.h:30:0,
  2818. from /usr/include/gtkmm-2.4/gtkmm.h:185,
  2819. from arpui.h:24,
  2820. from arpstorage.cc:20:
  2821. /usr/include/gtkmm-2.4/gtkmm/printoperation.h:1084:44: error: ‘parent’ was not declared in this scope
  2822. void run_page_setup_dialog_async(Window& parent,
  2823. ^~~~~~
  2824. /usr/include/gtkmm-2.4/gtkmm/printoperation.h:1085:36: error: expected primary-expression before ‘const’
  2825. const Glib::RefPtr<const PrintSettings>& print_settings,
  2826. ^~~~~
  2827. /usr/include/gtkmm-2.4/gtkmm/printoperation.h:1086:36: error: expected primary-expression before ‘const’
  2828. const SlotPrintSetupDone& slot);
  2829. ^~~~~
  2830. /usr/include/gtkmm-2.4/gtkmm/printoperation.h:1088:1: error: expected declaration before ‘}’ token
  2831. } // namespace Gtk
  2832. ^
  2833. make[2]: *** [Makefile:409: arpui.o] Error 1
  2834. make[2]: *** [Makefile:409: main.o] Error 1
  2835. make[2]: *** [Makefile:409: arpstorage.o] Error 1
  2836. make[1]: *** [Makefile:388: all-recursive] Error 1
  2837. make: *** [Makefile:297: all] Error 2
  2838. ==> ERROR: A failure occurred in build().
  2839. Aborting...
RAW Paste Data