Siqua

Fink gcc build error

Apr 20th, 2019
193
Never
Not a member of Pastebin yet? Sign Up, it unlocks many cool features!
  1. make[5]: Leaving directory '/sw/src/fink.build/gcc8-8.3.0-101/darwin_objdir/x86_64-apple-darwin18.5.0/libgomp'
  2. make[4]: Leaving directory '/sw/src/fink.build/gcc8-8.3.0-101/darwin_objdir/x86_64-apple-darwin18.5.0/libgomp'
  3. make[3]: Leaving directory '/sw/src/fink.build/gcc8-8.3.0-101/darwin_objdir/x86_64-apple-darwin18.5.0/libgomp'
  4. make[2]: Leaving directory '/sw/src/fink.build/gcc8-8.3.0-101/darwin_objdir'
  5. make "DESTDIR=" "RPATH_ENVVAR=DYLD_LIBRARY_PATH" "TARGET_SUBDIR=x86_64-apple-darwin18.5.0" "bindir=/sw/lib/gcc8/bin" "datadir=/sw/lib/gcc8/share" "exec_prefix=/sw/lib/gcc8" "includedir=/sw/lib/gcc8/include" "datarootdir=/sw/lib/gcc8/share" "docdir=/sw/lib/gcc8/share/doc/" "infodir=/sw/lib/gcc8/info" "pdfdir=/sw/lib/gcc8/share/doc/" "htmldir=/sw/lib/gcc8/share/doc/" "libdir=/sw/lib/gcc8/lib" "libexecdir=/sw/lib/gcc8/libexec" "lispdir=" "localstatedir=/sw/lib/gcc8/var" "mandir=/sw/share/man" "oldincludedir=/usr/include" "prefix=/sw/lib/gcc8" "sbindir=/sw/lib/gcc8/sbin" "sharedstatedir=/sw/lib/gcc8/com" "sysconfdir=/sw/lib/gcc8/etc" "tooldir=/sw/lib/gcc8/x86_64-apple-darwin18.5.0" "build_tooldir=/sw/lib/gcc8/x86_64-apple-darwin18.5.0" "target_alias=x86_64-apple-darwin18.5.0" "AWK=gawk" "BISON=bison" "CC_FOR_BUILD=gcc" "CFLAGS_FOR_BUILD=-g -O2" "CXX_FOR_BUILD=g++ -std=gnu++98" "EXPECT=expect" "FLEX=flex" "INSTALL=/sw/bin/ginstall -c" "INSTALL_DATA=/sw/bin/ginstall -c -m 644" "INSTALL_PROGRAM=/sw/bin/ginstall -c" "INSTALL_SCRIPT=/sw/bin/ginstall -c" "LDFLAGS_FOR_BUILD=" "LEX=flex" "M4=gm4" "MAKE=make" "RUNTEST=runtest" "RUNTESTFLAGS=" "SED=/sw/bin/sed" "SHELL=/bin/sh" "YACC=bison -y" "`echo 'ADAFLAGS=' | sed -e s'/[^=][^=]*=$/XFOO=/'`" "ADA_CFLAGS=" "AR_FLAGS=rc" "`echo 'BOOT_ADAFLAGS=-gnatpg' | sed -e s'/[^=][^=]*=$/XFOO=/'`" "BOOT_CFLAGS=-g -O2 " "BOOT_LDFLAGS=-Wl,-no_pie" "CFLAGS=-g -O2" "CXXFLAGS=-g -O2" "LDFLAGS=" "LIBCFLAGS=-g -O2" "LIBCXXFLAGS=-g -O2 -fno-implicit-templates" "STAGE1_CHECKING=--enable-checking=yes,types" "STAGE1_LANGUAGES=c,c++,lto" "GNATBIND=no" "GNATMAKE=no" "AR_FOR_TARGET=ar" "AS_FOR_TARGET=as" "CC_FOR_TARGET=/sw/src/fink.build/gcc8-8.3.0-101/darwin_objdir/./gcc/xgcc -B/sw/src/fink.build/gcc8-8.3.0-101/darwin_objdir/./gcc/" "CFLAGS_FOR_TARGET=-g -O2 " "CPPFLAGS_FOR_TARGET=" "CXXFLAGS_FOR_TARGET=-g -O2 " "DLLTOOL_FOR_TARGET=dlltool" "FLAGS_FOR_TARGET=-B/sw/lib/gcc8/x86_64-apple-darwin18.5.0/bin/ -B/sw/lib/gcc8/x86_64-apple-darwin18.5.0/lib/ -isystem /sw/lib/gcc8/x86_64-apple-darwin18.5.0/include -isystem /sw/lib/gcc8/x86_64-apple-darwin18.5.0/sys-include" "GFORTRAN_FOR_TARGET=/sw/src/fink.build/gcc8-8.3.0-101/darwin_objdir/./gcc/gfortran -B/sw/src/fink.build/gcc8-8.3.0-101/darwin_objdir/./gcc/" "GOC_FOR_TARGET=" "GOCFLAGS_FOR_TARGET=-O2 -g" "LD_FOR_TARGET=/Applications/Xcode.app/Contents/Developer/Toolchains/XcodeDefault.xctoolchain/usr/bin/ld" "LIPO_FOR_TARGET=lipo" "LDFLAGS_FOR_TARGET=" "LIBCFLAGS_FOR_TARGET=-g -O2 " "LIBCXXFLAGS_FOR_TARGET=-g -O2  -fno-implicit-templates" "NM_FOR_TARGET=nm" "OBJDUMP_FOR_TARGET=objdump" "OBJCOPY_FOR_TARGET=" "RANLIB_FOR_TARGET=ranlib" "READELF_FOR_TARGET=readelf" "STRIP_FOR_TARGET=strip" "WINDRES_FOR_TARGET=windres" "WINDMC_FOR_TARGET=windmc" "BUILD_CONFIG=bootstrap-debug" "`echo 'LANGUAGES=' | sed -e s'/[^=][^=]*=$/XFOO=/'`" "LEAN=false" "STAGE1_CFLAGS=-g " "STAGE1_CXXFLAGS=-g " "STAGE1_TFLAGS=" "STAGE2_CFLAGS=-g -O2   -gtoggle" "STAGE2_CXXFLAGS=-g -O2   -gtoggle" "STAGE2_TFLAGS=" "STAGE3_CFLAGS=-g -O2  " "STAGE3_CXXFLAGS=-g -O2  " "STAGE3_TFLAGS=" "STAGE4_CFLAGS=-g -O2  " "STAGE4_CXXFLAGS=-g -O2  " "STAGE4_TFLAGS=" "STAGEprofile_CFLAGS=-g -O2   -gtoggle -fprofile-generate" "STAGEprofile_CXXFLAGS=-g -O2   -gtoggle -fprofile-generate" "STAGEprofile_TFLAGS=" "STAGEtrain_CFLAGS=-g -O2  " "STAGEtrain_CXXFLAGS=-g -O2  " "STAGEtrain_TFLAGS=" "STAGEfeedback_CFLAGS=-g -O2   -fprofile-use" "STAGEfeedback_CXXFLAGS=-g -O2   -fprofile-use" "STAGEfeedback_TFLAGS=" "STAGEautoprofile_CFLAGS=-g -O2   -gtoggle -g" "STAGEautoprofile_CXXFLAGS=-g -O2   -gtoggle -g" "STAGEautoprofile_TFLAGS=" "STAGEautofeedback_CFLAGS=-g -O2  " "STAGEautofeedback_CXXFLAGS=-g -O2  " "STAGEautofeedback_TFLAGS=" "CXX_FOR_TARGET= $r/./gcc/xg++ -B$r/./gcc/ -nostdinc++ `if test -f $r/x86_64-apple-darwin18.5.0/libstdc++-v3/scripts/testsuite_flags; then /bin/sh $r/x86_64-apple-darwin18.5.0/libstdc++-v3/scripts/testsuite_flags --build-includes; else echo -funconfigured-libstdc++-v3 ; fi` -L$r/x86_64-apple-darwin18.5.0/libstdc++-v3/src -L$r/x86_64-apple-darwin18.5.0/libstdc++-v3/src/.libs -L$r/x86_64-apple-darwin18.5.0/libstdc++-v3/libsupc++/.libs" "TFLAGS=" "CONFIG_SHELL=/bin/sh" "MAKEINFO=makeinfo --split-size=5000000 --split-size=5000000"  compare
  6. make[2]: Entering directory '/sw/src/fink.build/gcc8-8.3.0-101/darwin_objdir'
  7. make[3]: Entering directory '/sw/src/fink.build/gcc8-8.3.0-101/darwin_objdir'
  8. rm -f stage_current
  9. make[3]: Leaving directory '/sw/src/fink.build/gcc8-8.3.0-101/darwin_objdir'
  10. Comparing stages 2 and 3
  11. warning: gcc/cc1obj-checksum.o differs
  12. warning: gcc/cc1objplus-checksum.o differs
  13. Comparison successful.
  14. if false; then \
  15.   rm -rf stage2-*; \
  16.   echo timestamp >  stage2-lean; \
  17. fi
  18. make[2]: Leaving directory '/sw/src/fink.build/gcc8-8.3.0-101/darwin_objdir'
  19. make[1]: Leaving directory '/sw/src/fink.build/gcc8-8.3.0-101/darwin_objdir'
  20. make[1]: Entering directory '/sw/src/fink.build/gcc8-8.3.0-101/darwin_objdir'
  21. make[1]: Leaving directory '/sw/src/fink.build/gcc8-8.3.0-101/darwin_objdir'
  22. make[1]: Entering directory '/sw/src/fink.build/gcc8-8.3.0-101/darwin_objdir'
  23. Configuring in ./fixincludes
  24. configure: creating cache ./config.cache
  25. checking build system type... x86_64-apple-darwin18.5.0
  26. checking host system type... x86_64-apple-darwin18.5.0
  27. checking target system type... x86_64-apple-darwin18.5.0
  28. checking for x86_64-apple-darwin18.5.0-gcc... /sw/src/fink.build/gcc8-8.3.0-101/darwin_objdir/./gcc/xgcc -B/sw/src/fink.build/gcc8-8.3.0-101/darwin_objdir/./gcc/ -B/sw/lib/gcc8/x86_64-apple-darwin18.5.0/bin/ -B/sw/lib/gcc8/x86_64-apple-darwin18.5.0/lib/ -isystem /sw/lib/gcc8/x86_64-apple-darwin18.5.0/include -isystem /sw/lib/gcc8/x86_64-apple-darwin18.5.0/sys-include  
  29. checking for C compiler default output file name... a.out
  30. checking whether the C compiler works... yes
  31. checking whether we are cross compiling... no
  32. checking for suffix of executables...
  33. checking for suffix of object files... o
  34. checking whether we are using the GNU C compiler... yes
  35. checking whether /sw/src/fink.build/gcc8-8.3.0-101/darwin_objdir/./gcc/xgcc -B/sw/src/fink.build/gcc8-8.3.0-101/darwin_objdir/./gcc/ -B/sw/lib/gcc8/x86_64-apple-darwin18.5.0/bin/ -B/sw/lib/gcc8/x86_64-apple-darwin18.5.0/lib/ -isystem /sw/lib/gcc8/x86_64-apple-darwin18.5.0/include -isystem /sw/lib/gcc8/x86_64-apple-darwin18.5.0/sys-include    accepts -g... yes
  36. checking for /sw/src/fink.build/gcc8-8.3.0-101/darwin_objdir/./gcc/xgcc -B/sw/src/fink.build/gcc8-8.3.0-101/darwin_objdir/./gcc/ -B/sw/lib/gcc8/x86_64-apple-darwin18.5.0/bin/ -B/sw/lib/gcc8/x86_64-apple-darwin18.5.0/lib/ -isystem /sw/lib/gcc8/x86_64-apple-darwin18.5.0/include -isystem /sw/lib/gcc8/x86_64-apple-darwin18.5.0/sys-include    option to accept ISO C89... none needed
  37. checking how to run the C preprocessor... /sw/src/fink.build/gcc8-8.3.0-101/darwin_objdir/./gcc/xgcc -B/sw/src/fink.build/gcc8-8.3.0-101/darwin_objdir/./gcc/ -B/sw/lib/gcc8/x86_64-apple-darwin18.5.0/bin/ -B/sw/lib/gcc8/x86_64-apple-darwin18.5.0/lib/ -isystem /sw/lib/gcc8/x86_64-apple-darwin18.5.0/include -isystem /sw/lib/gcc8/x86_64-apple-darwin18.5.0/sys-include    -E
  38. checking for grep that handles long lines and -e... /usr/bin/grep
  39. checking for egrep... /usr/bin/grep -E
  40. checking for ANSI C header files... rm: conftest.dSYM: is a directory
  41. rm: conftest.dSYM: is a directory
  42. yes
  43. checking for sys/types.h... yes
  44. checking for sys/stat.h... yes
  45. checking for stdlib.h... yes
  46. checking for string.h... yes
  47. checking for memory.h... yes
  48. checking for strings.h... yes
  49. checking for inttypes.h... yes
  50. checking for stdint.h... yes
  51. checking for unistd.h... yes
  52. checking minix/config.h usability... no
  53. checking minix/config.h presence... no
  54. checking for minix/config.h... no
  55. checking whether it is safe to define __EXTENSIONS__... yes
  56. checking for a sed that does not truncate output... /sw/bin/sed
  57. checking whether /sw/src/fink.build/gcc8-8.3.0-101/darwin_objdir/./gcc/xgcc -B/sw/src/fink.build/gcc8-8.3.0-101/darwin_objdir/./gcc/ -B/sw/lib/gcc8/x86_64-apple-darwin18.5.0/bin/ -B/sw/lib/gcc8/x86_64-apple-darwin18.5.0/lib/ -isystem /sw/lib/gcc8/x86_64-apple-darwin18.5.0/include -isystem /sw/lib/gcc8/x86_64-apple-darwin18.5.0/sys-include    supports -W... yes
  58. checking whether /sw/src/fink.build/gcc8-8.3.0-101/darwin_objdir/./gcc/xgcc -B/sw/src/fink.build/gcc8-8.3.0-101/darwin_objdir/./gcc/ -B/sw/lib/gcc8/x86_64-apple-darwin18.5.0/bin/ -B/sw/lib/gcc8/x86_64-apple-darwin18.5.0/lib/ -isystem /sw/lib/gcc8/x86_64-apple-darwin18.5.0/include -isystem /sw/lib/gcc8/x86_64-apple-darwin18.5.0/sys-include    supports -Wall... yes
  59. checking whether /sw/src/fink.build/gcc8-8.3.0-101/darwin_objdir/./gcc/xgcc -B/sw/src/fink.build/gcc8-8.3.0-101/darwin_objdir/./gcc/ -B/sw/lib/gcc8/x86_64-apple-darwin18.5.0/bin/ -B/sw/lib/gcc8/x86_64-apple-darwin18.5.0/lib/ -isystem /sw/lib/gcc8/x86_64-apple-darwin18.5.0/include -isystem /sw/lib/gcc8/x86_64-apple-darwin18.5.0/sys-include    supports -Wwrite-strings... yes
  60. checking whether /sw/src/fink.build/gcc8-8.3.0-101/darwin_objdir/./gcc/xgcc -B/sw/src/fink.build/gcc8-8.3.0-101/darwin_objdir/./gcc/ -B/sw/lib/gcc8/x86_64-apple-darwin18.5.0/bin/ -B/sw/lib/gcc8/x86_64-apple-darwin18.5.0/lib/ -isystem /sw/lib/gcc8/x86_64-apple-darwin18.5.0/include -isystem /sw/lib/gcc8/x86_64-apple-darwin18.5.0/sys-include    supports -Wstrict-prototypes... yes
  61. checking whether /sw/src/fink.build/gcc8-8.3.0-101/darwin_objdir/./gcc/xgcc -B/sw/src/fink.build/gcc8-8.3.0-101/darwin_objdir/./gcc/ -B/sw/lib/gcc8/x86_64-apple-darwin18.5.0/bin/ -B/sw/lib/gcc8/x86_64-apple-darwin18.5.0/lib/ -isystem /sw/lib/gcc8/x86_64-apple-darwin18.5.0/include -isystem /sw/lib/gcc8/x86_64-apple-darwin18.5.0/sys-include    supports -Wmissing-prototypes... yes
  62. checking whether /sw/src/fink.build/gcc8-8.3.0-101/darwin_objdir/./gcc/xgcc -B/sw/src/fink.build/gcc8-8.3.0-101/darwin_objdir/./gcc/ -B/sw/lib/gcc8/x86_64-apple-darwin18.5.0/bin/ -B/sw/lib/gcc8/x86_64-apple-darwin18.5.0/lib/ -isystem /sw/lib/gcc8/x86_64-apple-darwin18.5.0/include -isystem /sw/lib/gcc8/x86_64-apple-darwin18.5.0/sys-include    supports -Wold-style-definition... yes
  63. checking whether /sw/src/fink.build/gcc8-8.3.0-101/darwin_objdir/./gcc/xgcc -B/sw/src/fink.build/gcc8-8.3.0-101/darwin_objdir/./gcc/ -B/sw/lib/gcc8/x86_64-apple-darwin18.5.0/bin/ -B/sw/lib/gcc8/x86_64-apple-darwin18.5.0/lib/ -isystem /sw/lib/gcc8/x86_64-apple-darwin18.5.0/include -isystem /sw/lib/gcc8/x86_64-apple-darwin18.5.0/sys-include    supports -Wmissing-format-attribute... yes
  64. checking whether /sw/src/fink.build/gcc8-8.3.0-101/darwin_objdir/./gcc/xgcc -B/sw/src/fink.build/gcc8-8.3.0-101/darwin_objdir/./gcc/ -B/sw/lib/gcc8/x86_64-apple-darwin18.5.0/bin/ -B/sw/lib/gcc8/x86_64-apple-darwin18.5.0/lib/ -isystem /sw/lib/gcc8/x86_64-apple-darwin18.5.0/include -isystem /sw/lib/gcc8/x86_64-apple-darwin18.5.0/sys-include    supports -Woverlength-strings... yes
  65. checking whether /sw/src/fink.build/gcc8-8.3.0-101/darwin_objdir/./gcc/xgcc -B/sw/src/fink.build/gcc8-8.3.0-101/darwin_objdir/./gcc/ -B/sw/lib/gcc8/x86_64-apple-darwin18.5.0/bin/ -B/sw/lib/gcc8/x86_64-apple-darwin18.5.0/lib/ -isystem /sw/lib/gcc8/x86_64-apple-darwin18.5.0/include -isystem /sw/lib/gcc8/x86_64-apple-darwin18.5.0/sys-include    supports -pedantic -Wlong-long... yes
  66. checking for ANSI C header files... (cached) yes
  67. checking stddef.h usability... yes
  68. checking stddef.h presence... yes
  69. checking for stddef.h... yes
  70. checking for stdlib.h... (cached) yes
  71. checking for strings.h... (cached) yes
  72. checking for unistd.h... (cached) yes
  73. checking fcntl.h usability... yes
  74. checking fcntl.h presence... yes
  75. checking for fcntl.h... yes
  76. checking sys/file.h usability... yes
  77. checking sys/file.h presence... yes
  78. checking for sys/file.h... yes
  79. checking for sys/stat.h... (cached) yes
  80. checking for clearerr_unlocked... yes
  81. checking for feof_unlocked... yes
  82. checking for ferror_unlocked... yes
  83. checking for fflush_unlocked... no
  84. checking for fgetc_unlocked... no
  85. checking for fgets_unlocked... no
  86. checking for fileno_unlocked... yes
  87. checking for fprintf_unlocked... no
  88. checking for fputc_unlocked... no
  89. checking for fputs_unlocked... no
  90. checking for fread_unlocked... no
  91. checking for fwrite_unlocked... no
  92. checking for getchar_unlocked... yes
  93. checking for getc_unlocked... yes
  94. checking for putchar_unlocked... yes
  95. checking for putc_unlocked... yes
  96. checking whether abort is declared... yes
  97. checking whether asprintf is declared... yes
  98. checking whether basename is declared... no
  99. checking whether errno is declared... no
  100. checking whether vasprintf is declared... yes
  101. checking whether clearerr_unlocked is declared... yes
  102. checking whether feof_unlocked is declared... yes
  103. checking whether ferror_unlocked is declared... yes
  104. checking whether fflush_unlocked is declared... no
  105. checking whether fgetc_unlocked is declared... no
  106. checking whether fgets_unlocked is declared... no
  107. checking whether fileno_unlocked is declared... yes
  108. checking whether fprintf_unlocked is declared... no
  109. checking whether fputc_unlocked is declared... no
  110. checking whether fputs_unlocked is declared... no
  111. checking whether fread_unlocked is declared... no
  112. checking whether fwrite_unlocked is declared... no
  113. checking whether getchar_unlocked is declared... yes
  114. checking whether getc_unlocked is declared... yes
  115. checking whether putchar_unlocked is declared... yes
  116. checking whether putc_unlocked is declared... yes
  117. checking for an ANSI C-conforming const... yes
  118. checking sys/mman.h usability... yes
  119. checking sys/mman.h presence... yes
  120. checking for sys/mman.h... yes
  121. checking for mmap... yes
  122. checking whether read-only mmap of a plain file works... yes
  123. checking whether mmap from /dev/zero works... no
  124. checking for MAP_ANON(YMOUS)... yes
  125. checking whether mmap with MAP_ANON(YMOUS) works... yes
  126. checking whether to enable maintainer-specific portions of Makefiles... no
  127. configure: updating cache ./config.cache
  128. configure: creating ./config.status
  129. config.status: creating Makefile
  130. config.status: creating mkheaders.almost
  131. config.status: creating config.h
  132. make[2]: Entering directory '/sw/src/fink.build/gcc8-8.3.0-101/darwin_objdir/libiberty'
  133. rm -f ./libiberty.a pic/./libiberty.a noasan/./libiberty.a
  134. ar rc ./libiberty.a \
  135.   ./regex.o ./cplus-dem.o ./cp-demangle.o ./md5.o ./sha1.o ./alloca.o ./argv.o ./choose-temp.o ./concat.o ./cp-demint.o ./crc32.o ./d-demangle.o ./dwarfnames.o ./dyn-string.o ./fdmatch.o ./fibheap.o ./filename_cmp.o ./floatformat.o ./fnmatch.o ./fopen_unlocked.o ./getopt.o ./getopt1.o ./getpwd.o ./getruntime.o ./hashtab.o ./hex.o ./lbasename.o ./lrealpath.o ./make-relative-prefix.o ./make-temp-file.o ./objalloc.o ./obstack.o ./partition.o ./pexecute.o ./physmem.o ./pex-common.o ./pex-one.o ./pex-unix.o ./vprintf-support.o ./rust-demangle.o ./safe-ctype.o ./simple-object.o ./simple-object-coff.o ./simple-object-elf.o ./simple-object-mach-o.o ./simple-object-xcoff.o ./sort.o ./spaces.o ./splay-tree.o ./stack-limit.o ./strerror.o ./strsignal.o ./timeval-utils.o ./unlink-if-ordinary.o ./xasprintf.o ./xatexit.o ./xexit.o ./xmalloc.o ./xmemdup.o ./xstrdup.o ./xstrerror.o ./xstrndup.o ./xvasprintf.o  ./mempcpy.o ./strverscmp.o ./setproctitle.o
  136. ranlib ./libiberty.a
  137. if [ x"-fno-common" != x ]; then \
  138.   cd pic; \
  139.   ar rc ./libiberty.a \
  140.     ./regex.o ./cplus-dem.o ./cp-demangle.o ./md5.o ./sha1.o ./alloca.o ./argv.o ./choose-temp.o ./concat.o ./cp-demint.o ./crc32.o ./d-demangle.o ./dwarfnames.o ./dyn-string.o ./fdmatch.o ./fibheap.o ./filename_cmp.o ./floatformat.o ./fnmatch.o ./fopen_unlocked.o ./getopt.o ./getopt1.o ./getpwd.o ./getruntime.o ./hashtab.o ./hex.o ./lbasename.o ./lrealpath.o ./make-relative-prefix.o ./make-temp-file.o ./objalloc.o ./obstack.o ./partition.o ./pexecute.o ./physmem.o ./pex-common.o ./pex-one.o ./pex-unix.o ./vprintf-support.o ./rust-demangle.o ./safe-ctype.o ./simple-object.o ./simple-object-coff.o ./simple-object-elf.o ./simple-object-mach-o.o ./simple-object-xcoff.o ./sort.o ./spaces.o ./splay-tree.o ./stack-limit.o ./strerror.o ./strsignal.o ./timeval-utils.o ./unlink-if-ordinary.o ./xasprintf.o ./xatexit.o ./xexit.o ./xmalloc.o ./xmemdup.o ./xstrdup.o ./xstrerror.o ./xstrndup.o ./xvasprintf.o  ./mempcpy.o ./strverscmp.o ./setproctitle.o; \
  141.   ranlib ./libiberty.a; \
  142.   cd ..; \
  143. else true; fi; \
  144. if [ x"" != x ]; then \
  145.   cd noasan; \
  146.   ar rc ./libiberty.a \
  147.     ./regex.o ./cplus-dem.o ./cp-demangle.o ./md5.o ./sha1.o ./alloca.o ./argv.o ./choose-temp.o ./concat.o ./cp-demint.o ./crc32.o ./d-demangle.o ./dwarfnames.o ./dyn-string.o ./fdmatch.o ./fibheap.o ./filename_cmp.o ./floatformat.o ./fnmatch.o ./fopen_unlocked.o ./getopt.o ./getopt1.o ./getpwd.o ./getruntime.o ./hashtab.o ./hex.o ./lbasename.o ./lrealpath.o ./make-relative-prefix.o ./make-temp-file.o ./objalloc.o ./obstack.o ./partition.o ./pexecute.o ./physmem.o ./pex-common.o ./pex-one.o ./pex-unix.o ./vprintf-support.o ./rust-demangle.o ./safe-ctype.o ./simple-object.o ./simple-object-coff.o ./simple-object-elf.o ./simple-object-mach-o.o ./simple-object-xcoff.o ./sort.o ./spaces.o ./splay-tree.o ./stack-limit.o ./strerror.o ./strsignal.o ./timeval-utils.o ./unlink-if-ordinary.o ./xasprintf.o ./xatexit.o ./xexit.o ./xmalloc.o ./xmemdup.o ./xstrdup.o ./xstrerror.o ./xstrndup.o ./xvasprintf.o  ./mempcpy.o ./strverscmp.o ./setproctitle.o; \
  148.   ranlib ./libiberty.a; \
  149.   cd ..; \
  150. else true; fi
  151. make[3]: Entering directory '/sw/src/fink.build/gcc8-8.3.0-101/darwin_objdir/libiberty/testsuite'
  152. make[3]: Nothing to be done for 'all'.
  153. make[3]: Leaving directory '/sw/src/fink.build/gcc8-8.3.0-101/darwin_objdir/libiberty/testsuite'
  154. make[2]: Leaving directory '/sw/src/fink.build/gcc8-8.3.0-101/darwin_objdir/libiberty'
  155. make[2]: Entering directory '/sw/src/fink.build/gcc8-8.3.0-101/darwin_objdir/fixincludes'
  156. /sw/src/fink.build/gcc8-8.3.0-101/darwin_objdir/./gcc/xgcc -B/sw/src/fink.build/gcc8-8.3.0-101/darwin_objdir/./gcc/ -B/sw/lib/gcc8/x86_64-apple-darwin18.5.0/bin/ -B/sw/lib/gcc8/x86_64-apple-darwin18.5.0/lib/ -isystem /sw/lib/gcc8/x86_64-apple-darwin18.5.0/include -isystem /sw/lib/gcc8/x86_64-apple-darwin18.5.0/sys-include    -c -g -O2  -W -Wall -Wwrite-strings -Wstrict-prototypes -Wmissing-prototypes -Wold-style-definition -Wmissing-format-attribute -Wno-overlength-strings -pedantic -Wno-long-long   -DHAVE_CONFIG_H -I. -I../../gcc-8.3.0/fixincludes -I../include -I../../gcc-8.3.0/fixincludes/../include ../../gcc-8.3.0/fixincludes/fixincl.c
  157. /sw/src/fink.build/gcc8-8.3.0-101/darwin_objdir/./gcc/xgcc -B/sw/src/fink.build/gcc8-8.3.0-101/darwin_objdir/./gcc/ -B/sw/lib/gcc8/x86_64-apple-darwin18.5.0/bin/ -B/sw/lib/gcc8/x86_64-apple-darwin18.5.0/lib/ -isystem /sw/lib/gcc8/x86_64-apple-darwin18.5.0/include -isystem /sw/lib/gcc8/x86_64-apple-darwin18.5.0/sys-include    -c -g -O2  -W -Wall -Wwrite-strings -Wstrict-prototypes -Wmissing-prototypes -Wold-style-definition -Wmissing-format-attribute -Wno-overlength-strings -pedantic -Wno-long-long   -DHAVE_CONFIG_H -I. -I../../gcc-8.3.0/fixincludes -I../include -I../../gcc-8.3.0/fixincludes/../include ../../gcc-8.3.0/fixincludes/fixtests.c
  158. /sw/src/fink.build/gcc8-8.3.0-101/darwin_objdir/./gcc/xgcc -B/sw/src/fink.build/gcc8-8.3.0-101/darwin_objdir/./gcc/ -B/sw/lib/gcc8/x86_64-apple-darwin18.5.0/bin/ -B/sw/lib/gcc8/x86_64-apple-darwin18.5.0/lib/ -isystem /sw/lib/gcc8/x86_64-apple-darwin18.5.0/include -isystem /sw/lib/gcc8/x86_64-apple-darwin18.5.0/sys-include    -c -g -O2  -W -Wall -Wwrite-strings -Wstrict-prototypes -Wmissing-prototypes -Wold-style-definition -Wmissing-format-attribute -Wno-overlength-strings -pedantic -Wno-long-long   -DHAVE_CONFIG_H -I. -I../../gcc-8.3.0/fixincludes -I../include -I../../gcc-8.3.0/fixincludes/../include ../../gcc-8.3.0/fixincludes/fixfixes.c
  159. /sw/src/fink.build/gcc8-8.3.0-101/darwin_objdir/./gcc/xgcc -B/sw/src/fink.build/gcc8-8.3.0-101/darwin_objdir/./gcc/ -B/sw/lib/gcc8/x86_64-apple-darwin18.5.0/bin/ -B/sw/lib/gcc8/x86_64-apple-darwin18.5.0/lib/ -isystem /sw/lib/gcc8/x86_64-apple-darwin18.5.0/include -isystem /sw/lib/gcc8/x86_64-apple-darwin18.5.0/sys-include    -c -g -O2  -W -Wall -Wwrite-strings -Wstrict-prototypes -Wmissing-prototypes -Wold-style-definition -Wmissing-format-attribute -Wno-overlength-strings -pedantic -Wno-long-long   -DHAVE_CONFIG_H -I. -I../../gcc-8.3.0/fixincludes -I../include -I../../gcc-8.3.0/fixincludes/../include ../../gcc-8.3.0/fixincludes/server.c
  160. /sw/src/fink.build/gcc8-8.3.0-101/darwin_objdir/./gcc/xgcc -B/sw/src/fink.build/gcc8-8.3.0-101/darwin_objdir/./gcc/ -B/sw/lib/gcc8/x86_64-apple-darwin18.5.0/bin/ -B/sw/lib/gcc8/x86_64-apple-darwin18.5.0/lib/ -isystem /sw/lib/gcc8/x86_64-apple-darwin18.5.0/include -isystem /sw/lib/gcc8/x86_64-apple-darwin18.5.0/sys-include    -c -g -O2  -W -Wall -Wwrite-strings -Wstrict-prototypes -Wmissing-prototypes -Wold-style-definition -Wmissing-format-attribute -Wno-overlength-strings -pedantic -Wno-long-long   -DHAVE_CONFIG_H -I. -I../../gcc-8.3.0/fixincludes -I../include -I../../gcc-8.3.0/fixincludes/../include ../../gcc-8.3.0/fixincludes/procopen.c
  161. /sw/src/fink.build/gcc8-8.3.0-101/darwin_objdir/./gcc/xgcc -B/sw/src/fink.build/gcc8-8.3.0-101/darwin_objdir/./gcc/ -B/sw/lib/gcc8/x86_64-apple-darwin18.5.0/bin/ -B/sw/lib/gcc8/x86_64-apple-darwin18.5.0/lib/ -isystem /sw/lib/gcc8/x86_64-apple-darwin18.5.0/include -isystem /sw/lib/gcc8/x86_64-apple-darwin18.5.0/sys-include    -c -g -O2  -W -Wall -Wwrite-strings -Wstrict-prototypes -Wmissing-prototypes -Wold-style-definition -Wmissing-format-attribute -Wno-overlength-strings -pedantic -Wno-long-long   -DHAVE_CONFIG_H -I. -I../../gcc-8.3.0/fixincludes -I../include -I../../gcc-8.3.0/fixincludes/../include ../../gcc-8.3.0/fixincludes/fixlib.c
  162. /sw/src/fink.build/gcc8-8.3.0-101/darwin_objdir/./gcc/xgcc -B/sw/src/fink.build/gcc8-8.3.0-101/darwin_objdir/./gcc/ -B/sw/lib/gcc8/x86_64-apple-darwin18.5.0/bin/ -B/sw/lib/gcc8/x86_64-apple-darwin18.5.0/lib/ -isystem /sw/lib/gcc8/x86_64-apple-darwin18.5.0/include -isystem /sw/lib/gcc8/x86_64-apple-darwin18.5.0/sys-include    -c -g -O2  -W -Wall -Wwrite-strings -Wstrict-prototypes -Wmissing-prototypes -Wold-style-definition -Wmissing-format-attribute -Wno-overlength-strings -pedantic -Wno-long-long   -DHAVE_CONFIG_H -I. -I../../gcc-8.3.0/fixincludes -I../include -I../../gcc-8.3.0/fixincludes/../include ../../gcc-8.3.0/fixincludes/fixopts.c
  163. /sw/src/fink.build/gcc8-8.3.0-101/darwin_objdir/./gcc/xgcc -B/sw/src/fink.build/gcc8-8.3.0-101/darwin_objdir/./gcc/ -B/sw/lib/gcc8/x86_64-apple-darwin18.5.0/bin/ -B/sw/lib/gcc8/x86_64-apple-darwin18.5.0/lib/ -isystem /sw/lib/gcc8/x86_64-apple-darwin18.5.0/include -isystem /sw/lib/gcc8/x86_64-apple-darwin18.5.0/sys-include    -g -O2  -static-libstdc++ -static-libgcc   -o fixincl fixincl.o fixtests.o fixfixes.o server.o procopen.o fixlib.o fixopts.o ../libiberty/libiberty.a
  164. echo timestamp > full-stamp
  165. srcdir="../../gcc-8.3.0/fixincludes" /bin/sh ../../gcc-8.3.0/fixincludes/mkfixinc.sh x86_64-apple-darwin18.5.0
  166. sed -e 's/@gcc_version@/8.3.0/' < mkheaders.almost > mkheadersT
  167. mv -f mkheadersT mkheaders
  168. make[2]: Leaving directory '/sw/src/fink.build/gcc8-8.3.0-101/darwin_objdir/fixincludes'
  169. mkdir ./libcc1
  170. Configuring in ./libcc1
  171. configure: creating cache ./config.cache
  172. checking build system type... x86_64-apple-darwin18.5.0
  173. checking host system type... x86_64-apple-darwin18.5.0
  174. checking target system type... x86_64-apple-darwin18.5.0
  175. checking for x86_64-apple-darwin18.5.0-gcc... /sw/src/fink.build/gcc8-8.3.0-101/darwin_objdir/./gcc/xgcc -B/sw/src/fink.build/gcc8-8.3.0-101/darwin_objdir/./gcc/ -B/sw/lib/gcc8/x86_64-apple-darwin18.5.0/bin/ -B/sw/lib/gcc8/x86_64-apple-darwin18.5.0/lib/ -isystem /sw/lib/gcc8/x86_64-apple-darwin18.5.0/include -isystem /sw/lib/gcc8/x86_64-apple-darwin18.5.0/sys-include  
  176. checking for C compiler default output file name... a.out
  177. checking whether the C compiler works... yes
  178. checking whether we are cross compiling... no
  179. checking for suffix of executables...
  180. checking for suffix of object files... o
  181. checking whether we are using the GNU C compiler... yes
  182. checking whether /sw/src/fink.build/gcc8-8.3.0-101/darwin_objdir/./gcc/xgcc -B/sw/src/fink.build/gcc8-8.3.0-101/darwin_objdir/./gcc/ -B/sw/lib/gcc8/x86_64-apple-darwin18.5.0/bin/ -B/sw/lib/gcc8/x86_64-apple-darwin18.5.0/lib/ -isystem /sw/lib/gcc8/x86_64-apple-darwin18.5.0/include -isystem /sw/lib/gcc8/x86_64-apple-darwin18.5.0/sys-include    accepts -g... yes
  183. checking for /sw/src/fink.build/gcc8-8.3.0-101/darwin_objdir/./gcc/xgcc -B/sw/src/fink.build/gcc8-8.3.0-101/darwin_objdir/./gcc/ -B/sw/lib/gcc8/x86_64-apple-darwin18.5.0/bin/ -B/sw/lib/gcc8/x86_64-apple-darwin18.5.0/lib/ -isystem /sw/lib/gcc8/x86_64-apple-darwin18.5.0/include -isystem /sw/lib/gcc8/x86_64-apple-darwin18.5.0/sys-include    option to accept ISO C89... none needed
  184. checking how to run the C preprocessor... /sw/src/fink.build/gcc8-8.3.0-101/darwin_objdir/./gcc/xgcc -B/sw/src/fink.build/gcc8-8.3.0-101/darwin_objdir/./gcc/ -B/sw/lib/gcc8/x86_64-apple-darwin18.5.0/bin/ -B/sw/lib/gcc8/x86_64-apple-darwin18.5.0/lib/ -isystem /sw/lib/gcc8/x86_64-apple-darwin18.5.0/include -isystem /sw/lib/gcc8/x86_64-apple-darwin18.5.0/sys-include    -E
  185. checking for grep that handles long lines and -e... /usr/bin/grep
  186. checking for egrep... /usr/bin/grep -E
  187. checking for ANSI C header files... rm: conftest.dSYM: is a directory
  188. rm: conftest.dSYM: is a directory
  189. yes
  190. checking for sys/types.h... yes
  191. checking for sys/stat.h... yes
  192. checking for stdlib.h... yes
  193. checking for string.h... yes
  194. checking for memory.h... yes
  195. checking for strings.h... yes
  196. checking for inttypes.h... yes
  197. checking for stdint.h... yes
  198. checking for unistd.h... yes
  199. checking minix/config.h usability... no
  200. checking minix/config.h presence... no
  201. checking for minix/config.h... no
  202. checking whether it is safe to define __EXTENSIONS__... yes
  203. checking for a BSD-compatible install... /sw/bin/ginstall -c
  204. checking whether build environment is sane... yes
  205. checking for a thread-safe mkdir -p... /sw/bin/gmkdir -p
  206. checking for gawk... gawk
  207. checking whether make sets $(MAKE)... yes
  208. checking for style of include used by make... GNU
  209. checking dependency style of /sw/src/fink.build/gcc8-8.3.0-101/darwin_objdir/./gcc/xgcc -B/sw/src/fink.build/gcc8-8.3.0-101/darwin_objdir/./gcc/ -B/sw/lib/gcc8/x86_64-apple-darwin18.5.0/bin/ -B/sw/lib/gcc8/x86_64-apple-darwin18.5.0/lib/ -isystem /sw/lib/gcc8/x86_64-apple-darwin18.5.0/include -isystem /sw/lib/gcc8/x86_64-apple-darwin18.5.0/sys-include   ... gcc3
  210. checking whether to enable maintainer-specific portions of Makefiles... no
  211. checking how to print strings... printf
  212. checking for a sed that does not truncate output... /sw/bin/sed
  213. checking for fgrep... /usr/bin/grep -F
  214. checking for ld used by /sw/src/fink.build/gcc8-8.3.0-101/darwin_objdir/./gcc/xgcc -B/sw/src/fink.build/gcc8-8.3.0-101/darwin_objdir/./gcc/ -B/sw/lib/gcc8/x86_64-apple-darwin18.5.0/bin/ -B/sw/lib/gcc8/x86_64-apple-darwin18.5.0/lib/ -isystem /sw/lib/gcc8/x86_64-apple-darwin18.5.0/include -isystem /sw/lib/gcc8/x86_64-apple-darwin18.5.0/sys-include   ... /sw/src/fink.build/gcc8-8.3.0-101/darwin_objdir/./gcc/collect-ld
  215. checking if the linker (/sw/src/fink.build/gcc8-8.3.0-101/darwin_objdir/./gcc/collect-ld) is GNU ld... no
  216. checking for BSD- or MS-compatible name lister (nm)... /sw/src/fink.build/gcc8-8.3.0-101/darwin_objdir/./gcc/nm
  217. checking the name lister (/sw/src/fink.build/gcc8-8.3.0-101/darwin_objdir/./gcc/nm) interface... BSD nm
  218. checking whether ln -s works... yes
  219. checking the maximum length of command line arguments... 196608
  220. checking whether the shell understands some XSI constructs... yes
  221. checking whether the shell understands "+="... yes
  222. checking for /sw/src/fink.build/gcc8-8.3.0-101/darwin_objdir/./gcc/collect-ld option to reload object files... -r
  223. checking for x86_64-apple-darwin18.5.0-objdump... objdump
  224. checking how to recognize dependent libraries... pass_all
  225. checking for x86_64-apple-darwin18.5.0-ar... ar
  226. checking for x86_64-apple-darwin18.5.0-strip... no
  227. checking for strip... strip
  228. checking for x86_64-apple-darwin18.5.0-ranlib... ranlib
  229. checking command to parse /sw/src/fink.build/gcc8-8.3.0-101/darwin_objdir/./gcc/nm output from /sw/src/fink.build/gcc8-8.3.0-101/darwin_objdir/./gcc/xgcc -B/sw/src/fink.build/gcc8-8.3.0-101/darwin_objdir/./gcc/ -B/sw/lib/gcc8/x86_64-apple-darwin18.5.0/bin/ -B/sw/lib/gcc8/x86_64-apple-darwin18.5.0/lib/ -isystem /sw/lib/gcc8/x86_64-apple-darwin18.5.0/include -isystem /sw/lib/gcc8/x86_64-apple-darwin18.5.0/sys-include    object... ok
  230. checking for x86_64-apple-darwin18.5.0-dsymutil... no
  231. checking for dsymutil... dsymutil
  232. checking for x86_64-apple-darwin18.5.0-nmedit... no
  233. checking for nmedit... nmedit
  234. checking for x86_64-apple-darwin18.5.0-lipo... no
  235. checking for lipo... lipo
  236. checking for x86_64-apple-darwin18.5.0-otool... no
  237. checking for otool... otool
  238. checking for x86_64-apple-darwin18.5.0-otool64... no
  239. checking for otool64... no
  240. checking for -single_module linker flag... yes
  241. checking for -exported_symbols_list linker flag... yes
  242. checking for -force_load linker flag... no
  243. checking for dlfcn.h... yes
  244. checking for objdir... .libs
  245. checking if /sw/src/fink.build/gcc8-8.3.0-101/darwin_objdir/./gcc/xgcc -B/sw/src/fink.build/gcc8-8.3.0-101/darwin_objdir/./gcc/ -B/sw/lib/gcc8/x86_64-apple-darwin18.5.0/bin/ -B/sw/lib/gcc8/x86_64-apple-darwin18.5.0/lib/ -isystem /sw/lib/gcc8/x86_64-apple-darwin18.5.0/include -isystem /sw/lib/gcc8/x86_64-apple-darwin18.5.0/sys-include    supports -fno-rtti -fno-exceptions... no
  246. checking for /sw/src/fink.build/gcc8-8.3.0-101/darwin_objdir/./gcc/xgcc -B/sw/src/fink.build/gcc8-8.3.0-101/darwin_objdir/./gcc/ -B/sw/lib/gcc8/x86_64-apple-darwin18.5.0/bin/ -B/sw/lib/gcc8/x86_64-apple-darwin18.5.0/lib/ -isystem /sw/lib/gcc8/x86_64-apple-darwin18.5.0/include -isystem /sw/lib/gcc8/x86_64-apple-darwin18.5.0/sys-include    option to produce PIC... -fno-common -DPIC
  247. checking if /sw/src/fink.build/gcc8-8.3.0-101/darwin_objdir/./gcc/xgcc -B/sw/src/fink.build/gcc8-8.3.0-101/darwin_objdir/./gcc/ -B/sw/lib/gcc8/x86_64-apple-darwin18.5.0/bin/ -B/sw/lib/gcc8/x86_64-apple-darwin18.5.0/lib/ -isystem /sw/lib/gcc8/x86_64-apple-darwin18.5.0/include -isystem /sw/lib/gcc8/x86_64-apple-darwin18.5.0/sys-include    PIC flag -fno-common -DPIC works... yes
  248. checking if /sw/src/fink.build/gcc8-8.3.0-101/darwin_objdir/./gcc/xgcc -B/sw/src/fink.build/gcc8-8.3.0-101/darwin_objdir/./gcc/ -B/sw/lib/gcc8/x86_64-apple-darwin18.5.0/bin/ -B/sw/lib/gcc8/x86_64-apple-darwin18.5.0/lib/ -isystem /sw/lib/gcc8/x86_64-apple-darwin18.5.0/include -isystem /sw/lib/gcc8/x86_64-apple-darwin18.5.0/sys-include    static flag -static works... no
  249. checking if /sw/src/fink.build/gcc8-8.3.0-101/darwin_objdir/./gcc/xgcc -B/sw/src/fink.build/gcc8-8.3.0-101/darwin_objdir/./gcc/ -B/sw/lib/gcc8/x86_64-apple-darwin18.5.0/bin/ -B/sw/lib/gcc8/x86_64-apple-darwin18.5.0/lib/ -isystem /sw/lib/gcc8/x86_64-apple-darwin18.5.0/include -isystem /sw/lib/gcc8/x86_64-apple-darwin18.5.0/sys-include    supports -c -o file.o... yes
  250. checking if /sw/src/fink.build/gcc8-8.3.0-101/darwin_objdir/./gcc/xgcc -B/sw/src/fink.build/gcc8-8.3.0-101/darwin_objdir/./gcc/ -B/sw/lib/gcc8/x86_64-apple-darwin18.5.0/bin/ -B/sw/lib/gcc8/x86_64-apple-darwin18.5.0/lib/ -isystem /sw/lib/gcc8/x86_64-apple-darwin18.5.0/include -isystem /sw/lib/gcc8/x86_64-apple-darwin18.5.0/sys-include    supports -c -o file.o... (cached) yes
  251. checking whether the /sw/src/fink.build/gcc8-8.3.0-101/darwin_objdir/./gcc/xgcc -B/sw/src/fink.build/gcc8-8.3.0-101/darwin_objdir/./gcc/ -B/sw/lib/gcc8/x86_64-apple-darwin18.5.0/bin/ -B/sw/lib/gcc8/x86_64-apple-darwin18.5.0/lib/ -isystem /sw/lib/gcc8/x86_64-apple-darwin18.5.0/include -isystem /sw/lib/gcc8/x86_64-apple-darwin18.5.0/sys-include    linker (/sw/src/fink.build/gcc8-8.3.0-101/darwin_objdir/./gcc/collect-ld) supports shared libraries... yes
  252. checking dynamic linker characteristics... darwin18.5.0 dyld
  253. checking how to hardcode library paths into programs... immediate
  254. checking whether stripping libraries is possible... yes
  255. checking if libtool supports shared libraries... yes
  256. checking whether to build shared libraries... yes
  257. checking whether to build static libraries... no
  258. checking whether we are using the GNU C++ compiler... yes
  259. checking whether  /sw/src/fink.build/gcc8-8.3.0-101/darwin_objdir/./gcc/xg++ -B/sw/src/fink.build/gcc8-8.3.0-101/darwin_objdir/./gcc/ -nostdinc++ -nostdinc++ -I/sw/src/fink.build/gcc8-8.3.0-101/darwin_objdir/x86_64-apple-darwin18.5.0/libstdc++-v3/include/x86_64-apple-darwin18.5.0 -I/sw/src/fink.build/gcc8-8.3.0-101/darwin_objdir/x86_64-apple-darwin18.5.0/libstdc++-v3/include -I/sw/src/fink.build/gcc8-8.3.0-101/gcc-8.3.0/libstdc++-v3/libsupc++ -I/sw/src/fink.build/gcc8-8.3.0-101/gcc-8.3.0/libstdc++-v3/include/backward -I/sw/src/fink.build/gcc8-8.3.0-101/gcc-8.3.0/libstdc++-v3/testsuite/util -L/sw/src/fink.build/gcc8-8.3.0-101/darwin_objdir/x86_64-apple-darwin18.5.0/libstdc++-v3/src -L/sw/src/fink.build/gcc8-8.3.0-101/darwin_objdir/x86_64-apple-darwin18.5.0/libstdc++-v3/src/.libs -L/sw/src/fink.build/gcc8-8.3.0-101/darwin_objdir/x86_64-apple-darwin18.5.0/libstdc++-v3/libsupc++/.libs -B/sw/src/fink.build/gcc8-8.3.0-101/darwin_objdir/x86_64-apple-darwin18.5.0/libstdc++-v3/src/.libs -B/sw/src/fink.build/gcc8-8.3.0-101/darwin_objdir/x86_64-apple-darwin18.5.0/libstdc++-v3/libsupc++/.libs -B/sw/lib/gcc8/x86_64-apple-darwin18.5.0/bin/ -B/sw/lib/gcc8/x86_64-apple-darwin18.5.0/lib/ -isystem /sw/lib/gcc8/x86_64-apple-darwin18.5.0/include -isystem /sw/lib/gcc8/x86_64-apple-darwin18.5.0/sys-include    accepts -g... yes
  260. checking dependency style of  /sw/src/fink.build/gcc8-8.3.0-101/darwin_objdir/./gcc/xg++ -B/sw/src/fink.build/gcc8-8.3.0-101/darwin_objdir/./gcc/ -nostdinc++ -nostdinc++ -I/sw/src/fink.build/gcc8-8.3.0-101/darwin_objdir/x86_64-apple-darwin18.5.0/libstdc++-v3/include/x86_64-apple-darwin18.5.0 -I/sw/src/fink.build/gcc8-8.3.0-101/darwin_objdir/x86_64-apple-darwin18.5.0/libstdc++-v3/include -I/sw/src/fink.build/gcc8-8.3.0-101/gcc-8.3.0/libstdc++-v3/libsupc++ -I/sw/src/fink.build/gcc8-8.3.0-101/gcc-8.3.0/libstdc++-v3/include/backward -I/sw/src/fink.build/gcc8-8.3.0-101/gcc-8.3.0/libstdc++-v3/testsuite/util -L/sw/src/fink.build/gcc8-8.3.0-101/darwin_objdir/x86_64-apple-darwin18.5.0/libstdc++-v3/src -L/sw/src/fink.build/gcc8-8.3.0-101/darwin_objdir/x86_64-apple-darwin18.5.0/libstdc++-v3/src/.libs -L/sw/src/fink.build/gcc8-8.3.0-101/darwin_objdir/x86_64-apple-darwin18.5.0/libstdc++-v3/libsupc++/.libs -B/sw/src/fink.build/gcc8-8.3.0-101/darwin_objdir/x86_64-apple-darwin18.5.0/libstdc++-v3/src/.libs -B/sw/src/fink.build/gcc8-8.3.0-101/darwin_objdir/x86_64-apple-darwin18.5.0/libstdc++-v3/libsupc++/.libs -B/sw/lib/gcc8/x86_64-apple-darwin18.5.0/bin/ -B/sw/lib/gcc8/x86_64-apple-darwin18.5.0/lib/ -isystem /sw/lib/gcc8/x86_64-apple-darwin18.5.0/include -isystem /sw/lib/gcc8/x86_64-apple-darwin18.5.0/sys-include   ... gcc3
  261. checking how to run the C++ preprocessor...  /sw/src/fink.build/gcc8-8.3.0-101/darwin_objdir/./gcc/xg++ -B/sw/src/fink.build/gcc8-8.3.0-101/darwin_objdir/./gcc/ -nostdinc++ -nostdinc++ -I/sw/src/fink.build/gcc8-8.3.0-101/darwin_objdir/x86_64-apple-darwin18.5.0/libstdc++-v3/include/x86_64-apple-darwin18.5.0 -I/sw/src/fink.build/gcc8-8.3.0-101/darwin_objdir/x86_64-apple-darwin18.5.0/libstdc++-v3/include -I/sw/src/fink.build/gcc8-8.3.0-101/gcc-8.3.0/libstdc++-v3/libsupc++ -I/sw/src/fink.build/gcc8-8.3.0-101/gcc-8.3.0/libstdc++-v3/include/backward -I/sw/src/fink.build/gcc8-8.3.0-101/gcc-8.3.0/libstdc++-v3/testsuite/util -L/sw/src/fink.build/gcc8-8.3.0-101/darwin_objdir/x86_64-apple-darwin18.5.0/libstdc++-v3/src -L/sw/src/fink.build/gcc8-8.3.0-101/darwin_objdir/x86_64-apple-darwin18.5.0/libstdc++-v3/src/.libs -L/sw/src/fink.build/gcc8-8.3.0-101/darwin_objdir/x86_64-apple-darwin18.5.0/libstdc++-v3/libsupc++/.libs -B/sw/src/fink.build/gcc8-8.3.0-101/darwin_objdir/x86_64-apple-darwin18.5.0/libstdc++-v3/src/.libs -B/sw/src/fink.build/gcc8-8.3.0-101/darwin_objdir/x86_64-apple-darwin18.5.0/libstdc++-v3/libsupc++/.libs -B/sw/lib/gcc8/x86_64-apple-darwin18.5.0/bin/ -B/sw/lib/gcc8/x86_64-apple-darwin18.5.0/lib/ -isystem /sw/lib/gcc8/x86_64-apple-darwin18.5.0/include -isystem /sw/lib/gcc8/x86_64-apple-darwin18.5.0/sys-include    -E
  262. checking for ld used by  /sw/src/fink.build/gcc8-8.3.0-101/darwin_objdir/./gcc/xg++ -B/sw/src/fink.build/gcc8-8.3.0-101/darwin_objdir/./gcc/ -nostdinc++ -nostdinc++ -I/sw/src/fink.build/gcc8-8.3.0-101/darwin_objdir/x86_64-apple-darwin18.5.0/libstdc++-v3/include/x86_64-apple-darwin18.5.0 -I/sw/src/fink.build/gcc8-8.3.0-101/darwin_objdir/x86_64-apple-darwin18.5.0/libstdc++-v3/include -I/sw/src/fink.build/gcc8-8.3.0-101/gcc-8.3.0/libstdc++-v3/libsupc++ -I/sw/src/fink.build/gcc8-8.3.0-101/gcc-8.3.0/libstdc++-v3/include/backward -I/sw/src/fink.build/gcc8-8.3.0-101/gcc-8.3.0/libstdc++-v3/testsuite/util -L/sw/src/fink.build/gcc8-8.3.0-101/darwin_objdir/x86_64-apple-darwin18.5.0/libstdc++-v3/src -L/sw/src/fink.build/gcc8-8.3.0-101/darwin_objdir/x86_64-apple-darwin18.5.0/libstdc++-v3/src/.libs -L/sw/src/fink.build/gcc8-8.3.0-101/darwin_objdir/x86_64-apple-darwin18.5.0/libstdc++-v3/libsupc++/.libs -B/sw/src/fink.build/gcc8-8.3.0-101/darwin_objdir/x86_64-apple-darwin18.5.0/libstdc++-v3/src/.libs -B/sw/src/fink.build/gcc8-8.3.0-101/darwin_objdir/x86_64-apple-darwin18.5.0/libstdc++-v3/libsupc++/.libs -B/sw/lib/gcc8/x86_64-apple-darwin18.5.0/bin/ -B/sw/lib/gcc8/x86_64-apple-darwin18.5.0/lib/ -isystem /sw/lib/gcc8/x86_64-apple-darwin18.5.0/include -isystem /sw/lib/gcc8/x86_64-apple-darwin18.5.0/sys-include   ... /sw/src/fink.build/gcc8-8.3.0-101/darwin_objdir/./gcc/collect-ld
  263. checking if the linker (/sw/src/fink.build/gcc8-8.3.0-101/darwin_objdir/./gcc/collect-ld) is GNU ld... no
  264. checking whether the  /sw/src/fink.build/gcc8-8.3.0-101/darwin_objdir/./gcc/xg++ -B/sw/src/fink.build/gcc8-8.3.0-101/darwin_objdir/./gcc/ -nostdinc++ -nostdinc++ -I/sw/src/fink.build/gcc8-8.3.0-101/darwin_objdir/x86_64-apple-darwin18.5.0/libstdc++-v3/include/x86_64-apple-darwin18.5.0 -I/sw/src/fink.build/gcc8-8.3.0-101/darwin_objdir/x86_64-apple-darwin18.5.0/libstdc++-v3/include -I/sw/src/fink.build/gcc8-8.3.0-101/gcc-8.3.0/libstdc++-v3/libsupc++ -I/sw/src/fink.build/gcc8-8.3.0-101/gcc-8.3.0/libstdc++-v3/include/backward -I/sw/src/fink.build/gcc8-8.3.0-101/gcc-8.3.0/libstdc++-v3/testsuite/util -L/sw/src/fink.build/gcc8-8.3.0-101/darwin_objdir/x86_64-apple-darwin18.5.0/libstdc++-v3/src -L/sw/src/fink.build/gcc8-8.3.0-101/darwin_objdir/x86_64-apple-darwin18.5.0/libstdc++-v3/src/.libs -L/sw/src/fink.build/gcc8-8.3.0-101/darwin_objdir/x86_64-apple-darwin18.5.0/libstdc++-v3/libsupc++/.libs -B/sw/src/fink.build/gcc8-8.3.0-101/darwin_objdir/x86_64-apple-darwin18.5.0/libstdc++-v3/src/.libs -B/sw/src/fink.build/gcc8-8.3.0-101/darwin_objdir/x86_64-apple-darwin18.5.0/libstdc++-v3/libsupc++/.libs -B/sw/lib/gcc8/x86_64-apple-darwin18.5.0/bin/ -B/sw/lib/gcc8/x86_64-apple-darwin18.5.0/lib/ -isystem /sw/lib/gcc8/x86_64-apple-darwin18.5.0/include -isystem /sw/lib/gcc8/x86_64-apple-darwin18.5.0/sys-include    linker (/sw/src/fink.build/gcc8-8.3.0-101/darwin_objdir/./gcc/collect-ld) supports shared libraries... yes
  265. checking for  /sw/src/fink.build/gcc8-8.3.0-101/darwin_objdir/./gcc/xg++ -B/sw/src/fink.build/gcc8-8.3.0-101/darwin_objdir/./gcc/ -nostdinc++ -nostdinc++ -I/sw/src/fink.build/gcc8-8.3.0-101/darwin_objdir/x86_64-apple-darwin18.5.0/libstdc++-v3/include/x86_64-apple-darwin18.5.0 -I/sw/src/fink.build/gcc8-8.3.0-101/darwin_objdir/x86_64-apple-darwin18.5.0/libstdc++-v3/include -I/sw/src/fink.build/gcc8-8.3.0-101/gcc-8.3.0/libstdc++-v3/libsupc++ -I/sw/src/fink.build/gcc8-8.3.0-101/gcc-8.3.0/libstdc++-v3/include/backward -I/sw/src/fink.build/gcc8-8.3.0-101/gcc-8.3.0/libstdc++-v3/testsuite/util -L/sw/src/fink.build/gcc8-8.3.0-101/darwin_objdir/x86_64-apple-darwin18.5.0/libstdc++-v3/src -L/sw/src/fink.build/gcc8-8.3.0-101/darwin_objdir/x86_64-apple-darwin18.5.0/libstdc++-v3/src/.libs -L/sw/src/fink.build/gcc8-8.3.0-101/darwin_objdir/x86_64-apple-darwin18.5.0/libstdc++-v3/libsupc++/.libs -B/sw/src/fink.build/gcc8-8.3.0-101/darwin_objdir/x86_64-apple-darwin18.5.0/libstdc++-v3/src/.libs -B/sw/src/fink.build/gcc8-8.3.0-101/darwin_objdir/x86_64-apple-darwin18.5.0/libstdc++-v3/libsupc++/.libs -B/sw/lib/gcc8/x86_64-apple-darwin18.5.0/bin/ -B/sw/lib/gcc8/x86_64-apple-darwin18.5.0/lib/ -isystem /sw/lib/gcc8/x86_64-apple-darwin18.5.0/include -isystem /sw/lib/gcc8/x86_64-apple-darwin18.5.0/sys-include    option to produce PIC... -fno-common -DPIC
  266. checking if  /sw/src/fink.build/gcc8-8.3.0-101/darwin_objdir/./gcc/xg++ -B/sw/src/fink.build/gcc8-8.3.0-101/darwin_objdir/./gcc/ -nostdinc++ -nostdinc++ -I/sw/src/fink.build/gcc8-8.3.0-101/darwin_objdir/x86_64-apple-darwin18.5.0/libstdc++-v3/include/x86_64-apple-darwin18.5.0 -I/sw/src/fink.build/gcc8-8.3.0-101/darwin_objdir/x86_64-apple-darwin18.5.0/libstdc++-v3/include -I/sw/src/fink.build/gcc8-8.3.0-101/gcc-8.3.0/libstdc++-v3/libsupc++ -I/sw/src/fink.build/gcc8-8.3.0-101/gcc-8.3.0/libstdc++-v3/include/backward -I/sw/src/fink.build/gcc8-8.3.0-101/gcc-8.3.0/libstdc++-v3/testsuite/util -L/sw/src/fink.build/gcc8-8.3.0-101/darwin_objdir/x86_64-apple-darwin18.5.0/libstdc++-v3/src -L/sw/src/fink.build/gcc8-8.3.0-101/darwin_objdir/x86_64-apple-darwin18.5.0/libstdc++-v3/src/.libs -L/sw/src/fink.build/gcc8-8.3.0-101/darwin_objdir/x86_64-apple-darwin18.5.0/libstdc++-v3/libsupc++/.libs -B/sw/src/fink.build/gcc8-8.3.0-101/darwin_objdir/x86_64-apple-darwin18.5.0/libstdc++-v3/src/.libs -B/sw/src/fink.build/gcc8-8.3.0-101/darwin_objdir/x86_64-apple-darwin18.5.0/libstdc++-v3/libsupc++/.libs -B/sw/lib/gcc8/x86_64-apple-darwin18.5.0/bin/ -B/sw/lib/gcc8/x86_64-apple-darwin18.5.0/lib/ -isystem /sw/lib/gcc8/x86_64-apple-darwin18.5.0/include -isystem /sw/lib/gcc8/x86_64-apple-darwin18.5.0/sys-include    PIC flag -fno-common -DPIC works... yes
  267. checking if  /sw/src/fink.build/gcc8-8.3.0-101/darwin_objdir/./gcc/xg++ -B/sw/src/fink.build/gcc8-8.3.0-101/darwin_objdir/./gcc/ -nostdinc++ -nostdinc++ -I/sw/src/fink.build/gcc8-8.3.0-101/darwin_objdir/x86_64-apple-darwin18.5.0/libstdc++-v3/include/x86_64-apple-darwin18.5.0 -I/sw/src/fink.build/gcc8-8.3.0-101/darwin_objdir/x86_64-apple-darwin18.5.0/libstdc++-v3/include -I/sw/src/fink.build/gcc8-8.3.0-101/gcc-8.3.0/libstdc++-v3/libsupc++ -I/sw/src/fink.build/gcc8-8.3.0-101/gcc-8.3.0/libstdc++-v3/include/backward -I/sw/src/fink.build/gcc8-8.3.0-101/gcc-8.3.0/libstdc++-v3/testsuite/util -L/sw/src/fink.build/gcc8-8.3.0-101/darwin_objdir/x86_64-apple-darwin18.5.0/libstdc++-v3/src -L/sw/src/fink.build/gcc8-8.3.0-101/darwin_objdir/x86_64-apple-darwin18.5.0/libstdc++-v3/src/.libs -L/sw/src/fink.build/gcc8-8.3.0-101/darwin_objdir/x86_64-apple-darwin18.5.0/libstdc++-v3/libsupc++/.libs -B/sw/src/fink.build/gcc8-8.3.0-101/darwin_objdir/x86_64-apple-darwin18.5.0/libstdc++-v3/src/.libs -B/sw/src/fink.build/gcc8-8.3.0-101/darwin_objdir/x86_64-apple-darwin18.5.0/libstdc++-v3/libsupc++/.libs -B/sw/lib/gcc8/x86_64-apple-darwin18.5.0/bin/ -B/sw/lib/gcc8/x86_64-apple-darwin18.5.0/lib/ -isystem /sw/lib/gcc8/x86_64-apple-darwin18.5.0/include -isystem /sw/lib/gcc8/x86_64-apple-darwin18.5.0/sys-include    static flag -static works... no
  268. checking if  /sw/src/fink.build/gcc8-8.3.0-101/darwin_objdir/./gcc/xg++ -B/sw/src/fink.build/gcc8-8.3.0-101/darwin_objdir/./gcc/ -nostdinc++ -nostdinc++ -I/sw/src/fink.build/gcc8-8.3.0-101/darwin_objdir/x86_64-apple-darwin18.5.0/libstdc++-v3/include/x86_64-apple-darwin18.5.0 -I/sw/src/fink.build/gcc8-8.3.0-101/darwin_objdir/x86_64-apple-darwin18.5.0/libstdc++-v3/include -I/sw/src/fink.build/gcc8-8.3.0-101/gcc-8.3.0/libstdc++-v3/libsupc++ -I/sw/src/fink.build/gcc8-8.3.0-101/gcc-8.3.0/libstdc++-v3/include/backward -I/sw/src/fink.build/gcc8-8.3.0-101/gcc-8.3.0/libstdc++-v3/testsuite/util -L/sw/src/fink.build/gcc8-8.3.0-101/darwin_objdir/x86_64-apple-darwin18.5.0/libstdc++-v3/src -L/sw/src/fink.build/gcc8-8.3.0-101/darwin_objdir/x86_64-apple-darwin18.5.0/libstdc++-v3/src/.libs -L/sw/src/fink.build/gcc8-8.3.0-101/darwin_objdir/x86_64-apple-darwin18.5.0/libstdc++-v3/libsupc++/.libs -B/sw/src/fink.build/gcc8-8.3.0-101/darwin_objdir/x86_64-apple-darwin18.5.0/libstdc++-v3/src/.libs -B/sw/src/fink.build/gcc8-8.3.0-101/darwin_objdir/x86_64-apple-darwin18.5.0/libstdc++-v3/libsupc++/.libs -B/sw/lib/gcc8/x86_64-apple-darwin18.5.0/bin/ -B/sw/lib/gcc8/x86_64-apple-darwin18.5.0/lib/ -isystem /sw/lib/gcc8/x86_64-apple-darwin18.5.0/include -isystem /sw/lib/gcc8/x86_64-apple-darwin18.5.0/sys-include    supports -c -o file.o... yes
  269. checking if  /sw/src/fink.build/gcc8-8.3.0-101/darwin_objdir/./gcc/xg++ -B/sw/src/fink.build/gcc8-8.3.0-101/darwin_objdir/./gcc/ -nostdinc++ -nostdinc++ -I/sw/src/fink.build/gcc8-8.3.0-101/darwin_objdir/x86_64-apple-darwin18.5.0/libstdc++-v3/include/x86_64-apple-darwin18.5.0 -I/sw/src/fink.build/gcc8-8.3.0-101/darwin_objdir/x86_64-apple-darwin18.5.0/libstdc++-v3/include -I/sw/src/fink.build/gcc8-8.3.0-101/gcc-8.3.0/libstdc++-v3/libsupc++ -I/sw/src/fink.build/gcc8-8.3.0-101/gcc-8.3.0/libstdc++-v3/include/backward -I/sw/src/fink.build/gcc8-8.3.0-101/gcc-8.3.0/libstdc++-v3/testsuite/util -L/sw/src/fink.build/gcc8-8.3.0-101/darwin_objdir/x86_64-apple-darwin18.5.0/libstdc++-v3/src -L/sw/src/fink.build/gcc8-8.3.0-101/darwin_objdir/x86_64-apple-darwin18.5.0/libstdc++-v3/src/.libs -L/sw/src/fink.build/gcc8-8.3.0-101/darwin_objdir/x86_64-apple-darwin18.5.0/libstdc++-v3/libsupc++/.libs -B/sw/src/fink.build/gcc8-8.3.0-101/darwin_objdir/x86_64-apple-darwin18.5.0/libstdc++-v3/src/.libs -B/sw/src/fink.build/gcc8-8.3.0-101/darwin_objdir/x86_64-apple-darwin18.5.0/libstdc++-v3/libsupc++/.libs -B/sw/lib/gcc8/x86_64-apple-darwin18.5.0/bin/ -B/sw/lib/gcc8/x86_64-apple-darwin18.5.0/lib/ -isystem /sw/lib/gcc8/x86_64-apple-darwin18.5.0/include -isystem /sw/lib/gcc8/x86_64-apple-darwin18.5.0/sys-include    supports -c -o file.o... (cached) yes
  270. checking whether the  /sw/src/fink.build/gcc8-8.3.0-101/darwin_objdir/./gcc/xg++ -B/sw/src/fink.build/gcc8-8.3.0-101/darwin_objdir/./gcc/ -nostdinc++ -nostdinc++ -I/sw/src/fink.build/gcc8-8.3.0-101/darwin_objdir/x86_64-apple-darwin18.5.0/libstdc++-v3/include/x86_64-apple-darwin18.5.0 -I/sw/src/fink.build/gcc8-8.3.0-101/darwin_objdir/x86_64-apple-darwin18.5.0/libstdc++-v3/include -I/sw/src/fink.build/gcc8-8.3.0-101/gcc-8.3.0/libstdc++-v3/libsupc++ -I/sw/src/fink.build/gcc8-8.3.0-101/gcc-8.3.0/libstdc++-v3/include/backward -I/sw/src/fink.build/gcc8-8.3.0-101/gcc-8.3.0/libstdc++-v3/testsuite/util -L/sw/src/fink.build/gcc8-8.3.0-101/darwin_objdir/x86_64-apple-darwin18.5.0/libstdc++-v3/src -L/sw/src/fink.build/gcc8-8.3.0-101/darwin_objdir/x86_64-apple-darwin18.5.0/libstdc++-v3/src/.libs -L/sw/src/fink.build/gcc8-8.3.0-101/darwin_objdir/x86_64-apple-darwin18.5.0/libstdc++-v3/libsupc++/.libs -B/sw/src/fink.build/gcc8-8.3.0-101/darwin_objdir/x86_64-apple-darwin18.5.0/libstdc++-v3/src/.libs -B/sw/src/fink.build/gcc8-8.3.0-101/darwin_objdir/x86_64-apple-darwin18.5.0/libstdc++-v3/libsupc++/.libs -B/sw/lib/gcc8/x86_64-apple-darwin18.5.0/bin/ -B/sw/lib/gcc8/x86_64-apple-darwin18.5.0/lib/ -isystem /sw/lib/gcc8/x86_64-apple-darwin18.5.0/include -isystem /sw/lib/gcc8/x86_64-apple-darwin18.5.0/sys-include    linker (/sw/src/fink.build/gcc8-8.3.0-101/darwin_objdir/./gcc/collect-ld) supports shared libraries... yes
  271. checking dynamic linker characteristics... darwin18.5.0 dyld
  272. checking how to hardcode library paths into programs... immediate
  273. checking whether basename is declared... no
  274. checking whether /sw/src/fink.build/gcc8-8.3.0-101/darwin_objdir/./gcc/xgcc -B/sw/src/fink.build/gcc8-8.3.0-101/darwin_objdir/./gcc/ -B/sw/lib/gcc8/x86_64-apple-darwin18.5.0/bin/ -B/sw/lib/gcc8/x86_64-apple-darwin18.5.0/lib/ -isystem /sw/lib/gcc8/x86_64-apple-darwin18.5.0/include -isystem /sw/lib/gcc8/x86_64-apple-darwin18.5.0/sys-include    supports -W... yes
  275. checking whether /sw/src/fink.build/gcc8-8.3.0-101/darwin_objdir/./gcc/xgcc -B/sw/src/fink.build/gcc8-8.3.0-101/darwin_objdir/./gcc/ -B/sw/lib/gcc8/x86_64-apple-darwin18.5.0/bin/ -B/sw/lib/gcc8/x86_64-apple-darwin18.5.0/lib/ -isystem /sw/lib/gcc8/x86_64-apple-darwin18.5.0/include -isystem /sw/lib/gcc8/x86_64-apple-darwin18.5.0/sys-include    supports -Wall... yes
  276. checking for socket libraries... checking for connect... yes
  277. checking for gethostbyname... yes
  278.  
  279. checking for exported symbols... yes
  280. checking for library containing dlopen... none required
  281. checking for -fPIC -shared... yes
  282. checking for socketpair... yes
  283. checking for select... yes
  284. checking for fork... yes
  285. configure: updating cache ./config.cache
  286. configure: creating ./config.status
  287. config.status: creating Makefile
  288. config.status: creating cc1plugin-config.h
  289. config.status: executing depfiles commands
  290. config.status: executing libtool commands
  291. make[2]: Entering directory '/sw/src/fink.build/gcc8-8.3.0-101/darwin_objdir/intl'
  292. make[2]: Nothing to be done for 'all'.
  293. make[2]: Leaving directory '/sw/src/fink.build/gcc8-8.3.0-101/darwin_objdir/intl'
  294. make[2]: Entering directory '/sw/src/fink.build/gcc8-8.3.0-101/darwin_objdir/build-x86_64-apple-darwin18.5.0/libiberty'
  295. make[3]: Entering directory '/sw/src/fink.build/gcc8-8.3.0-101/darwin_objdir/build-x86_64-apple-darwin18.5.0/libiberty/testsuite'
  296. make[3]: Nothing to be done for 'all'.
  297. make[3]: Leaving directory '/sw/src/fink.build/gcc8-8.3.0-101/darwin_objdir/build-x86_64-apple-darwin18.5.0/libiberty/testsuite'
  298. make[2]: Leaving directory '/sw/src/fink.build/gcc8-8.3.0-101/darwin_objdir/build-x86_64-apple-darwin18.5.0/libiberty'
  299. make[2]: Entering directory '/sw/src/fink.build/gcc8-8.3.0-101/darwin_objdir/build-x86_64-apple-darwin18.5.0/fixincludes'
  300. make[2]: Nothing to be done for 'all'.
  301. make[2]: Leaving directory '/sw/src/fink.build/gcc8-8.3.0-101/darwin_objdir/build-x86_64-apple-darwin18.5.0/fixincludes'
  302. make[2]: Entering directory '/sw/src/fink.build/gcc8-8.3.0-101/darwin_objdir/build-x86_64-apple-darwin18.5.0/libcpp'
  303. test -f config.h || (rm -f stamp-h1 && make stamp-h1)
  304. make[2]: Leaving directory '/sw/src/fink.build/gcc8-8.3.0-101/darwin_objdir/build-x86_64-apple-darwin18.5.0/libcpp'
  305. make[2]: Entering directory '/sw/src/fink.build/gcc8-8.3.0-101/darwin_objdir/libbacktrace'
  306. make  all-am
  307. make[3]: Entering directory '/sw/src/fink.build/gcc8-8.3.0-101/darwin_objdir/libbacktrace'
  308. true  DO=all multi-do # make
  309. make[3]: Leaving directory '/sw/src/fink.build/gcc8-8.3.0-101/darwin_objdir/libbacktrace'
  310. make[2]: Leaving directory '/sw/src/fink.build/gcc8-8.3.0-101/darwin_objdir/libbacktrace'
  311. make[2]: Entering directory '/sw/src/fink.build/gcc8-8.3.0-101/darwin_objdir/libcpp'
  312. test -f config.h || (rm -f stamp-h1 && make stamp-h1)
  313. rm -f libcpp.a
  314. ar cru libcpp.a charset.o directives.o directives-only.o errors.o expr.o files.o identifiers.o init.o lex.o line-map.o macro.o mkdeps.o pch.o symtab.o traditional.o
  315. ranlib libcpp.a
  316. make[2]: Leaving directory '/sw/src/fink.build/gcc8-8.3.0-101/darwin_objdir/libcpp'
  317. make[2]: Entering directory '/sw/src/fink.build/gcc8-8.3.0-101/darwin_objdir/libdecnumber'
  318. make[2]: Nothing to be done for 'all'.
  319. make[2]: Leaving directory '/sw/src/fink.build/gcc8-8.3.0-101/darwin_objdir/libdecnumber'
  320. make[2]: Entering directory '/sw/src/fink.build/gcc8-8.3.0-101/darwin_objdir/gcc'
  321. g++ -std=gnu++98   -g -O2  -DIN_GCC     -fno-exceptions -fno-rtti -fasynchronous-unwind-tables -W -Wall -Wno-narrowing -Wwrite-strings -Wcast-qual -Wmissing-format-attribute -Woverloaded-virtual -pedantic -Wno-long-long -Wno-variadic-macros -Wno-overlength-strings   -DHAVE_CONFIG_H -DGENERATOR_FILE -fno-PIE -static-libstdc++ -static-libgcc    -o build/genmodes \
  322.     build/genmodes.o build/errors.o .././libiberty/libiberty.a
  323. clang: error: unsupported option '-static-libgcc'
  324. make[2]: *** [Makefile:2869: build/genmodes] Error 1
  325. make[2]: Leaving directory '/sw/src/fink.build/gcc8-8.3.0-101/darwin_objdir/gcc'
  326. make[1]: *** [Makefile:4631: all-gcc] Error 2
  327. make[1]: Leaving directory '/sw/src/fink.build/gcc8-8.3.0-101/darwin_objdir'
  328. make: *** [Makefile:22232: bootstrap] Error 2
  329. ### execution of /tmp/fink.VQ2HK failed, exit code 2
  330. ### execution of /tmp/fink.JNqd4 failed, exit code 2
  331. Removing runtime build-lock...
  332. Removing build-lock package...
  333. /sw/bin/dpkg-lockwait -r fink-buildlock-gcc8-8.3.0-101
  334. (Reading database ... 358311 files and directories currently installed.)
  335. Removing fink-buildlock-gcc8-8.3.0-101 ...
  336. Failed: phase compiling: gcc8-8.3.0-101 failed
  337.  
  338. Before reporting any errors, please run "fink selfupdate" and try again.
  339.  
  340. If you continue to have issues, please check to see if the FAQ on Fink's
  341. website solves the problem.  If not, ask on one (not both, please) of
  342. these mailing lists:
  343.  
  344.     The Fink Users List <fink-users@lists.sourceforge.net>
  345.     The Fink Beginners List <fink-beginners@lists.sourceforge.net>.
  346.  
  347. Please try to include the complete error message in your report.  This
  348. generally consists of a compiler line starting with e.g. "gcc" or "g++"
  349. followed by the actual error output from the compiler.
  350.  
  351. Also include the following system information:
  352. Package manager version: 0.44.1
  353. Distribution version: selfupdate-git Sat Apr 20 08:38:51 2019, 10.14, x86_64
  354. Trees: local/main stable/main stable/crypto local/injected
  355. Xcode.app: 10.2.1
  356. Xcode command-line tools: 10.2.1.0.1.1554506761
  357. Max. Fink build jobs:  1
RAW Paste Data