SHARE
TWEET

Untitled

a guest Jul 22nd, 2019 66 Never
Not a member of Pastebin yet? Sign Up, it unlocks many cool features!
  1. C:\Users\subif\maplocation>mvn package -P deploy-web -D deploy.path="C:\Users\subif\openmrs\distro-2-9-0\tmp\openmrs"
  2. [INFO] Scanning for projects...
  3. [WARNING]
  4. [WARNING] Some problems were encountered while building the effective model for org.openmrs.maplocation:maplocation-api:jar:1.0.0-SNAPSHOT
  5. [WARNING] 'dependencyManagement.dependencies.dependency.scope' for org.openmrs.module:dataexchange-omod:jar:tests must be one of [provided, compile, runtime, test, system, import] but is 'tests'. @ org.openmrs.distro:referenceapplication:2.9.0, C:\Users\subif\.m2\repository\org\openmrs\distro\referenceapplication\2.9.0\referenceapplication-2.9.0.pom, line 834, column 12
  6. [WARNING] 'dependencyManagement.dependencies.dependency.scope' for org.openmrs.module:allergyui-api:jar:tests must be one of [provided, compile, runtime, test, system, import] but is 'tests'. @ org.openmrs.distro:referenceapplication:2.9.0, C:\Users\subif\.m2\repository\org\openmrs\distro\referenceapplication\2.9.0\referenceapplication-2.9.0.pom, line 847, column 12
  7. [WARNING] 'dependencyManagement.dependencies.dependency.scope' for org.openmrs.module:formentryapp-api:jar:tests must be one of [provided, compile, runtime, test, system, import] but is 'tests'. @ org.openmrs.distro:referenceapplication:2.9.0, C:\Users\subif\.m2\repository\org\openmrs\distro\referenceapplication\2.9.0\referenceapplication-2.9.0.pom, line 867, column 12
  8. [WARNING] 'dependencyManagement.dependencies.dependency.scope' for org.openmrs.module:legacyui-api:jar:tests must be one of [provided, compile, runtime, test, system, import] but is 'tests'. @ org.openmrs.distro:referenceapplication:2.9.0, C:\Users\subif\.m2\repository\org\openmrs\distro\referenceapplication\2.9.0\referenceapplication-2.9.0.pom, line 934, column 12
  9. [WARNING] 'dependencyManagement.dependencies.dependency.scope' for org.openmrs.module:reportingcompatibility-api:jar:tests must be one of [provided, compile, runtime, test, system, import] but is 'tests'. @ org.openmrs.distro:referenceapplication:2.9.0, C:\Users\subif\.m2\repository\org\openmrs\distro\referenceapplication\2.9.0\referenceapplication-2.9.0.pom, line 953, column 12
  10. [WARNING]
  11. [WARNING] Some problems were encountered while building the effective model for org.openmrs.maplocation:maplocation-omod:jar:1.0.0-SNAPSHOT
  12. [WARNING] 'dependencyManagement.dependencies.dependency.scope' for org.openmrs.module:dataexchange-omod:jar:tests must be one of [provided, compile, runtime, test, system, import] but is 'tests'. @ org.openmrs.distro:referenceapplication:2.9.0, C:\Users\subif\.m2\repository\org\openmrs\distro\referenceapplication\2.9.0\referenceapplication-2.9.0.pom, line 834, column 12
  13. [WARNING] 'dependencyManagement.dependencies.dependency.scope' for org.openmrs.module:allergyui-api:jar:tests must be one of [provided, compile, runtime, test, system, import] but is 'tests'. @ org.openmrs.distro:referenceapplication:2.9.0, C:\Users\subif\.m2\repository\org\openmrs\distro\referenceapplication\2.9.0\referenceapplication-2.9.0.pom, line 847, column 12
  14. [WARNING] 'dependencyManagement.dependencies.dependency.scope' for org.openmrs.module:formentryapp-api:jar:tests must be one of [provided, compile, runtime, test, system, import] but is 'tests'. @ org.openmrs.distro:referenceapplication:2.9.0, C:\Users\subif\.m2\repository\org\openmrs\distro\referenceapplication\2.9.0\referenceapplication-2.9.0.pom, line 867, column 12
  15. [WARNING] 'dependencyManagement.dependencies.dependency.scope' for org.openmrs.module:legacyui-api:jar:tests must be one of [provided, compile, runtime, test, system, import] but is 'tests'. @ org.openmrs.distro:referenceapplication:2.9.0, C:\Users\subif\.m2\repository\org\openmrs\distro\referenceapplication\2.9.0\referenceapplication-2.9.0.pom, line 934, column 12
  16. [WARNING] 'dependencyManagement.dependencies.dependency.scope' for org.openmrs.module:reportingcompatibility-api:jar:tests must be one of [provided, compile, runtime, test, system, import] but is 'tests'. @ org.openmrs.distro:referenceapplication:2.9.0, C:\Users\subif\.m2\repository\org\openmrs\distro\referenceapplication\2.9.0\referenceapplication-2.9.0.pom, line 953, column 12
  17. [WARNING]
  18. [WARNING] Some problems were encountered while building the effective model for org.openmrs.maplocation:maplocation:pom:1.0.0-SNAPSHOT
  19. [WARNING] 'dependencyManagement.dependencies.dependency.scope' for org.openmrs.module:dataexchange-omod:jar:tests must be one of [provided, compile, runtime, test, system, import] but is 'tests'. @ org.openmrs.distro:referenceapplication:2.9.0, C:\Users\subif\.m2\repository\org\openmrs\distro\referenceapplication\2.9.0\referenceapplication-2.9.0.pom, line 834, column 12
  20. [WARNING] 'dependencyManagement.dependencies.dependency.scope' for org.openmrs.module:allergyui-api:jar:tests must be one of [provided, compile, runtime, test, system, import] but is 'tests'. @ org.openmrs.distro:referenceapplication:2.9.0, C:\Users\subif\.m2\repository\org\openmrs\distro\referenceapplication\2.9.0\referenceapplication-2.9.0.pom, line 847, column 12
  21. [WARNING] 'dependencyManagement.dependencies.dependency.scope' for org.openmrs.module:formentryapp-api:jar:tests must be one of [provided, compile, runtime, test, system, import] but is 'tests'. @ org.openmrs.distro:referenceapplication:2.9.0, C:\Users\subif\.m2\repository\org\openmrs\distro\referenceapplication\2.9.0\referenceapplication-2.9.0.pom, line 867, column 12
  22. [WARNING] 'dependencyManagement.dependencies.dependency.scope' for org.openmrs.module:legacyui-api:jar:tests must be one of [provided, compile, runtime, test, system, import] but is 'tests'. @ org.openmrs.distro:referenceapplication:2.9.0, C:\Users\subif\.m2\repository\org\openmrs\distro\referenceapplication\2.9.0\referenceapplication-2.9.0.pom, line 934, column 12
  23. [WARNING] 'dependencyManagement.dependencies.dependency.scope' for org.openmrs.module:reportingcompatibility-api:jar:tests must be one of [provided, compile, runtime, test, system, import] but is 'tests'. @ org.openmrs.distro:referenceapplication:2.9.0, C:\Users\subif\.m2\repository\org\openmrs\distro\referenceapplication\2.9.0\referenceapplication-2.9.0.pom, line 953, column 12
  24. [WARNING]
  25. [WARNING] It is highly recommended to fix these problems because they threaten the stability of your build.
  26. [WARNING]
  27. [WARNING] For this reason, future Maven versions might no longer support building such malformed projects.
  28. [WARNING]
  29. [INFO] ------------------------------------------------------------------------
  30. [INFO] Reactor Build Order:
  31. [INFO]
  32. [INFO] Map Location                                                       [pom]
  33. [INFO] Map Location API                                                   [jar]
  34. [INFO] Map Location OMOD                                                  [jar]
  35. [INFO]
  36. [INFO] ----------------< org.openmrs.maplocation:maplocation >-----------------
  37. [INFO] Building Map Location 1.0.0-SNAPSHOT                               [1/3]
  38. [INFO] --------------------------------[ pom ]---------------------------------
  39. [INFO]
  40. [INFO] --- buildnumber-maven-plugin:1.1:create (default) @ maplocation ---
  41. [INFO] Checking for local modifications: skipped.
  42. [INFO] Updating project files from SCM: skipped.
  43. [INFO] ShortRevision tag detected. The value is '6'.
  44. [INFO] Executing: cmd.exe /X /C "git rev-parse --verify --short=6 HEAD"
  45. [INFO] Working directory: C:\Users\subif\maplocation
  46. [INFO] Storing buildNumber: 0 at timestamp: 1563786816903
  47. [INFO] ShortRevision tag detected. The value is '6'.
  48. [INFO] Executing: cmd.exe /X /C "git rev-parse --verify --short=6 HEAD"
  49. [INFO] Working directory: C:\Users\subif\maplocation
  50. [INFO] Storing buildScmBranch: UNKNOWN_BRANCH
  51. [INFO]
  52. [INFO] --- maven-java-formatter-plugin:0.4:format (default) @ maplocation ---
  53. [INFO] Using 'UTF-8' encoding to format source files.
  54. [INFO] Number of files to be formatted: 0
  55. [INFO]
  56. [INFO] --- maven-antrun-plugin:1.3:run (default) @ maplocation ---
  57. [INFO] Executing tasks
  58.      [copy] Copying 6 files to C:\Users\subif\openmrs\distro-2-9-0\tmp\openmrs\WEB-INF\view\module\maven-parent-openmrs-module
  59. [INFO] Executed tasks
  60. [INFO]
  61. [INFO] --------------< org.openmrs.maplocation:maplocation-api >---------------
  62. [INFO] Building Map Location API 1.0.0-SNAPSHOT                           [2/3]
  63. [INFO] --------------------------------[ jar ]---------------------------------
  64. [INFO]
  65. [INFO] --- buildnumber-maven-plugin:1.1:create (default) @ maplocation-api ---
  66. [INFO]
  67. [INFO] --- maven-java-formatter-plugin:0.4:format (default) @ maplocation-api ---
  68. [INFO] Using 'UTF-8' encoding to format source files.
  69. [INFO] Number of files to be formatted: 8
  70. [INFO] Successfully formatted: 0 file(s)
  71. [INFO] Fail to format        : 0 file(s)
  72. [INFO] Skipped               : 8 file(s)
  73. [INFO] Approximate time taken: 0s
  74. [INFO]
  75. [INFO] --- maven-resources-plugin:2.6:resources (default-resources) @ maplocation-api ---
  76. [INFO] Using 'UTF-8' encoding to copy filtered resources.
  77. [INFO] Copying 5 resources
  78. [INFO] Copying 0 resource
  79. [INFO] skip non existing resourceDirectory C:\Users\subif\maplocation\api\src\main\webapp
  80. [INFO] skip non existing resourceDirectory C:\Users\subif\maplocation\api\src\main\webapp
  81. [INFO]
  82. [INFO] --- maven-compiler-plugin:3.1:compile (default-compile) @ maplocation-api ---
  83. [INFO] Nothing to compile - all classes are up to date
  84. [INFO]
  85. [INFO] --- maven-resources-plugin:2.6:testResources (default-testResources) @ maplocation-api ---
  86. [INFO] Using 'UTF-8' encoding to copy filtered resources.
  87. [INFO] skip non existing resourceDirectory C:\Users\subif\maplocation\api\src\test\resources
  88. [INFO] skip non existing resourceDirectory C:\Users\subif\maplocation\api\src\test\resources
  89. [INFO]
  90. [INFO] --- maven-compiler-plugin:3.1:testCompile (default-testCompile) @ maplocation-api ---
  91. [INFO] Changes detected - recompiling the module!
  92. [INFO] Compiling 2 source files to C:\Users\subif\maplocation\api\target\test-classes
  93. [INFO]
  94. [INFO] --- maven-surefire-plugin:2.12.4:test (default-test) @ maplocation-api ---
  95. [INFO] Surefire report directory: C:\Users\subif\maplocation\api\target\surefire-reports
  96.  
  97. -------------------------------------------------------
  98.  T E S T S
  99. -------------------------------------------------------
  100. Running org.openmrs.module.maplocation.api.dao.MapLocationDaoTest
  101. Tests run: 1, Failures: 0, Errors: 0, Skipped: 0, Time elapsed: 8.858 sec
  102. Running org.openmrs.module.maplocation.api.MapLocationServiceTest
  103. Tests run: 1, Failures: 0, Errors: 0, Skipped: 0, Time elapsed: 0.131 sec
  104.  
  105. Results :
  106.  
  107. Tests run: 2, Failures: 0, Errors: 0, Skipped: 0
  108.  
  109. [INFO]
  110. [INFO] --- maven-jar-plugin:2.5:jar (default-jar) @ maplocation-api ---
  111. [INFO] Building jar: C:\Users\subif\maplocation\api\target\maplocation-api-1.0.0-SNAPSHOT.jar
  112. [INFO]
  113. [INFO] --- maven-antrun-plugin:1.3:run (default) @ maplocation-api ---
  114. [INFO] Executing tasks
  115. [INFO] ------------------------------------------------------------------------
  116. [INFO] Reactor Summary for Map Location 1.0.0-SNAPSHOT:
  117. [INFO]
  118. [INFO] Map Location ....................................... SUCCESS [  1.448 s]
  119. [INFO] Map Location API ................................... FAILURE [ 12.679 s]
  120. [INFO] Map Location OMOD .................................. SKIPPED
  121. [INFO] ------------------------------------------------------------------------
  122. [INFO] BUILD FAILURE
  123. [INFO] ------------------------------------------------------------------------
  124. [INFO] Total time:  15.283 s
  125. [INFO] Finished at: 2019-07-22T02:13:50-07:00
  126. [INFO] ------------------------------------------------------------------------
  127. [ERROR] Failed to execute goal org.apache.maven.plugins:maven-antrun-plugin:1.3:run (default) on project maplocation-api: An Ant BuildException has occured: C:\Users\subif\maplocation\api\omod\src\main\webapp not found. -> [Help 1]
  128. [ERROR]
  129. [ERROR] To see the full stack trace of the errors, re-run Maven with the -e switch.
  130. [ERROR] Re-run Maven using the -X switch to enable full debug logging.
  131. [ERROR]
  132. [ERROR] For more information about the errors and possible solutions, please read the following articles:
  133. [ERROR] [Help 1] http://cwiki.apache.org/confluence/display/MAVEN/MojoExecutionException
  134. [ERROR]
  135. [ERROR] After correcting the problems, you can resume the build with the command
  136. [ERROR]   mvn <goals> -rf :maplocation-api
RAW Paste Data
We use cookies for various purposes including analytics. By continuing to use Pastebin, you agree to our use of cookies as described in the Cookies Policy. OK, I Understand
 
Top