daily pastebin goal
18%
SHARE
TWEET

Untitled

a guest Oct 22nd, 2018 68 Never
Not a member of Pastebin yet? Sign Up, it unlocks many cool features!
  1. Chrome 69.0.3497 (Linux 0.0.0): Executed 196 of 209 (skipped 3) SUCCESS (0 secs / 31.433 secs)
  2. ERROR: 'Unhandled Promise rejection:', 'Failed to execute 'send' on 'XMLHttpRequest': Failed to load 'ng:///MatSelectModule/MatSelect.ngfactory.js'.', '; Zone:', 'angular', '; Task:', 'Promise.then', '; Value:', DOMException{stack: 'Error: Failed to execute 'send' on 'XMLHttpRequest': Failed to load 'ng:///MatSelectModule/MatSelect.ngfactory.js'.
  3.     at http://localhost:9876/_karma_webpack_/webpack:/home/ruphine/FineractCN/integration-tests/fineract-cn-fims-web-app/node_modules/zone.js/dist/zone.js:2765:1
  4.     at XMLHttpRequest.proto.(anonymous function) [as send] (http://localhost:9876/_karma_webpack_/webpack:/home/ruphine/FineractCN/integration-tests/fineract-cn-fims-web-app/node_modules/zone.js/dist/zone.js:1274:1)
  5.     at Array.<anonymous> (http://localhost:9876/base/node_modules/source-map-support/browser-source-map-support.js?3a3db3887ab08eb10eb5bdd356db8d254e26effa:107:134)
  6.     at http://localhost:9876/base/node_modules/source-map-support/browser-source-map-support.js?3a3db3887ab08eb10eb5bdd356db8d254e26effa:101:106
  7.     at Array.<anonymous> (http://localhost:9876/base/node_modules/source-map-support/browser-source-map-support.js?3a3db3887ab08eb10eb5bdd356db8d254e26effa:107:501)
  8.     at http://localhost:9876/base/node_modules/source-map-support/browser-source-map-support.js?3a3db3887ab08eb10eb5bdd356db8d254e26effa:101:106
  9.     at a (http://localhost:9876/base/node_modules/source-map-support/browser-source-map-support.js?3a3db3887ab08eb10eb5bdd356db8d254e26effa:101:312)
  10.     at b (http://localhost:9876/base/node_modules/source-map-support/browser-source-map-support.js?3a3db3887ab08eb10eb5bdd356db8d254e26effa:104:356)
  11.     at http://localhost:9876/base/node_modules/source-map-support/browser-source-map-support.js?3a3db3887ab08eb10eb5bdd356db8d254e26effa:105:245
  12.     at Array.map (<anonymous>)', __zone_symbol__currentTask: ZoneTask{_zone: Zone{_properties: ..., _parent: ..., _name: ..., _zoneDelegate: ...}, runCount: 0, _zoneDelegates: null, _state: 'notScheduled', type: 'microTask', source: 'Promise.then', data: Object{__creationTrace__: ...}, scheduleFn: undefined, cancelFn: null, callback: function () { ... }, invoke: function () { ... }}}, 'Error: Failed to execute 'send' on 'XMLHttpRequest': Failed to load 'ng:///MatSelectModule/MatSelect.ngfactory.js'.
  13.     at http://localhost:9876/_karma_webpack_/webpack:/home/ruphine/FineractCN/integration-tests/fineract-cn-fims-web-app/node_modules/zone.js/dist/zone.js:2765:1
  14.     at XMLHttpRequest.proto.(anonymous function) [as send] (http://localhost:9876/_karma_webpack_/webpack:/home/ruphine/FineractCN/integration-tests/fineract-cn-fims-web-app/node_modules/zone.js/dist/zone.js:1274:1)
  15.     at Array.<anonymous> (http://localhost:9876/base/node_modules/source-map-support/browser-source-map-support.js?3a3db3887ab08eb10eb5bdd356db8d254e26effa:107:134)
  16.     at http://localhost:9876/base/node_modules/source-map-support/browser-source-map-support.js?3a3db3887ab08eb10eb5bdd356db8d254e26effa:101:106
  17.     at Array.<anonymous> (http://localhost:9876/base/node_modules/source-map-support/browser-source-map-support.js?3a3db3887ab08eb10eb5bdd356db8d254e26effa:107:501)
  18.     at http://localhost:9876/base/node_modules/source-map-support/browser-source-map-support.js?3a3db3887ab08eb10eb5bdd356db8d254e26effa:101:106
  19.     at a (http://localhost:9876/base/node_modules/source-map-support/browser-source-map-support.js?3a3db3887ab08eb10eb5bdd356db8d254e26effa:101:312)
  20.     at b (http://localhost:9876/base/node_modules/source-map-support/browser-source-map-support.js?3a3db3887ab08eb10eb5bdd356db8d254e26effa:104:356)
  21.     at http://localhost:9876/base/node_modules/source-map-support/browser-source-map-support.js?3a3db3887ab08eb10eb5bdd356db8d254e26effa:105:245
  22. Chrome 69.0.3497 (Linux 0.0.0) AvailableActionService should merge deposit, loan actions FAILED
  23.     Error: Uncaught (in promise): NetworkError: Failed to execute 'send' on 'XMLHttpRequest': Failed to load 'ng:///MatSelectModule/MatSelect.ngfactory.js'.
  24.     Error: Failed to execute 'send' on 'XMLHttpRequest': Failed to load 'ng:///MatSelectModule/MatSelect.ngfactory.js'.
  25.         at http://localhost:9876/_karma_webpack_/webpack:/home/ruphine/FineractCN/integration-tests/fineract-cn-fims-web-app/node_modules/zone.js/dist/zone.js:2765:1
  26.         at XMLHttpRequest.proto.(anonymous function) [as send] home/ruphine/FineractCN/integration-tests/fineract-cn-fims-web-app/node_modules/zone.js/dist/zone.js:1274:1)
  27.         at Array.<anonymous> (node_modules/source-map-support/browser-source-map-support.js:107:134)
  28.         at node_modules/source-map-support/browser-source-map-support.js:101:106
  29.         at Array.<anonymous> (node_modules/source-map-support/browser-source-map-support.js:107:501)
  30.         at node_modules/source-map-support/browser-source-map-support.js:101:106
  31.         at a (node_modules/source-map-support/browser-source-map-support.js:101:312)
  32.         at b (node_modules/source-map-support/browser-source-map-support.js:104:356)
  33.         at node_modules/source-map-support/browser-source-map-support.js:105:245
  34.         at Array.map (<anonymous>)
  35.         at resolvePromise home/ruphine/FineractCN/integration-tests/fineract-cn-fims-web-app/node_modules/zone.js/dist/zone.js:795:1)
  36.         at http://localhost:9876/_karma_webpack_/webpack:/home/ruphine/FineractCN/integration-tests/fineract-cn-fims-web-app/node_modules/zone.js/dist/zone.js:847:1
  37.         at ZoneDelegate.webpackJsonp.../../../../zone.js/dist/zone.js.ZoneDelegate.invokeTask home/ruphine/FineractCN/integration-tests/fineract-cn-fims-web-app/node_modules/zone.js/dist/zone.js:425:1)
  38.         at ProxyZoneSpec.webpackJsonp.../../../../zone.js/dist/proxy.js.ProxyZoneSpec.onInvokeTask home/ruphine/FineractCN/integration-tests/fineract-cn-fims-web-app/node_modules/zone.js/dist/proxy.js:103:1)
  39.         at ZoneDelegate.webpackJsonp.../../../../zone.js/dist/zone.js.ZoneDelegate.invokeTask home/ruphine/FineractCN/integration-tests/fineract-cn-fims-web-app/node_modules/zone.js/dist/zone.js:424:1)
  40.         at Object.onInvokeTask home/ruphine/FineractCN/integration-tests/fineract-cn-fims-web-app/node_modules/zone.js/dist/zone.js:303:83)
  41.         at ZoneDelegate.webpackJsonp.../../../../zone.js/dist/zone.js.ZoneDelegate.invokeTask home/ruphine/FineractCN/integration-tests/fineract-cn-fims-web-app/node_modules/zone.js/dist/zone.js:424:1)
  42.         at Object.onInvokeTask home/ruphine/FineractCN/integration-tests/fineract-cn-fims-web-app/node_modules/@angular/core/@angular/core.es5.js:3881:1)
  43.         at ZoneDelegate.webpackJsonp.../../../../zone.js/dist/zone.js.ZoneDelegate.invokeTask home/ruphine/FineractCN/integration-tests/fineract-cn-fims-web-app/node_modules/zone.js/dist/zone.js:424:1)
  44.         at Zone.webpackJsonp.../../../../zone.js/dist/zone.js.Zone.runTask home/ruphine/FineractCN/integration-tests/fineract-cn-fims-web-app/node_modules/zone.js/dist/zone.js:192:1)
  45. Chrome 69.0.3497 (Linux 0.0.0): Executed 201 of 209 (1 FAILED) (skipped 3) (0 secs / 34.641 secs)
  46. Chrome 69.0.3497 (Linux 0.0.0) AvailableActionService should merge deposit, loan actions FAILED
  47.     Error: Uncaught (in promise): NetworkError: Failed to execute 'send' on 'XMLHttpRequest': Failed to load 'ng:///MatSelectModule/MatSelect.ngfactory.js'.
  48.     Error: Failed to execute 'send' on 'XMLHttpRequest': Failed to load 'ng:///MatSelectModule/MatSelect.ngfactory.js'.
  49.         at http://localhost:9876/_karma_webpack_/webpack:/home/ruphine/FineractCN/integration-tests/fineract-cn-fims-web-app/node_modules/zone.js/dist/zone.js:2765:1
  50.         at XMLHttpRequest.proto.(anonymous function) [as send] home/ruphine/FineractCN/integration-tests/fineract-cn-fims-web-app/node_modules/zone.js/dist/zone.js:1274:1)
  51.         at Array.<anonymous> (node_modules/source-map-support/browser-source-map-support.js:107:134)
  52.         at node_modules/source-map-support/browser-source-map-support.js:101:106
  53.         at Array.<anonymous> (node_modules/source-map-support/browser-source-map-support.js:107:501)
  54.         at node_modules/source-map-support/browser-source-map-support.js:101:106
  55.         at a (node_modules/source-map-support/browser-source-map-support.js:101:312)
  56.         at b (node_modules/source-map-support/browser-source-map-support.js:104:356)
  57.         at node_modules/source-map-support/browser-source-map-support.js:105:245
  58.         at Array.map (<anonymous>)
  59.         at resolvePromise home/ruphine/FineractCN/integration-tests/fineract-cn-fims-web-app/node_modules/zone.js/dist/zone.js:795:1)
  60.         at http://localhost:9876/_karma_webpack_/webpack:/home/ruphine/FineractCN/integration-tests/fineract-cn-fims-web-app/node_modules/zone.js/dist/zone.js:847:1
  61.         at ZoneDelegate.webpackJsonp.../../../../zone.js/dist/zone.js.ZoneDelegate.invokeTask home/ruphine/FineractCN/integration-tests/fineract-cn-fims-web-app/node_modules/zone.js/dist/zone.js:425:1)
  62.         at ProxyZoneSpec.webpackJsonp.../../../../zone.js/dist/proxy.js.ProxyZoneSpec.onInvokeTask home/ruphine/FineractCN/integration-tests/fineract-cn-fims-web-app/node_modules/zone.js/dist/proxy.js:103:1)
  63.         at ZoneDelegate.webpackJsonp.../../../../zone.js/dist/zone.js.ZoneDelegate.invokeTask home/ruphine/FineractCN/integration-tests/fineract-cn-fims-web-app/node_modules/zone.js/dist/zone.js:424:1)
  64.         at Object.onInvokeTask home/ruphine/FineractCN/integration-tests/fineract-cn-fims-web-app/node_modules/zone.js/dist/zone.js:303:83)
  65.         at ZoneDelegate.webpackJsonp.../../../../zone.js/dist/zone.js.ZoneDelegate.invokeTask home/ruphine/FineractCN/integration-tests/fineract-cn-fims-web-app/node_modules/zone.js/dist/zone.js:424:1)
  66.         at Object.onInvokeTask home/ruphine/FineractCN/integration-tests/fineract-cn-fims-web-app/node_modules/@angular/core/@angular/core.es5.js:3881:1)
  67.         at ZoneDelegate.webpackJsonp.../../../../zone.js/dist/zone.js.ZoneDelegate.invokeTask home/ruphine/FineractCN/integration-tests/fineract-cn-fims-web-app/node_modules/zone.js/dist/zone.js:424:1)
  68. Chrome 69.0.3497 (Linux 0.0.0): Executed 206 of 209 (1 FAILED) (skipped 3) (34.781 secs / 34.665 secs)
  69. TOTAL: 1 FAILED, 205 SUCCESS
  70. TOTAL: 1 FAILED, 205 SUCCESS
  71. TOTAL: 1 FAILED, 205 SUCCESS
  72. npm ERR! code ELIFECYCLE
  73. npm ERR! errno 1
  74. npm ERR! fims@0.1.0 test: `ng test --single-run`
  75. npm ERR! Exit status 1
  76. npm ERR!
  77. npm ERR! Failed at the fims@0.1.0 test script.
  78. npm ERR! This is probably not a problem with npm. There is likely additional logging output above.
  79.  
  80. npm ERR! A complete log of this run can be found in:
  81. npm ERR!     /home/ruphine/.npm/_logs/2018-10-22T16_50_29_419Z-debug.log
RAW Paste Data
We use cookies for various purposes including analytics. By continuing to use Pastebin, you agree to our use of cookies as described in the Cookies Policy. OK, I Understand
 
Top