Christopher_Goodwin

Is Git version 0.4.15-dev-351cc2e bad?

Apr 6th, 2017
95
Never
Not a member of Pastebin yet? Sign Up, it unlocks many cool features!
  1. Build just failed for me, using Ubuntu 16.10 64 bit.
  2.  
  3. Is it just the current state of dev, and can not build for others, or is it just me?
  4.  
  5.  
  6. _______
  7. < Roar! >
  8. -------
  9. \ / \ //\
  10. \ |\___/| / \// \\
  11. /0 0 \__ / // | \ \
  12. / / \/_/ // | \ \
  13. @_^_@'/ \/_ // | \ \
  14. //_^_/ \/_ // | \ \
  15. ( //) | \/// | \ \
  16. ( / /) _|_ / ) // | \ _\
  17. ( // /) '/,_ _ _/ ( ; -. | _ _\.-~ .-~~~^-.
  18. (( / / )) ,-{ _ `-.|.-~-. .~ `.
  19. (( // / )) '/\ / ~-. _ .-~ .-~^-. \
  20. (( /// )) `. { } / \ \
  21. (( / )) .----~-.\ \-' .~ \ `. \^-.
  22. ///.----..> \ _ -~ `. ^-` ^-_
  23. ///-._ _ _ _ _ _ _}^ - - - - ~ ~-- ,.-~
  24. /.-~
  25. xxxxx@xxxxx:~$ cd minetest
  26. xxxxx@xxxxx:~/minetest$ git pull
  27. Already up-to-date.
  28. xxxxx@xxxxx:~/minetest$ cd games/minetest_game
  29. xxxxx@xxxxx:~/minetest/games/minetest_game$ git pull
  30. Already up-to-date.
  31. xxxxx@xxxxx:~/minetest/games/minetest_game$ cd
  32. xxxxx@xxxxx:~$ cd minetest
  33. xxxxx@xxxxx:~/minetest$ make clean
  34. xxxxx@xxxxx:~/minetest$ cmake . -DBUILD_CLIENT=1 -DBUILD_SERVER=1 -DCMAKE_BUILD_TYPE=Release -DENABLE_CURL=1 -DENABLE_FREETYPE=1 -DENABLE_GLES=1 -DENABLE_LEVELDB=0 -DENABLE_REDIS=0 -DENABLE_SPATIAL=1 -DENABLE_SOUND=1 -DENABLE_LUAJIT=1 -DENABLE_SYSTEM_GMP=1 -DRUN_IN_PLACE=1
  35. -- *** Will build version 0.4.15-dev ***
  36. -- Using LuaJIT provided by system.
  37. -- Using GMP provided by system.
  38. -- Using bundled JSONCPP library.
  39. -- cURL support enabled.
  40. -- GetText disabled.
  41. -- Sound enabled.
  42. -- Freetype enabled.
  43. -- ncurses console enabled.
  44. -- Could NOT find PostgreSQL (missing: PostgreSQL_LIBRARY PostgreSQL_INCLUDE_DIR PostgreSQL_TYPE_INCLUDE_DIR)
  45. -- PostgreSQL not found!
  46. -- SpatialIndex AreaStore backend enabled.
  47. -- Configuring done
  48. -- Generating done
  49. -- Build files have been written to: /home/christopher/minetest
  50. xxxxx@xxxxx:~/minetest$ make -j 4
  51. [ 1%] Building CXX object lib/jsoncpp/CMakeFiles/jsoncpp.dir/jsoncpp.cpp.o
  52. [ 1%] Building CXX object src/cguittfont/CMakeFiles/cguittfont.dir/xCGUITTFont.cpp.o
  53. -- *** Detected Git version 0.4.15-dev-351cc2e ***
  54. [ 1%] Built target GenerateVersion
  55. /home/christopher/minetest/lib/jsoncpp/jsoncpp.cpp:233:14: warning: ‘template<class> class std::auto_ptr’ is deprecated [-Wdeprecated-declarations]
  56. typedef std::auto_ptr<CharReader> CharReaderPtr;
  57. ^~~~~~~~
  58. In file included from /usr/include/c++/6/memory:81:0,
  59. from /home/christopher/minetest/lib/jsoncpp/jsoncpp.cpp:205:
  60. /usr/include/c++/6/bits/unique_ptr.h:49:28: note: declared here
  61. template<typename> class auto_ptr;
  62. ^~~~~~~~
  63. /home/christopher/minetest/lib/jsoncpp/jsoncpp.cpp:3798:14: warning: ‘template<class> class std::auto_ptr’ is deprecated [-Wdeprecated-declarations]
  64. typedef std::auto_ptr<StreamWriter> StreamWriterPtr;
  65. ^~~~~~~~
  66. In file included from /usr/include/c++/6/memory:81:0,
  67. from /home/christopher/minetest/lib/jsoncpp/jsoncpp.cpp:205:
  68. /usr/include/c++/6/bits/unique_ptr.h:49:28: note: declared here
  69. template<typename> class auto_ptr;
  70. ^~~~~~~~
  71. [ 1%] Linking CXX static library libcguittfont.a
  72. [ 1%] Built target cguittfont
  73. [ 1%] Linking CXX static library libjsoncpp.a
  74. [ 1%] Built target jsoncpp
  75. [ 1%] Building CXX object src/CMakeFiles/minetestserver.dir/network/connection.cpp.o
  76. [ 1%] Building CXX object src/CMakeFiles/minetestserver.dir/network/networkpacket.cpp.o
  77. [ 1%] Building CXX object src/CMakeFiles/minetestserver.dir/network/serveropcodes.cpp.o
  78. [ 1%] Building CXX object src/CMakeFiles/minetest.dir/client/clientlauncher.cpp.o
  79. [ 2%] Building CXX object src/CMakeFiles/minetestserver.dir/network/serverpackethandler.cpp.o
  80. [ 2%] Building CXX object src/CMakeFiles/minetestserver.dir/script/common/c_content.cpp.o
  81. /home/christopher/minetest/src/network/serverpackethandler.cpp: In member function ‘void Server::handleCommand_Damage(NetworkPacket*)’:
  82. /home/christopher/minetest/src/network/serverpackethandler.cpp:1110:7: error: ‘playerSAO’ was not declared in this scope
  83. if (playerSAO->isDead()) {
  84. ^~~~~~~~~
  85. src/CMakeFiles/minetestserver.dir/build.make:134: recipe for target 'src/CMakeFiles/minetestserver.dir/network/serverpackethandler.cpp.o' failed
  86. make[2]: *** [src/CMakeFiles/minetestserver.dir/network/serverpackethandler.cpp.o] Error 1
  87. make[2]: *** Waiting for unfinished jobs....
  88. [ 2%] Building CXX object src/CMakeFiles/minetest.dir/client/joystick_controller.cpp.o
  89. [ 3%] Building CXX object src/CMakeFiles/minetest.dir/client/tile.cpp.o
  90. [ 3%] Building CXX object src/CMakeFiles/minetest.dir/irrlicht_changes/static_text.cpp.o
  91. [ 3%] Building CXX object src/CMakeFiles/minetest.dir/network/clientopcodes.cpp.o
  92. CMakeFiles/Makefile2:217: recipe for target 'src/CMakeFiles/minetestserver.dir/all' failed
  93. make[1]: *** [src/CMakeFiles/minetestserver.dir/all] Error 2
  94. make[1]: *** Waiting for unfinished jobs....
  95. [ 3%] Building CXX object src/CMakeFiles/minetest.dir/network/clientpackethandler.cpp.o
  96. [ 4%] Building CXX object src/CMakeFiles/minetest.dir/network/connection.cpp.o
  97. [ 4%] Building CXX object src/CMakeFiles/minetest.dir/network/networkpacket.cpp.o
  98. [ 4%] Building CXX object src/CMakeFiles/minetest.dir/network/serveropcodes.cpp.o
  99. [ 4%] Building CXX object src/CMakeFiles/minetest.dir/network/serverpackethandler.cpp.o
  100. [ 5%] Building CXX object src/CMakeFiles/minetest.dir/script/clientscripting.cpp.o
  101. [ 5%] Building CXX object src/CMakeFiles/minetest.dir/script/common/c_content.cpp.o
  102. /home/christopher/minetest/src/network/serverpackethandler.cpp: In member function ‘void Server::handleCommand_Damage(NetworkPacket*)’:
  103. /home/christopher/minetest/src/network/serverpackethandler.cpp:1110:7: error: ‘playerSAO’ was not declared in this scope
  104. if (playerSAO->isDead()) {
  105. ^~~~~~~~~
  106. src/CMakeFiles/minetest.dir/build.make:278: recipe for target 'src/CMakeFiles/minetest.dir/network/serverpackethandler.cpp.o' failed
  107. make[2]: *** [src/CMakeFiles/minetest.dir/network/serverpackethandler.cpp.o] Error 1
  108. make[2]: *** Waiting for unfinished jobs....
  109. CMakeFiles/Makefile2:288: recipe for target 'src/CMakeFiles/minetest.dir/all' failed
  110. make[1]: *** [src/CMakeFiles/minetest.dir/all] Error 2
  111. Makefile:149: recipe for target 'all' failed
  112. make: *** [all] Error 2
  113. xxxxx@xxxxx:~/minetest$
RAW Paste Data