Guest User

openimagiio error

a guest
Nov 1st, 2020
43
Never
Not a member of Pastebin yet? Sign Up, it unlocks many cool features!
  1. oiio-Release-2.0.13/testsuite/maketx/src/bump.exr
  2. oiio-Release-2.0.13/testsuite/misnamed-file/
  3. oiio-Release-2.0.13/testsuite/misnamed-file/ref/
  4. oiio-Release-2.0.13/testsuite/misnamed-file/ref/out.txt
  5. oiio-Release-2.0.13/testsuite/misnamed-file/run.py
  6. oiio-Release-2.0.13/testsuite/missingcolor/
  7. oiio-Release-2.0.13/testsuite/missingcolor/ref/
  8. oiio-Release-2.0.13/testsuite/missingcolor/ref/missing.tif
  9. oiio-Release-2.0.13/testsuite/missingcolor/ref/out.err.txt
  10. oiio-Release-2.0.13/testsuite/missingcolor/ref/out.txt
  11. oiio-Release-2.0.13/testsuite/missingcolor/run.py
  12. oiio-Release-2.0.13/testsuite/missingcolor/src/
  13. oiio-Release-2.0.13/testsuite/missingcolor/src/makepartialexr.py
  14. oiio-Release-2.0.13/testsuite/missingcolor/src/partial.exr
  15. oiio-Release-2.0.13/testsuite/nonwhole-tiles/
  16. oiio-Release-2.0.13/testsuite/nonwhole-tiles/ref/
  17. oiio-Release-2.0.13/testsuite/nonwhole-tiles/ref/out.txt
  18. oiio-Release-2.0.13/testsuite/nonwhole-tiles/run.py
  19. oiio-Release-2.0.13/testsuite/null/
  20. oiio-Release-2.0.13/testsuite/null/ref/
  21. oiio-Release-2.0.13/testsuite/null/ref/out.txt
  22. oiio-Release-2.0.13/testsuite/null/run.py
  23. oiio-Release-2.0.13/testsuite/oiiotool-attribs/
  24. oiio-Release-2.0.13/testsuite/oiiotool-attribs/ref/
  25. oiio-Release-2.0.13/testsuite/oiiotool-attribs/ref/out.txt
  26. oiio-Release-2.0.13/testsuite/oiiotool-attribs/run.py
  27. oiio-Release-2.0.13/testsuite/oiiotool-color/
  28. oiio-Release-2.0.13/testsuite/oiiotool-color/ref/
  29. oiio-Release-2.0.13/testsuite/oiiotool-color/ref/colormap-custom.tif
  30. oiio-Release-2.0.13/testsuite/oiiotool-color/ref/colormap-inferno.tif
  31. oiio-Release-2.0.13/testsuite/oiiotool-color/ref/contrast-inverse.tif
  32. oiio-Release-2.0.13/testsuite/oiiotool-color/ref/contrast-shrink.tif
  33. oiio-Release-2.0.13/testsuite/oiiotool-color/ref/contrast-sigmoid5.tif
  34. oiio-Release-2.0.13/testsuite/oiiotool-color/ref/contrast-stretch.tif
  35. oiio-Release-2.0.13/testsuite/oiiotool-color/ref/contrast-threshold.tif
  36. oiio-Release-2.0.13/testsuite/oiiotool-color/ref/greyalpha_Cineon.tif
  37. oiio-Release-2.0.13/testsuite/oiiotool-color/ref/greyalpha_Cineon_un.tif
  38. oiio-Release-2.0.13/testsuite/oiiotool-color/ref/greyalpha_sRGB.tif
  39. oiio-Release-2.0.13/testsuite/oiiotool-color/ref/greyalpha_sRGB_un.tif
  40. oiio-Release-2.0.13/testsuite/oiiotool-color/ref/out.txt
  41. oiio-Release-2.0.13/testsuite/oiiotool-color/ref/premult.exr
  42. oiio-Release-2.0.13/testsuite/oiiotool-color/ref/rgbfromtga.png
  43. oiio-Release-2.0.13/testsuite/oiiotool-color/ref/tahoe-ccmatrix.tif
  44. oiio-Release-2.0.13/testsuite/oiiotool-color/ref/unpremult.exr
  45. oiio-Release-2.0.13/testsuite/oiiotool-color/run.py
  46. oiio-Release-2.0.13/testsuite/oiiotool-color/src/
  47. oiio-Release-2.0.13/testsuite/oiiotool-color/src/rgba.tga
  48. oiio-Release-2.0.13/testsuite/oiiotool-composite/
  49. oiio-Release-2.0.13/testsuite/oiiotool-composite/ref/
  50. oiio-Release-2.0.13/testsuite/oiiotool-composite/ref/a_over_b.exr
  51. oiio-Release-2.0.13/testsuite/oiiotool-composite/ref/out.txt
  52. oiio-Release-2.0.13/testsuite/oiiotool-composite/run.py
  53. oiio-Release-2.0.13/testsuite/oiiotool-composite/src/
  54. oiio-Release-2.0.13/testsuite/oiiotool-composite/src/a.exr
  55. oiio-Release-2.0.13/testsuite/oiiotool-composite/src/b.exr
  56. oiio-Release-2.0.13/testsuite/oiiotool-copy/
  57. oiio-Release-2.0.13/testsuite/oiiotool-copy/ref/
  58. oiio-Release-2.0.13/testsuite/oiiotool-copy/ref/out.txt
  59. oiio-Release-2.0.13/testsuite/oiiotool-copy/run.py
  60. oiio-Release-2.0.13/testsuite/oiiotool-deep/
  61. oiio-Release-2.0.13/testsuite/oiiotool-deep/ref/
  62. oiio-Release-2.0.13/testsuite/oiiotool-deep/ref/ch.exr
  63. oiio-Release-2.0.13/testsuite/oiiotool-deep/ref/crop1.exr
  64. oiio-Release-2.0.13/testsuite/oiiotool-deep/ref/crop2.exr
  65. oiio-Release-2.0.13/testsuite/oiiotool-deep/ref/deep_addc.exr
  66. oiio-Release-2.0.13/testsuite/oiiotool-deep/ref/deep_divc.exr
  67. oiio-Release-2.0.13/testsuite/oiiotool-deep/ref/deep_mulc.exr
  68. oiio-Release-2.0.13/testsuite/oiiotool-deep/ref/deep_subc.exr
  69. oiio-Release-2.0.13/testsuite/oiiotool-deep/ref/deepen.exr
  70. oiio-Release-2.0.13/testsuite/oiiotool-deep/ref/deepmerge.exr
  71. oiio-Release-2.0.13/testsuite/oiiotool-deep/ref/flat.exr
  72. oiio-Release-2.0.13/testsuite/oiiotool-deep/ref/out.txt
  73. oiio-Release-2.0.13/testsuite/oiiotool-deep/ref/resampled-balls.exr
  74. oiio-Release-2.0.13/testsuite/oiiotool-deep/ref/trim1.exr
  75. oiio-Release-2.0.13/testsuite/oiiotool-deep/ref/trim2.exr
  76. oiio-Release-2.0.13/testsuite/oiiotool-deep/run.py
  77. oiio-Release-2.0.13/testsuite/oiiotool-deep/src/
  78. oiio-Release-2.0.13/testsuite/oiiotool-deep/src/deep-nosamples.exr
  79. oiio-Release-2.0.13/testsuite/oiiotool-deep/src/deep-onesample.exr
  80. oiio-Release-2.0.13/testsuite/oiiotool-deep/src/deepalpha.exr
  81. oiio-Release-2.0.13/testsuite/oiiotool-fixnan/
  82. oiio-Release-2.0.13/testsuite/oiiotool-fixnan/ref/
  83. oiio-Release-2.0.13/testsuite/oiiotool-fixnan/ref/black.exr
  84. oiio-Release-2.0.13/testsuite/oiiotool-fixnan/ref/box3.exr
  85. oiio-Release-2.0.13/testsuite/oiiotool-fixnan/ref/out.txt
  86. oiio-Release-2.0.13/testsuite/oiiotool-fixnan/run.py
  87. oiio-Release-2.0.13/testsuite/oiiotool-fixnan/src/
  88. oiio-Release-2.0.13/testsuite/oiiotool-fixnan/src/bad.exr
  89. oiio-Release-2.0.13/testsuite/oiiotool-maketx/
  90. oiio-Release-2.0.13/testsuite/oiiotool-maketx/ref/
  91. oiio-Release-2.0.13/testsuite/oiiotool-maketx/ref/out-rhel7.txt
  92. oiio-Release-2.0.13/testsuite/oiiotool-maketx/ref/out.txt
  93. oiio-Release-2.0.13/testsuite/oiiotool-maketx/run.py
  94. oiio-Release-2.0.13/testsuite/oiiotool-pattern/
  95. oiio-Release-2.0.13/testsuite/oiiotool-pattern/ref/
  96. oiio-Release-2.0.13/testsuite/oiiotool-pattern/ref/box.tif
  97. oiio-Release-2.0.13/testsuite/oiiotool-pattern/ref/fill4.tif
  98. oiio-Release-2.0.13/testsuite/oiiotool-pattern/ref/filled.tif
  99. oiio-Release-2.0.13/testsuite/oiiotool-pattern/ref/fillh.tif
  100. oiio-Release-2.0.13/testsuite/oiiotool-pattern/ref/fillv.tif
  101. oiio-Release-2.0.13/testsuite/oiiotool-pattern/ref/lines.tif
  102. oiio-Release-2.0.13/testsuite/oiiotool-pattern/ref/noise-gauss.tif
  103. oiio-Release-2.0.13/testsuite/oiiotool-pattern/ref/noise-salt.tif
  104. oiio-Release-2.0.13/testsuite/oiiotool-pattern/ref/noise-uniform3.tif
  105. oiio-Release-2.0.13/testsuite/oiiotool-pattern/ref/out.txt
  106. oiio-Release-2.0.13/testsuite/oiiotool-pattern/ref/pattern-const.tif
  107. oiio-Release-2.0.13/testsuite/oiiotool-pattern/ref/pattern-gradient4.tif
  108. oiio-Release-2.0.13/testsuite/oiiotool-pattern/ref/pattern-gradienth.tif
  109. oiio-Release-2.0.13/testsuite/oiiotool-pattern/ref/pattern-gradientv.tif
  110. oiio-Release-2.0.13/testsuite/oiiotool-pattern/run.py
  111. oiio-Release-2.0.13/testsuite/oiiotool-readerror/
  112. oiio-Release-2.0.13/testsuite/oiiotool-readerror/TRAVIS_SKIP_LSAN
  113. oiio-Release-2.0.13/testsuite/oiiotool-readerror/ref/
  114. oiio-Release-2.0.13/testsuite/oiiotool-readerror/ref/out.err-alt.txt
  115. oiio-Release-2.0.13/testsuite/oiiotool-readerror/ref/out.err-alt2.txt
  116. oiio-Release-2.0.13/testsuite/oiiotool-readerror/ref/out.err-debug.txt
  117. oiio-Release-2.0.13/testsuite/oiiotool-readerror/ref/out.err.txt
  118. oiio-Release-2.0.13/testsuite/oiiotool-readerror/ref/out.txt
  119. oiio-Release-2.0.13/testsuite/oiiotool-readerror/run.py
  120. oiio-Release-2.0.13/testsuite/oiiotool-readerror/src/
  121. oiio-Release-2.0.13/testsuite/oiiotool-readerror/src/incomplete.exr
  122. oiio-Release-2.0.13/testsuite/oiiotool-spi/
  123. oiio-Release-2.0.13/testsuite/oiiotool-spi/ref/
  124. oiio-Release-2.0.13/testsuite/oiiotool-spi/ref/out.txt
  125. oiio-Release-2.0.13/testsuite/oiiotool-spi/run.py
  126. oiio-Release-2.0.13/testsuite/oiiotool-subimage/
  127. oiio-Release-2.0.13/testsuite/oiiotool-subimage/ref/
  128. oiio-Release-2.0.13/testsuite/oiiotool-subimage/ref/out-oldfreetype.txt
  129. oiio-Release-2.0.13/testsuite/oiiotool-subimage/ref/out.txt
  130. oiio-Release-2.0.13/testsuite/oiiotool-subimage/ref/subimage1.exr
  131. oiio-Release-2.0.13/testsuite/oiiotool-subimage/ref/subimage2.exr
  132. oiio-Release-2.0.13/testsuite/oiiotool-subimage/ref/subimageB1-freetype2.6.5.exr
  133. oiio-Release-2.0.13/testsuite/oiiotool-subimage/ref/subimageB1-freetype2.7.exr
  134. oiio-Release-2.0.13/testsuite/oiiotool-subimage/ref/subimageB1-oldfreetype.exr
  135. oiio-Release-2.0.13/testsuite/oiiotool-subimage/ref/subimageB1.exr
  136. oiio-Release-2.0.13/testsuite/oiiotool-subimage/ref/subimageD3-freetype2.7.exr
  137. oiio-Release-2.0.13/testsuite/oiiotool-subimage/ref/subimageD3-oldfreetype.exr
  138. oiio-Release-2.0.13/testsuite/oiiotool-subimage/ref/subimageD3.exr
  139. oiio-Release-2.0.13/testsuite/oiiotool-subimage/ref/subimages-2.exr
  140. oiio-Release-2.0.13/testsuite/oiiotool-subimage/ref/subimages-4-freetype2.6.5.exr
  141. oiio-Release-2.0.13/testsuite/oiiotool-subimage/ref/subimages-4-freetype2.7.exr
  142. oiio-Release-2.0.13/testsuite/oiiotool-subimage/ref/subimages-4-oldfreetype.exr
  143. oiio-Release-2.0.13/testsuite/oiiotool-subimage/ref/subimages-4.exr
  144. oiio-Release-2.0.13/testsuite/oiiotool-subimage/run.py
  145. oiio-Release-2.0.13/testsuite/oiiotool-text/
  146. oiio-Release-2.0.13/testsuite/oiiotool-text/ref/
  147. oiio-Release-2.0.13/testsuite/oiiotool-text/ref/aligned-freetype2.4.11.tif
  148. oiio-Release-2.0.13/testsuite/oiiotool-text/ref/aligned.tif
  149. oiio-Release-2.0.13/testsuite/oiiotool-text/ref/out.txt
  150. oiio-Release-2.0.13/testsuite/oiiotool-text/ref/text-alt.tif
  151. oiio-Release-2.0.13/testsuite/oiiotool-text/ref/text-freetype2.6.5.tif
  152. oiio-Release-2.0.13/testsuite/oiiotool-text/ref/text-freetype2.7.tif
  153. oiio-Release-2.0.13/testsuite/oiiotool-text/ref/text.tif
  154. oiio-Release-2.0.13/testsuite/oiiotool-text/ref/textshadowed-freetype2.4.11.tif
  155. oiio-Release-2.0.13/testsuite/oiiotool-text/ref/textshadowed.tif
  156. oiio-Release-2.0.13/testsuite/oiiotool-text/run.py
  157. oiio-Release-2.0.13/testsuite/oiiotool-xform/
  158. oiio-Release-2.0.13/testsuite/oiiotool-xform/ref/
  159. oiio-Release-2.0.13/testsuite/oiiotool-xform/ref/cshift.tif
  160. oiio-Release-2.0.13/testsuite/oiiotool-xform/ref/fit.tif
  161. oiio-Release-2.0.13/testsuite/oiiotool-xform/ref/fit2.tif
  162. oiio-Release-2.0.13/testsuite/oiiotool-xform/ref/fit3.tif
  163. oiio-Release-2.0.13/testsuite/oiiotool-xform/ref/fit4.exr
  164. oiio-Release-2.0.13/testsuite/oiiotool-xform/ref/flip-crop.tif
  165. oiio-Release-2.0.13/testsuite/oiiotool-xform/ref/flip.tif
  166. oiio-Release-2.0.13/testsuite/oiiotool-xform/ref/flipflop-crop.tif
  167. oiio-Release-2.0.13/testsuite/oiiotool-xform/ref/flipflop.tif
  168. oiio-Release-2.0.13/testsuite/oiiotool-xform/ref/flop-crop.tif
  169. oiio-Release-2.0.13/testsuite/oiiotool-xform/ref/flop.tif
  170. oiio-Release-2.0.13/testsuite/oiiotool-xform/ref/out.txt
  171. oiio-Release-2.0.13/testsuite/oiiotool-xform/ref/pixelaspect.tif
  172. oiio-Release-2.0.13/testsuite/oiiotool-xform/ref/reorient1.tif
  173. oiio-Release-2.0.13/testsuite/oiiotool-xform/ref/reorient2.tif
  174. oiio-Release-2.0.13/testsuite/oiiotool-xform/ref/reorient3.tif
  175. oiio-Release-2.0.13/testsuite/oiiotool-xform/ref/resample.tif
  176. oiio-Release-2.0.13/testsuite/oiiotool-xform/ref/resize.tif
  177. oiio-Release-2.0.13/testsuite/oiiotool-xform/ref/resize2.tif
  178. oiio-Release-2.0.13/testsuite/oiiotool-xform/ref/resize512.tif
  179. oiio-Release-2.0.13/testsuite/oiiotool-xform/ref/resize64.tif
  180. oiio-Release-2.0.13/testsuite/oiiotool-xform/ref/resized-offset.exr
  181. oiio-Release-2.0.13/testsuite/oiiotool-xform/ref/rotate270-crop.tif
  182. oiio-Release-2.0.13/testsuite/oiiotool-xform/ref/rotate270.tif
  183. oiio-Release-2.0.13/testsuite/oiiotool-xform/ref/rotate90-crop.tif
  184. oiio-Release-2.0.13/testsuite/oiiotool-xform/ref/rotate90.tif
  185. oiio-Release-2.0.13/testsuite/oiiotool-xform/ref/rotated-offcenter.tif
  186. oiio-Release-2.0.13/testsuite/oiiotool-xform/ref/rotated.tif
  187. oiio-Release-2.0.13/testsuite/oiiotool-xform/ref/rotated360.tif
  188. oiio-Release-2.0.13/testsuite/oiiotool-xform/ref/transpose-crop.tif
  189. oiio-Release-2.0.13/testsuite/oiiotool-xform/ref/transpose.tif
  190. oiio-Release-2.0.13/testsuite/oiiotool-xform/ref/warped.tif
  191. oiio-Release-2.0.13/testsuite/oiiotool-xform/run.py
  192. oiio-Release-2.0.13/testsuite/oiiotool-xform/src/
  193. oiio-Release-2.0.13/testsuite/oiiotool-xform/src/target1.exr
  194. oiio-Release-2.0.13/testsuite/oiiotool/
  195. oiio-Release-2.0.13/testsuite/oiiotool/ref/
  196. oiio-Release-2.0.13/testsuite/oiiotool/ref/abs.exr
  197. oiio-Release-2.0.13/testsuite/oiiotool/ref/absdiff.exr
  198. oiio-Release-2.0.13/testsuite/oiiotool/ref/absdiffc.exr
  199. oiio-Release-2.0.13/testsuite/oiiotool/ref/add.exr
  200. oiio-Release-2.0.13/testsuite/oiiotool/ref/allhalf.exr
  201. oiio-Release-2.0.13/testsuite/oiiotool/ref/autotrim.tif
  202. oiio-Release-2.0.13/testsuite/oiiotool/ref/bspline-blur.tif
  203. oiio-Release-2.0.13/testsuite/oiiotool/ref/bsplinekernel.exr
  204. oiio-Release-2.0.13/testsuite/oiiotool/ref/cadd1.exr
  205. oiio-Release-2.0.13/testsuite/oiiotool/ref/cadd2.exr
  206. oiio-Release-2.0.13/testsuite/oiiotool/ref/ch-rgba.exr
  207. oiio-Release-2.0.13/testsuite/oiiotool/ref/ch-z.exr
  208. oiio-Release-2.0.13/testsuite/oiiotool/ref/chanshuffle.tif
  209. oiio-Release-2.0.13/testsuite/oiiotool/ref/chappend-rgbaz.exr
  210. oiio-Release-2.0.13/testsuite/oiiotool/ref/chname.exr
  211. oiio-Release-2.0.13/testsuite/oiiotool/ref/chsum.tif
  212. oiio-Release-2.0.13/testsuite/oiiotool/ref/cmul1.exr
  213. oiio-Release-2.0.13/testsuite/oiiotool/ref/cmul2.exr
  214. oiio-Release-2.0.13/testsuite/oiiotool/ref/const5-rgb.tif
  215. oiio-Release-2.0.13/testsuite/oiiotool/ref/cpow1.exr
  216. oiio-Release-2.0.13/testsuite/oiiotool/ref/cpow2.exr
  217. oiio-Release-2.0.13/testsuite/oiiotool/ref/crop.tif
  218. oiio-Release-2.0.13/testsuite/oiiotool/ref/cut.tif
  219. oiio-Release-2.0.13/testsuite/oiiotool/ref/dilate.tif
  220. oiio-Release-2.0.13/testsuite/oiiotool/ref/div.exr
  221. oiio-Release-2.0.13/testsuite/oiiotool/ref/divc1.exr
  222. oiio-Release-2.0.13/testsuite/oiiotool/ref/divc2.exr
  223. oiio-Release-2.0.13/testsuite/oiiotool/ref/erode.tif
  224. oiio-Release-2.0.13/testsuite/oiiotool/ref/exprcropped.tif
  225. oiio-Release-2.0.13/testsuite/oiiotool/ref/exprgradient.tif
  226. oiio-Release-2.0.13/testsuite/oiiotool/ref/exprstrcatlzw.tif
  227. oiio-Release-2.0.13/testsuite/oiiotool/ref/fft.exr
  228. oiio-Release-2.0.13/testsuite/oiiotool/ref/filled.tif
  229. oiio-Release-2.0.13/testsuite/oiiotool/ref/gauss5x5-blur.tif
  230. oiio-Release-2.0.13/testsuite/oiiotool/ref/grid-clamped.tif
  231. oiio-Release-2.0.13/testsuite/oiiotool/ref/growholes.tif
  232. oiio-Release-2.0.13/testsuite/oiiotool/ref/histogram_cumulative.tif
  233. oiio-Release-2.0.13/testsuite/oiiotool/ref/histogram_input.png
  234. oiio-Release-2.0.13/testsuite/oiiotool/ref/histogram_regular.tif
  235. oiio-Release-2.0.13/testsuite/oiiotool/ref/hole.tif
  236. oiio-Release-2.0.13/testsuite/oiiotool/ref/ifft.exr
  237. oiio-Release-2.0.13/testsuite/oiiotool/ref/invert.tif
  238. oiio-Release-2.0.13/testsuite/oiiotool/ref/labeladd.exr
  239. oiio-Release-2.0.13/testsuite/oiiotool/ref/mad.exr
  240. oiio-Release-2.0.13/testsuite/oiiotool/ref/mosaic.tif
  241. oiio-Release-2.0.13/testsuite/oiiotool/ref/mul.exr
  242. oiio-Release-2.0.13/testsuite/oiiotool/ref/out.txt
  243. oiio-Release-2.0.13/testsuite/oiiotool/ref/pasted.tif
  244. oiio-Release-2.0.13/testsuite/oiiotool/ref/polar.exr
  245. oiio-Release-2.0.13/testsuite/oiiotool/ref/rangecompress-luma.tif
  246. oiio-Release-2.0.13/testsuite/oiiotool/ref/rangecompress.tif
  247. oiio-Release-2.0.13/testsuite/oiiotool/ref/rangeexpand-luma.tif
  248. oiio-Release-2.0.13/testsuite/oiiotool/ref/rangeexpand.tif
  249. oiio-Release-2.0.13/testsuite/oiiotool/ref/rgbahalf-zfloat.exr
  250. oiio-Release-2.0.13/testsuite/oiiotool/ref/rotate180.tif
  251. oiio-Release-2.0.13/testsuite/oiiotool/ref/sub.exr
  252. oiio-Release-2.0.13/testsuite/oiiotool/ref/subc.exr
  253. oiio-Release-2.0.13/testsuite/oiiotool/ref/tahoe-contraststretch.tif
  254. oiio-Release-2.0.13/testsuite/oiiotool/ref/tahoe-filled.tif
  255. oiio-Release-2.0.13/testsuite/oiiotool/ref/tahoe-laplacian.tif
  256. oiio-Release-2.0.13/testsuite/oiiotool/ref/tahoe-median.tif
  257. oiio-Release-2.0.13/testsuite/oiiotool/ref/trim.tif
  258. oiio-Release-2.0.13/testsuite/oiiotool/ref/trimsubimages.tif
  259. oiio-Release-2.0.13/testsuite/oiiotool/ref/unpolar.exr
  260. oiio-Release-2.0.13/testsuite/oiiotool/ref/unsharp-median.tif
  261. oiio-Release-2.0.13/testsuite/oiiotool/ref/unsharp.tif
  262. oiio-Release-2.0.13/testsuite/oiiotool/run.py
  263. oiio-Release-2.0.13/testsuite/oiiotool/src/
  264. oiio-Release-2.0.13/testsuite/oiiotool/src/image.tif
  265. oiio-Release-2.0.13/testsuite/oiiotool/src/morphsource.tif
  266. oiio-Release-2.0.13/testsuite/oiiotool/src/rgbaz.exr
  267. oiio-Release-2.0.13/testsuite/oiiotool/src/tahoe-small.tif
  268. oiio-Release-2.0.13/testsuite/oiiotool/src/tahoe-tiny.tif
  269. oiio-Release-2.0.13/testsuite/openexr-chroma/
  270. oiio-Release-2.0.13/testsuite/openexr-chroma/ref/
  271. oiio-Release-2.0.13/testsuite/openexr-chroma/ref/out.txt
  272. oiio-Release-2.0.13/testsuite/openexr-chroma/run.py
  273. oiio-Release-2.0.13/testsuite/openexr-multires/
  274. oiio-Release-2.0.13/testsuite/openexr-multires/ref/
  275. oiio-Release-2.0.13/testsuite/openexr-multires/ref/out.txt
  276. oiio-Release-2.0.13/testsuite/openexr-multires/run.py
  277. oiio-Release-2.0.13/testsuite/openexr-suite/
  278. oiio-Release-2.0.13/testsuite/openexr-suite/ref/
  279. oiio-Release-2.0.13/testsuite/openexr-suite/ref/out.txt
  280. oiio-Release-2.0.13/testsuite/openexr-suite/run.py
  281. oiio-Release-2.0.13/testsuite/openexr-v2/
  282. oiio-Release-2.0.13/testsuite/openexr-v2/ref/
  283. oiio-Release-2.0.13/testsuite/openexr-v2/ref/out.txt
  284. oiio-Release-2.0.13/testsuite/openexr-v2/run.py
  285. oiio-Release-2.0.13/testsuite/openvdb/
  286. oiio-Release-2.0.13/testsuite/openvdb/ref/
  287. oiio-Release-2.0.13/testsuite/openvdb/ref/out.txt
  288. oiio-Release-2.0.13/testsuite/openvdb/ref/sphere.exr
  289. oiio-Release-2.0.13/testsuite/openvdb/ref/sphereCd.exr
  290. oiio-Release-2.0.13/testsuite/openvdb/run.py
  291. oiio-Release-2.0.13/testsuite/openvdb/src/
  292. oiio-Release-2.0.13/testsuite/openvdb/src/sphere.vdb
  293. oiio-Release-2.0.13/testsuite/openvdb/src/sphereCd.vdb
  294. oiio-Release-2.0.13/testsuite/perchannel/
  295. oiio-Release-2.0.13/testsuite/perchannel/ref/
  296. oiio-Release-2.0.13/testsuite/perchannel/ref/out.txt
  297. oiio-Release-2.0.13/testsuite/perchannel/run.py
  298. oiio-Release-2.0.13/testsuite/png/
  299. oiio-Release-2.0.13/testsuite/png/ref/
  300. oiio-Release-2.0.13/testsuite/png/ref/out.txt
  301. oiio-Release-2.0.13/testsuite/png/run.py
  302. oiio-Release-2.0.13/testsuite/pnm/
  303. oiio-Release-2.0.13/testsuite/pnm/ref/
  304. oiio-Release-2.0.13/testsuite/pnm/ref/out.txt
  305. oiio-Release-2.0.13/testsuite/pnm/run.py
  306. oiio-Release-2.0.13/testsuite/psd-colormodes/
  307. oiio-Release-2.0.13/testsuite/psd-colormodes/ref/
  308. oiio-Release-2.0.13/testsuite/psd-colormodes/ref/out.txt
  309. oiio-Release-2.0.13/testsuite/psd-colormodes/ref/pattern2-alpha.tif
  310. oiio-Release-2.0.13/testsuite/psd-colormodes/ref/pattern2-cmyk.tif
  311. oiio-Release-2.0.13/testsuite/psd-colormodes/ref/pattern2-gray.tif
  312. oiio-Release-2.0.13/testsuite/psd-colormodes/ref/pattern2.tif
  313. oiio-Release-2.0.13/testsuite/psd-colormodes/run.py
  314. oiio-Release-2.0.13/testsuite/psd-colormodes/src/
  315. oiio-Release-2.0.13/testsuite/psd-colormodes/src/pattern2-16-cmyk.psd
  316. oiio-Release-2.0.13/testsuite/psd-colormodes/src/pattern2-16-grayscale.psd
  317. oiio-Release-2.0.13/testsuite/psd-colormodes/src/pattern2-16-lab.psd
  318. oiio-Release-2.0.13/testsuite/psd-colormodes/src/pattern2-16-multichannel.psd
  319. oiio-Release-2.0.13/testsuite/psd-colormodes/src/pattern2-16-rgb.psd
  320. oiio-Release-2.0.13/testsuite/psd-colormodes/src/pattern2-32-grayscale.psd
  321. oiio-Release-2.0.13/testsuite/psd-colormodes/src/pattern2-32-rgb.psd
  322. oiio-Release-2.0.13/testsuite/psd-colormodes/src/pattern2-8-cmyk.psd
  323. oiio-Release-2.0.13/testsuite/psd-colormodes/src/pattern2-8-grayscale.psd
  324. oiio-Release-2.0.13/testsuite/psd-colormodes/src/pattern2-8-indexed.psd
  325. oiio-Release-2.0.13/testsuite/psd-colormodes/src/pattern2-8-lab.psd
  326. oiio-Release-2.0.13/testsuite/psd-colormodes/src/pattern2-8-multichannel.psd
  327. oiio-Release-2.0.13/testsuite/psd-colormodes/src/pattern2-8-rgb.psd
  328. oiio-Release-2.0.13/testsuite/psd/
  329. oiio-Release-2.0.13/testsuite/psd/ref/
  330. oiio-Release-2.0.13/testsuite/psd/ref/out-alt.txt
  331. oiio-Release-2.0.13/testsuite/psd/ref/out.txt
  332. oiio-Release-2.0.13/testsuite/psd/run.py
  333. oiio-Release-2.0.13/testsuite/psd/src/
  334. oiio-Release-2.0.13/testsuite/psd/src/different-mask-size.psd
  335. oiio-Release-2.0.13/testsuite/psd/src/layer-mask.psd
  336. oiio-Release-2.0.13/testsuite/ptex/
  337. oiio-Release-2.0.13/testsuite/ptex/ref/
  338. oiio-Release-2.0.13/testsuite/ptex/ref/out.txt
  339. oiio-Release-2.0.13/testsuite/ptex/run.py
  340. oiio-Release-2.0.13/testsuite/ptex/src/
  341. oiio-Release-2.0.13/testsuite/ptex/src/triangle.ptx
  342. oiio-Release-2.0.13/testsuite/python-colorconfig/
  343. oiio-Release-2.0.13/testsuite/python-colorconfig/ref/
  344. oiio-Release-2.0.13/testsuite/python-colorconfig/ref/out-noocio-python27.txt
  345. oiio-Release-2.0.13/testsuite/python-colorconfig/ref/out-noocio.txt
  346. oiio-Release-2.0.13/testsuite/python-colorconfig/ref/out-python27.txt
  347. oiio-Release-2.0.13/testsuite/python-colorconfig/ref/out.txt
  348. oiio-Release-2.0.13/testsuite/python-colorconfig/run.py
  349. oiio-Release-2.0.13/testsuite/python-colorconfig/src/
  350. oiio-Release-2.0.13/testsuite/python-colorconfig/src/test_colorconfig.py
  351. oiio-Release-2.0.13/testsuite/python-deep/
  352. oiio-Release-2.0.13/testsuite/python-deep/ref/
  353. oiio-Release-2.0.13/testsuite/python-deep/ref/out.txt
  354. oiio-Release-2.0.13/testsuite/python-deep/run.py
  355. oiio-Release-2.0.13/testsuite/python-deep/src/
  356. oiio-Release-2.0.13/testsuite/python-deep/src/test_deep.py
  357. oiio-Release-2.0.13/testsuite/python-imagebuf/
  358. oiio-Release-2.0.13/testsuite/python-imagebuf/ref/
  359. oiio-Release-2.0.13/testsuite/python-imagebuf/ref/out-alt-python3.txt
  360. oiio-Release-2.0.13/testsuite/python-imagebuf/ref/out-alt.txt
  361. oiio-Release-2.0.13/testsuite/python-imagebuf/ref/out-python3.txt
  362. oiio-Release-2.0.13/testsuite/python-imagebuf/ref/out.tif
  363. oiio-Release-2.0.13/testsuite/python-imagebuf/ref/out.txt
  364. oiio-Release-2.0.13/testsuite/python-imagebuf/ref/outarray.tif
  365. oiio-Release-2.0.13/testsuite/python-imagebuf/ref/outarrayB.tif
  366. oiio-Release-2.0.13/testsuite/python-imagebuf/ref/outarrayH.tif
  367. oiio-Release-2.0.13/testsuite/python-imagebuf/ref/outtuple.tif
  368. oiio-Release-2.0.13/testsuite/python-imagebuf/run.py
  369. oiio-Release-2.0.13/testsuite/python-imagebuf/src/
  370. oiio-Release-2.0.13/testsuite/python-imagebuf/src/test_imagebuf.py
  371. oiio-Release-2.0.13/testsuite/python-imagebufalgo/
  372. oiio-Release-2.0.13/testsuite/python-imagebufalgo/ref/
  373. oiio-Release-2.0.13/testsuite/python-imagebufalgo/ref/black.tif
  374. oiio-Release-2.0.13/testsuite/python-imagebufalgo/ref/checker.tif
  375. oiio-Release-2.0.13/testsuite/python-imagebufalgo/ref/crop.tif
  376. oiio-Release-2.0.13/testsuite/python-imagebufalgo/ref/mad2.exr
  377. oiio-Release-2.0.13/testsuite/python-imagebufalgo/ref/mad3.exr
  378. oiio-Release-2.0.13/testsuite/python-imagebufalgo/ref/out-freetype2.4.11-py2.7-pybind2.3.txt
  379. oiio-Release-2.0.13/testsuite/python-imagebufalgo/ref/out-freetype2.4.11.txt
  380. oiio-Release-2.0.13/testsuite/python-imagebufalgo/ref/out-python2-alt.txt
  381. oiio-Release-2.0.13/testsuite/python-imagebufalgo/ref/out-python3-freetype2.4.11.txt
  382. oiio-Release-2.0.13/testsuite/python-imagebufalgo/ref/out-python3.txt
  383. oiio-Release-2.0.13/testsuite/python-imagebufalgo/ref/out.tif
  384. oiio-Release-2.0.13/testsuite/python-imagebufalgo/ref/out.txt
  385. oiio-Release-2.0.13/testsuite/python-imagebufalgo/ref/tahoe-small.tx
  386. oiio-Release-2.0.13/testsuite/python-imagebufalgo/ref/textcentered-freetype2.4.11.tif
  387. oiio-Release-2.0.13/testsuite/python-imagebufalgo/ref/textcentered.tif
  388. oiio-Release-2.0.13/testsuite/python-imagebufalgo/run.py
  389. oiio-Release-2.0.13/testsuite/python-imagebufalgo/src/
  390. oiio-Release-2.0.13/testsuite/python-imagebufalgo/src/test_imagebufalgo.py
  391. oiio-Release-2.0.13/testsuite/python-imageinput/
  392. oiio-Release-2.0.13/testsuite/python-imageinput/ref/
  393. oiio-Release-2.0.13/testsuite/python-imageinput/ref/out-alt.txt
  394. oiio-Release-2.0.13/testsuite/python-imageinput/ref/out-alt2.txt
  395. oiio-Release-2.0.13/testsuite/python-imageinput/ref/out-python3.txt
  396. oiio-Release-2.0.13/testsuite/python-imageinput/ref/out-travis-py2.7-pybind2.3.txt
  397. oiio-Release-2.0.13/testsuite/python-imageinput/ref/out-travis.txt
  398. oiio-Release-2.0.13/testsuite/python-imageinput/ref/out.txt
  399. oiio-Release-2.0.13/testsuite/python-imageinput/run.py
  400. oiio-Release-2.0.13/testsuite/python-imageinput/src/
  401. oiio-Release-2.0.13/testsuite/python-imageinput/src/test_imageinput.py
  402. oiio-Release-2.0.13/testsuite/python-imageoutput/
  403. oiio-Release-2.0.13/testsuite/python-imageoutput/ref/
  404. oiio-Release-2.0.13/testsuite/python-imageoutput/ref/multipart.exr
  405. oiio-Release-2.0.13/testsuite/python-imageoutput/ref/out.txt
  406. oiio-Release-2.0.13/testsuite/python-imageoutput/run.py
  407. oiio-Release-2.0.13/testsuite/python-imageoutput/src/
  408. oiio-Release-2.0.13/testsuite/python-imageoutput/src/test_imageoutput.py
  409. oiio-Release-2.0.13/testsuite/python-imagespec/
  410. oiio-Release-2.0.13/testsuite/python-imagespec/ref/
  411. oiio-Release-2.0.13/testsuite/python-imagespec/ref/out-python3.txt
  412. oiio-Release-2.0.13/testsuite/python-imagespec/ref/out.txt
  413. oiio-Release-2.0.13/testsuite/python-imagespec/run.py
  414. oiio-Release-2.0.13/testsuite/python-imagespec/src/
  415. oiio-Release-2.0.13/testsuite/python-imagespec/src/test_imagespec.py
  416. oiio-Release-2.0.13/testsuite/python-roi/
  417. oiio-Release-2.0.13/testsuite/python-roi/ref/
  418. oiio-Release-2.0.13/testsuite/python-roi/ref/out.txt
  419. oiio-Release-2.0.13/testsuite/python-roi/run.py
  420. oiio-Release-2.0.13/testsuite/python-roi/src/
  421. oiio-Release-2.0.13/testsuite/python-roi/src/test_roi.py
  422. oiio-Release-2.0.13/testsuite/python-typedesc/
  423. oiio-Release-2.0.13/testsuite/python-typedesc/ref/
  424. oiio-Release-2.0.13/testsuite/python-typedesc/ref/out.txt
  425. oiio-Release-2.0.13/testsuite/python-typedesc/run.py
  426. oiio-Release-2.0.13/testsuite/python-typedesc/src/
  427. oiio-Release-2.0.13/testsuite/python-typedesc/src/test_typedesc.py
  428. oiio-Release-2.0.13/testsuite/rational/
  429. oiio-Release-2.0.13/testsuite/rational/ref/
  430. oiio-Release-2.0.13/testsuite/rational/ref/out.txt
  431. oiio-Release-2.0.13/testsuite/rational/run.py
  432. oiio-Release-2.0.13/testsuite/rational/src/
  433. oiio-Release-2.0.13/testsuite/rational/src/test.exr
  434. oiio-Release-2.0.13/testsuite/raw/
  435. oiio-Release-2.0.13/testsuite/raw/ref/
  436. oiio-Release-2.0.13/testsuite/raw/ref/RAW_CANON_EOS_7D.CR2.tif
  437. oiio-Release-2.0.13/testsuite/raw/ref/RAW_FUJI_F700.RAF.tif
  438. oiio-Release-2.0.13/testsuite/raw/ref/RAW_NIKON_D3X.NEF.tif
  439. oiio-Release-2.0.13/testsuite/raw/ref/RAW_OLYMPUS_E3.ORF.tif
  440. oiio-Release-2.0.13/testsuite/raw/ref/RAW_PANASONIC_G1.RW2-libraw0.18.11.tif
  441. oiio-Release-2.0.13/testsuite/raw/ref/RAW_PANASONIC_G1.RW2.tif
  442. oiio-Release-2.0.13/testsuite/raw/ref/RAW_PENTAX_K200D.PEF-libraw0.18.11.tif
  443. oiio-Release-2.0.13/testsuite/raw/ref/RAW_PENTAX_K200D.PEF.tif
  444. oiio-Release-2.0.13/testsuite/raw/ref/RAW_SONY_A300.ARW.tif
  445. oiio-Release-2.0.13/testsuite/raw/ref/out-libraw0.17.1.txt
  446. oiio-Release-2.0.13/testsuite/raw/ref/out-libraw0.17.2-circle.txt
  447. oiio-Release-2.0.13/testsuite/raw/ref/out-libraw0.18.11.txt
  448. oiio-Release-2.0.13/testsuite/raw/ref/out-oldlibraw0.15.txt
  449. oiio-Release-2.0.13/testsuite/raw/ref/out.txt
  450. oiio-Release-2.0.13/testsuite/raw/run.py
  451. oiio-Release-2.0.13/testsuite/rla/
  452. oiio-Release-2.0.13/testsuite/rla/ref/
  453. oiio-Release-2.0.13/testsuite/rla/ref/out.txt
  454. oiio-Release-2.0.13/testsuite/rla/ref/rlacrop.rla
  455. oiio-Release-2.0.13/testsuite/rla/run.py
  456. oiio-Release-2.0.13/testsuite/runtest.py
  457. oiio-Release-2.0.13/testsuite/sgi/
  458. oiio-Release-2.0.13/testsuite/sgi/ref/
  459. oiio-Release-2.0.13/testsuite/sgi/ref/norle-16.sgi
  460. oiio-Release-2.0.13/testsuite/sgi/ref/norle-8.sgi
  461. oiio-Release-2.0.13/testsuite/sgi/ref/out.txt
  462. oiio-Release-2.0.13/testsuite/sgi/ref/rle-16.sgi
  463. oiio-Release-2.0.13/testsuite/sgi/ref/rle-8.sgi
  464. oiio-Release-2.0.13/testsuite/sgi/run.py
  465. oiio-Release-2.0.13/testsuite/targa-tgautils/
  466. oiio-Release-2.0.13/testsuite/targa-tgautils/ref/
  467. oiio-Release-2.0.13/testsuite/targa-tgautils/ref/out.txt
  468. oiio-Release-2.0.13/testsuite/targa-tgautils/run.py
  469. oiio-Release-2.0.13/testsuite/texture-blurtube/
  470. oiio-Release-2.0.13/testsuite/texture-blurtube/ref/
  471. oiio-Release-2.0.13/testsuite/texture-blurtube/ref/checker-0.00.tif
  472. oiio-Release-2.0.13/testsuite/texture-blurtube/ref/checker-0.02.tif
  473. oiio-Release-2.0.13/testsuite/texture-blurtube/ref/checker-0.05.tif
  474. oiio-Release-2.0.13/testsuite/texture-blurtube/ref/checker-0.10.tif
  475. oiio-Release-2.0.13/testsuite/texture-blurtube/ref/checker-0.20.tif
  476. oiio-Release-2.0.13/testsuite/texture-blurtube/ref/grid-0.00.tif
  477. oiio-Release-2.0.13/testsuite/texture-blurtube/ref/grid-0.02.tif
  478. oiio-Release-2.0.13/testsuite/texture-blurtube/ref/grid-0.05.tif
  479. oiio-Release-2.0.13/testsuite/texture-blurtube/ref/grid-0.10.tif
  480. oiio-Release-2.0.13/testsuite/texture-blurtube/ref/grid-0.20.tif
  481. oiio-Release-2.0.13/testsuite/texture-blurtube/ref/out.exr
  482. oiio-Release-2.0.13/testsuite/texture-blurtube/ref/out.txt
  483. oiio-Release-2.0.13/testsuite/texture-blurtube/run.py
  484. oiio-Release-2.0.13/testsuite/texture-crop/
  485. oiio-Release-2.0.13/testsuite/texture-crop/ref/
  486. oiio-Release-2.0.13/testsuite/texture-crop/ref/out.exr
  487. oiio-Release-2.0.13/testsuite/texture-crop/run.py
  488. oiio-Release-2.0.13/testsuite/texture-cropover/
  489. oiio-Release-2.0.13/testsuite/texture-cropover/ref/
  490. oiio-Release-2.0.13/testsuite/texture-cropover/ref/out.exr
  491. oiio-Release-2.0.13/testsuite/texture-cropover/run.py
  492. oiio-Release-2.0.13/testsuite/texture-derivs/
  493. oiio-Release-2.0.13/testsuite/texture-derivs/ref/
  494. oiio-Release-2.0.13/testsuite/texture-derivs/ref/out.exr
  495. oiio-Release-2.0.13/testsuite/texture-derivs/ref/out.exr-ds.exr
  496. oiio-Release-2.0.13/testsuite/texture-derivs/ref/out.exr-dt.exr
  497. oiio-Release-2.0.13/testsuite/texture-derivs/run.py
  498. oiio-Release-2.0.13/testsuite/texture-derivs/src/
  499. oiio-Release-2.0.13/testsuite/texture-derivs/src/ramp.exr
  500. oiio-Release-2.0.13/testsuite/texture-fat/
  501. oiio-Release-2.0.13/testsuite/texture-fat/ref/
  502. oiio-Release-2.0.13/testsuite/texture-fat/ref/out.exr
  503. oiio-Release-2.0.13/testsuite/texture-fat/run.py
  504. oiio-Release-2.0.13/testsuite/texture-fat/src/
  505. oiio-Release-2.0.13/testsuite/texture-fat/src/horizgrid.tx
  506. oiio-Release-2.0.13/testsuite/texture-field3d/
  507. oiio-Release-2.0.13/testsuite/texture-field3d/ref/
  508. oiio-Release-2.0.13/testsuite/texture-field3d/ref/out.exr
  509. oiio-Release-2.0.13/testsuite/texture-field3d/ref/out.txt
  510. oiio-Release-2.0.13/testsuite/texture-field3d/run.py
  511. oiio-Release-2.0.13/testsuite/texture-field3d/src/
  512. oiio-Release-2.0.13/testsuite/texture-field3d/src/dense_float.f3d
  513. oiio-Release-2.0.13/testsuite/texture-field3d/src/dense_half.f3d
  514. oiio-Release-2.0.13/testsuite/texture-field3d/src/sparse_float.f3d
  515. oiio-Release-2.0.13/testsuite/texture-field3d/src/sparse_half.f3d
  516. oiio-Release-2.0.13/testsuite/texture-fill/
  517. oiio-Release-2.0.13/testsuite/texture-fill/ref/
  518. oiio-Release-2.0.13/testsuite/texture-fill/ref/out.exr
  519. oiio-Release-2.0.13/testsuite/texture-fill/ref/out.txt
  520. oiio-Release-2.0.13/testsuite/texture-fill/run.py
  521. oiio-Release-2.0.13/testsuite/texture-fill/src/
  522. oiio-Release-2.0.13/testsuite/texture-fill/src/gray.png
  523. oiio-Release-2.0.13/testsuite/texture-filtersize/
  524. oiio-Release-2.0.13/testsuite/texture-filtersize/ref/
  525. oiio-Release-2.0.13/testsuite/texture-filtersize/ref/out.tif
  526. oiio-Release-2.0.13/testsuite/texture-filtersize/run.py
  527. oiio-Release-2.0.13/testsuite/texture-flipt/
  528. oiio-Release-2.0.13/testsuite/texture-flipt/ref/
  529. oiio-Release-2.0.13/testsuite/texture-flipt/ref/out.exr
  530. oiio-Release-2.0.13/testsuite/texture-flipt/ref/out.exr-ds.exr
  531. oiio-Release-2.0.13/testsuite/texture-flipt/ref/out.exr-dt.exr
  532. oiio-Release-2.0.13/testsuite/texture-flipt/run.py
  533. oiio-Release-2.0.13/testsuite/texture-gettexels/
  534. oiio-Release-2.0.13/testsuite/texture-gettexels/ref/
  535. oiio-Release-2.0.13/testsuite/texture-gettexels/ref/postage.tif
  536. oiio-Release-2.0.13/testsuite/texture-gettexels/run.py
  537. oiio-Release-2.0.13/testsuite/texture-gray/
  538. oiio-Release-2.0.13/testsuite/texture-gray/ref/
  539. oiio-Release-2.0.13/testsuite/texture-gray/ref/out.exr
  540. oiio-Release-2.0.13/testsuite/texture-gray/run.py
  541. oiio-Release-2.0.13/testsuite/texture-gray/src/
  542. oiio-Release-2.0.13/testsuite/texture-gray/src/gray.png
  543. oiio-Release-2.0.13/testsuite/texture-half/
  544. oiio-Release-2.0.13/testsuite/texture-half/ref/
  545. oiio-Release-2.0.13/testsuite/texture-half/ref/out.exr
  546. oiio-Release-2.0.13/testsuite/texture-half/run.py
  547. oiio-Release-2.0.13/testsuite/texture-icwrite/
  548. oiio-Release-2.0.13/testsuite/texture-icwrite/ref/
  549. oiio-Release-2.0.13/testsuite/texture-icwrite/ref/out1.tif
  550. oiio-Release-2.0.13/testsuite/texture-icwrite/ref/out2.tif
  551. oiio-Release-2.0.13/testsuite/texture-icwrite/ref/out3.tif
  552. oiio-Release-2.0.13/testsuite/texture-icwrite/ref/out4.tif
  553. oiio-Release-2.0.13/testsuite/texture-icwrite/run.py
  554. oiio-Release-2.0.13/testsuite/texture-interp-bicubic/
  555. oiio-Release-2.0.13/testsuite/texture-interp-bicubic/ref/
  556. oiio-Release-2.0.13/testsuite/texture-interp-bicubic/ref/out.tif
  557. oiio-Release-2.0.13/testsuite/texture-interp-bicubic/run.py
  558. oiio-Release-2.0.13/testsuite/texture-interp-bilinear/
  559. oiio-Release-2.0.13/testsuite/texture-interp-bilinear/ref/
  560. oiio-Release-2.0.13/testsuite/texture-interp-bilinear/ref/out.tif
  561. oiio-Release-2.0.13/testsuite/texture-interp-bilinear/run.py
  562. oiio-Release-2.0.13/testsuite/texture-interp-closest/
  563. oiio-Release-2.0.13/testsuite/texture-interp-closest/ref/
  564. oiio-Release-2.0.13/testsuite/texture-interp-closest/ref/out.tif
  565. oiio-Release-2.0.13/testsuite/texture-interp-closest/run.py
  566. oiio-Release-2.0.13/testsuite/texture-mip-nomip/
  567. oiio-Release-2.0.13/testsuite/texture-mip-nomip/ref/
  568. oiio-Release-2.0.13/testsuite/texture-mip-nomip/ref/out.tif
  569. oiio-Release-2.0.13/testsuite/texture-mip-nomip/run.py
  570. oiio-Release-2.0.13/testsuite/texture-mip-onelevel/
  571. oiio-Release-2.0.13/testsuite/texture-mip-onelevel/ref/
  572. oiio-Release-2.0.13/testsuite/texture-mip-onelevel/ref/out.tif
  573. oiio-Release-2.0.13/testsuite/texture-mip-onelevel/run.py
  574. oiio-Release-2.0.13/testsuite/texture-mip-trilinear/
  575. oiio-Release-2.0.13/testsuite/texture-mip-trilinear/ref/
  576. oiio-Release-2.0.13/testsuite/texture-mip-trilinear/ref/out.tif
  577. oiio-Release-2.0.13/testsuite/texture-mip-trilinear/run.py
  578. oiio-Release-2.0.13/testsuite/texture-missing/
  579. oiio-Release-2.0.13/testsuite/texture-missing/TRAVIS_SKIP_LSAN
  580. oiio-Release-2.0.13/testsuite/texture-missing/ref/
  581. oiio-Release-2.0.13/testsuite/texture-missing/ref/out.exr
  582. oiio-Release-2.0.13/testsuite/texture-missing/run.py
  583. oiio-Release-2.0.13/testsuite/texture-overscan/
  584. oiio-Release-2.0.13/testsuite/texture-overscan/ref/
  585. oiio-Release-2.0.13/testsuite/texture-overscan/ref/out-exact.exr
  586. oiio-Release-2.0.13/testsuite/texture-overscan/ref/out-over.exr
  587. oiio-Release-2.0.13/testsuite/texture-overscan/ref/out-overclamp.exr
  588. oiio-Release-2.0.13/testsuite/texture-overscan/run.py
  589. oiio-Release-2.0.13/testsuite/texture-pointsample/
  590. oiio-Release-2.0.13/testsuite/texture-pointsample/ref/
  591. oiio-Release-2.0.13/testsuite/texture-pointsample/ref/out.exr
  592. oiio-Release-2.0.13/testsuite/texture-pointsample/run.py
  593. oiio-Release-2.0.13/testsuite/texture-res/
  594. oiio-Release-2.0.13/testsuite/texture-res/README
  595. oiio-Release-2.0.13/testsuite/texture-res/ref/
  596. oiio-Release-2.0.13/testsuite/texture-res/ref/out.tif
  597. oiio-Release-2.0.13/testsuite/texture-res/run.py
  598. oiio-Release-2.0.13/testsuite/texture-skinny/
  599. oiio-Release-2.0.13/testsuite/texture-skinny/ref/
  600. oiio-Release-2.0.13/testsuite/texture-skinny/ref/out.exr
  601. oiio-Release-2.0.13/testsuite/texture-skinny/run.py
  602. oiio-Release-2.0.13/testsuite/texture-skinny/src/
  603. oiio-Release-2.0.13/testsuite/texture-skinny/src/vertgrid.tx
  604. oiio-Release-2.0.13/testsuite/texture-udim/
  605. oiio-Release-2.0.13/testsuite/texture-udim/TRAVIS_SKIP_LSAN
  606. oiio-Release-2.0.13/testsuite/texture-udim/ref/
  607. oiio-Release-2.0.13/testsuite/texture-udim/ref/out-freetype2.7.tif
  608. oiio-Release-2.0.13/testsuite/texture-udim/ref/out-oldfreetype.tif
  609. oiio-Release-2.0.13/testsuite/texture-udim/ref/out.tif
  610. oiio-Release-2.0.13/testsuite/texture-udim/run.py
  611. oiio-Release-2.0.13/testsuite/texture-udim2/
  612. oiio-Release-2.0.13/testsuite/texture-udim2/TRAVIS_SKIP_LSAN
  613. oiio-Release-2.0.13/testsuite/texture-udim2/ref/
  614. oiio-Release-2.0.13/testsuite/texture-udim2/ref/out-freetype2.7.tif
  615. oiio-Release-2.0.13/testsuite/texture-udim2/ref/out-oldfreetype.tif
  616. oiio-Release-2.0.13/testsuite/texture-udim2/ref/out.tif
  617. oiio-Release-2.0.13/testsuite/texture-udim2/run.py
  618. oiio-Release-2.0.13/testsuite/texture-uint16/
  619. oiio-Release-2.0.13/testsuite/texture-uint16/ref/
  620. oiio-Release-2.0.13/testsuite/texture-uint16/ref/out.exr
  621. oiio-Release-2.0.13/testsuite/texture-uint16/run.py
  622. oiio-Release-2.0.13/testsuite/texture-uint8/
  623. oiio-Release-2.0.13/testsuite/texture-uint8/ref/
  624. oiio-Release-2.0.13/testsuite/texture-uint8/ref/out.exr
  625. oiio-Release-2.0.13/testsuite/texture-uint8/run.py
  626. oiio-Release-2.0.13/testsuite/texture-width0blur/
  627. oiio-Release-2.0.13/testsuite/texture-width0blur/ref/
  628. oiio-Release-2.0.13/testsuite/texture-width0blur/ref/out.tif
  629. oiio-Release-2.0.13/testsuite/texture-width0blur/run.py
  630. oiio-Release-2.0.13/testsuite/texture-wrapfill/
  631. oiio-Release-2.0.13/testsuite/texture-wrapfill/ref/
  632. oiio-Release-2.0.13/testsuite/texture-wrapfill/ref/out1.tif
  633. oiio-Release-2.0.13/testsuite/texture-wrapfill/ref/out3.tif
  634. oiio-Release-2.0.13/testsuite/texture-wrapfill/run.py
  635. oiio-Release-2.0.13/testsuite/tiff-depths/
  636. oiio-Release-2.0.13/testsuite/tiff-depths/ref/
  637. oiio-Release-2.0.13/testsuite/tiff-depths/ref/cmyk_as_cmyk.tif
  638. oiio-Release-2.0.13/testsuite/tiff-depths/ref/out.txt
  639. oiio-Release-2.0.13/testsuite/tiff-depths/run.py
  640. oiio-Release-2.0.13/testsuite/tiff-misc/
  641. oiio-Release-2.0.13/testsuite/tiff-misc/ref/
  642. oiio-Release-2.0.13/testsuite/tiff-misc/ref/check1.tif
  643. oiio-Release-2.0.13/testsuite/tiff-misc/run.py
  644. oiio-Release-2.0.13/testsuite/tiff-suite/
  645. oiio-Release-2.0.13/testsuite/tiff-suite/ref/
  646. oiio-Release-2.0.13/testsuite/tiff-suite/ref/out-alt.txt
  647. oiio-Release-2.0.13/testsuite/tiff-suite/ref/out-jpeg9b.txt
  648. oiio-Release-2.0.13/testsuite/tiff-suite/ref/out.txt
  649. oiio-Release-2.0.13/testsuite/tiff-suite/run.py
  650. oiio-Release-2.0.13/testsuite/webp/
  651. oiio-Release-2.0.13/testsuite/webp/ref/
  652. oiio-Release-2.0.13/testsuite/webp/ref/out-webp0.3.txt
  653. oiio-Release-2.0.13/testsuite/webp/ref/out-webp0.4.txt
  654. oiio-Release-2.0.13/testsuite/webp/ref/out-webp1.0.3.txt
  655. oiio-Release-2.0.13/testsuite/webp/run.py
  656. oiio-Release-2.0.13/testsuite/zfile/
  657. oiio-Release-2.0.13/testsuite/zfile/ref/
  658. oiio-Release-2.0.13/testsuite/zfile/ref/out.txt
  659. oiio-Release-2.0.13/testsuite/zfile/ref/out.zfile
  660. oiio-Release-2.0.13/testsuite/zfile/run.py
  661. patching file src/jpeg2000.imageio/jpeg2000output-v1.cpp
  662. -- CMake version is 3.5.2
  663. -- Project build dir = /tmp/SBo/oiio-Release-2.0.13/build
  664. -- Project install dir = /usr
  665. -- platform = linux64
  666. -- CMAKE_CXX_COMPILER is /usr/bin/c++
  667. -- CMAKE_CXX_COMPILER_ID is GNU
  668. -- Building for C++11
  669. -- clang-format found: /usr/bin/clang-format
  670. -- Setting Namespace to: OpenImageIO_v2_0
  671. -- Boost include /usr/include
  672. -- Boost lib debug /usr/lib64
  673. -- Boost lib release /usr/lib64
  674. -- Boost include dirs /usr/include
  675. -- Boost library dirs /usr/lib64
  676. -- Boost libraries /usr/lib64/libboost_filesystem.so;/usr/lib64/libboost_system.so;/usr/lib64/libboost_thread.so;/usr/lib64/libboost_chrono.so;/usr/lib64/libboost_date_time.so;/usr/lib64/libboost_atomic.so
  677. -- Field3d will not be used
  678. -- OpenVDB not found, OPENVDB_ROOT_DIR=''
  679. -- Found OpenCV 4.3.0 include in /usr/include/opencv4
  680. -- Found OpenCV libs: /usr/lib64/libopencv_core.so;/usr/lib64/libopencv_imgproc.so;/usr/lib64/libopencv_videoio.so
  681. -- DCMTK_INCLUDE_DIR = /usr/include
  682. -- robin-map include dir: /usr/include
  683. -- pybind11 2.5.0, include dir: /usr/include/python2.7
  684. -- Python version 2.7.17
  685. -- Could not Find Nuke. Skipping build of Nuke plugins.
  686. --
  687.  
  688. Did not find /tmp/SBo/oiio-Release-2.0.13/../oiio-images
  689. -- -> Will not run tests gpsread;oiiotool;oiiotool-attribs;oiiotool-readerror;oiiotool-xform;oiiotool-fixnan;maketx;oiiotool-maketx;misnamed-file;missingcolor;dpx;ico;iff;png;psd;rla;sgi;zfile;texture-interp-bicubic;texture-blurtube;texture-crop;texture-cropover;texture-derivs;texture-fill;texture-filtersize;texture-flipt;texture-gettexels;texture-gray;texture-mip-nomip;texture-mip-trilinear;texture-overscan;texture-pointsample;texture-uint8;texture-width0blur;texture-fat;texture-skinny;texture-wrapfill;texture-missing;texture-res;texture-udim;texture-udim2
  690. -- -> You can find it at
  691.  
  692. --
  693.  
  694. Did not find /tmp/SBo/oiio-Release-2.0.13/../openexr-images
  695. -- -> Will not run tests oiiotool-deep
  696. -- -> You can find it at
  697.  
  698. --
  699.  
  700. Did not find /tmp/SBo/oiio-Release-2.0.13/../oiio-images
  701. -- -> Will not run tests python-typedesc;python-imagespec;python-roi;python-deep;python-colorconfig;python-imageinput;python-imageoutput;python-imagebuf;python-imagebufalgo
  702. -- -> You can find it at
  703.  
  704. --
  705.  
  706. Did not find /tmp/SBo/oiio-Release-2.0.13/../bmpsuite
  707. -- -> Will not run tests bmp
  708. -- -> You can find it at http://entropymine.com/jason/bmpsuite/bmpsuite.zip
  709.  
  710. --
  711.  
  712. Did not find /tmp/SBo/oiio-Release-2.0.13/../libtiffpic
  713. -- -> Will not run tests tiff-suite;tiff-depths;tiff-misc
  714. -- -> You can find it at http://www.simplesystems.org/libtiff/images.html
  715.  
  716. --
  717.  
  718. Did not find /tmp/SBo/oiio-Release-2.0.13/../openexr-images
  719. -- -> Will not run tests openexr-suite;openexr-multires;openexr-chroma;openexr-v2;perchannel
  720. -- -> You can find it at http://www.openexr.com/downloads.html
  721.  
  722. --
  723.  
  724. Did not find /tmp/SBo/oiio-Release-2.0.13/../oiio-images
  725. -- -> Will not run tests gif
  726. -- -> You can find it at Recent checkout of oiio-images
  727.  
  728. --
  729.  
  730. Did not find /tmp/SBo/oiio-Release-2.0.13/../j2kp4files_v1_5
  731. -- -> Will not run tests jpeg2000
  732. -- -> You can find it at http://www.itu.int/net/ITU-T/sigdb/speimage/ImageForm-s.aspx?val=10100803
  733.  
  734. --
  735.  
  736. Did not find /tmp/SBo/oiio-Release-2.0.13/../oiio-images/pnm
  737. -- -> Will not run tests pnm
  738. -- -> You can find it at Recent checkout of oiio-images
  739.  
  740. --
  741.  
  742. Did not find /tmp/SBo/oiio-Release-2.0.13/../oiio-images/raw
  743. -- -> Will not run tests raw
  744. -- -> You can find it at Recent checkout of oiio-images
  745.  
  746. --
  747.  
  748. Did not find /tmp/SBo/oiio-Release-2.0.13/../TGAUTILS
  749. -- -> Will not run tests targa-tgautils
  750. -- -> You can find it at http://tgautils.inequation.org/
  751.  
  752. --
  753.  
  754. Did not find /tmp/SBo/oiio-Release-2.0.13/../fits-images
  755. -- -> Will not run tests fits
  756. -- -> You can find it at http://www.cv.nrao.edu/fits/data/tests/
  757.  
  758. --
  759.  
  760. Did not find /tmp/SBo/oiio-Release-2.0.13/../oiio-images/webp
  761. -- -> Will not run tests webp
  762. -- -> You can find it at Recent checkout of oiio-images
  763.  
  764. -- Configuring done
  765. -- Generating done
  766. -- Build files have been written to: /tmp/SBo/oiio-Release-2.0.13/build
  767. [ 0%] Built target CopyFiles
  768. [ 10%] Built target OpenImageIO_Util
  769. Scanning dependencies of target OpenImageIO
  770. [ 10%] Building CXX object src/libOpenImageIO/CMakeFiles/OpenImageIO.dir/__/jpeg2000.imageio/jpeg2000output-v1.cpp.o
  771. [ 10%] Linking CXX shared library libOpenImageIO.so
  772. [ 79%] Built target OpenImageIO
  773. [ 80%] Linking CXX executable iconvert
  774. /usr/lib64/gcc/x86_64-slackware-linux/5.5.0/../../../../x86_64-slackware-linux/bin/ld: warning: libzvbi.so.0, needed by /usr/lib64/gcc/x86_64-slackware-linux/5.5.0/../../../../lib64/libavcodec.so, not found (try using -rpath or -rpath-link)
  775. /usr/lib64/gcc/x86_64-slackware-linux/5.5.0/../../../../x86_64-slackware-linux/bin/ld: warning: libx265.so.188, needed by /usr/lib64/gcc/x86_64-slackware-linux/5.5.0/../../../../lib64/libavcodec.so, not found (try using -rpath or -rpath-link)
  776. /usr/lib64/gcc/x86_64-slackware-linux/5.5.0/../../../../x86_64-slackware-linux/bin/ld: warning: libtwolame.so.0, needed by /usr/lib64/gcc/x86_64-slackware-linux/5.5.0/../../../../lib64/libavcodec.so, not found (try using -rpath or -rpath-link)
  777. /usr/lib64/gcc/x86_64-slackware-linux/5.5.0/../../../../x86_64-slackware-linux/bin/ld: warning: libspeex.so.1, needed by /usr/lib64/gcc/x86_64-slackware-linux/5.5.0/../../../../lib64/libavcodec.so, not found (try using -rpath or -rpath-link)
  778. /usr/lib64/gcc/x86_64-slackware-linux/5.5.0/../../../../x86_64-slackware-linux/bin/ld: warning: libsnappy.so.1, needed by /usr/lib64/gcc/x86_64-slackware-linux/5.5.0/../../../../lib64/libavcodec.so, not found (try using -rpath or -rpath-link)
  779. /usr/lib64/gcc/x86_64-slackware-linux/5.5.0/../../../../x86_64-slackware-linux/bin/ld: warning: libopencore-amrwb.so.0, needed by /usr/lib64/gcc/x86_64-slackware-linux/5.5.0/../../../../lib64/libavcodec.so, not found (try using -rpath or -rpath-link)
  780. /usr/lib64/gcc/x86_64-slackware-linux/5.5.0/../../../../x86_64-slackware-linux/bin/ld: warning: libopencore-amrnb.so.0, needed by /usr/lib64/gcc/x86_64-slackware-linux/5.5.0/../../../../lib64/libavcodec.so, not found (try using -rpath or -rpath-link)
  781. /usr/lib64/gcc/x86_64-slackware-linux/5.5.0/../../../../x86_64-slackware-linux/bin/ld: warning: libilbc.so.2, needed by /usr/lib64/gcc/x86_64-slackware-linux/5.5.0/../../../../lib64/libavcodec.so, not found (try using -rpath or -rpath-link)
  782. /usr/lib64/gcc/x86_64-slackware-linux/5.5.0/../../../../x86_64-slackware-linux/bin/ld: warning: libfdk-aac.so.2, needed by /usr/lib64/gcc/x86_64-slackware-linux/5.5.0/../../../../lib64/libavcodec.so, not found (try using -rpath or -rpath-link)
  783. /usr/lib64/gcc/x86_64-slackware-linux/5.5.0/../../../../x86_64-slackware-linux/bin/ld: warning: libcelt0.so.2, needed by /usr/lib64/gcc/x86_64-slackware-linux/5.5.0/../../../../lib64/libavcodec.so, not found (try using -rpath or -rpath-link)
  784. /usr/lib64/gcc/x86_64-slackware-linux/5.5.0/../../../../x86_64-slackware-linux/bin/ld: warning: librtmp.so.1, needed by /usr/lib64/gcc/x86_64-slackware-linux/5.5.0/../../../../lib64/libavformat.so, not found (try using -rpath or -rpath-link)
  785. /usr/lib64/gcc/x86_64-slackware-linux/5.5.0/../../../../x86_64-slackware-linux/bin/ld: warning: libmodplug.so.1, needed by /usr/lib64/gcc/x86_64-slackware-linux/5.5.0/../../../../lib64/libavformat.so, not found (try using -rpath or -rpath-link)
  786. /usr/lib64/gcc/x86_64-slackware-linux/5.5.0/../../../../x86_64-slackware-linux/bin/ld: warning: libgme.so.0, needed by /usr/lib64/gcc/x86_64-slackware-linux/5.5.0/../../../../lib64/libavformat.so, not found (try using -rpath or -rpath-link)
  787. /usr/lib64/gcc/x86_64-slackware-linux/5.5.0/../../../../x86_64-slackware-linux/bin/ld: warning: libdc1394.so.25, needed by /usr/lib64/gcc/x86_64-slackware-linux/5.5.0/../../../../lib64/libopencv_videoio.so, not found (try using -rpath or -rpath-link)
  788. /usr/lib64/gcc/x86_64-slackware-linux/5.5.0/../../../../lib64/libopencv_videoio.so: undefined reference to `dc1394_feature_whitebalance_get_value'
  789. /usr/lib64/gcc/x86_64-slackware-linux/5.5.0/../../../../lib64/libavcodec.so: undefined reference to `vbi_classify_page'
  790. /usr/lib64/gcc/x86_64-slackware-linux/5.5.0/../../../../lib64/libopencv_videoio.so: undefined reference to `dc1394_camera_enumerate'
  791. /usr/lib64/gcc/x86_64-slackware-linux/5.5.0/../../../../lib64/libavformat.so: undefined reference to `gme_delete'
  792. /usr/lib64/gcc/x86_64-slackware-linux/5.5.0/../../../../lib64/libavcodec.so: undefined reference to `snappy_max_compressed_length'
  793. /usr/lib64/gcc/x86_64-slackware-linux/5.5.0/../../../../lib64/libavcodec.so: undefined reference to `speex_encoder_init'
  794. /usr/lib64/gcc/x86_64-slackware-linux/5.5.0/../../../../lib64/libavformat.so: undefined reference to `gme_free_info'
  795. /usr/lib64/gcc/x86_64-slackware-linux/5.5.0/../../../../lib64/libopencv_videoio.so: undefined reference to `dc1394_deinterlace_stereo_frames'
  796. /usr/lib64/gcc/x86_64-slackware-linux/5.5.0/../../../../lib64/libavcodec.so: undefined reference to `WebRtcIlbcfix_DecodeImpl'
  797. /usr/lib64/gcc/x86_64-slackware-linux/5.5.0/../../../../lib64/libavcodec.so: undefined reference to `speex_encode_int'
  798. /usr/lib64/gcc/x86_64-slackware-linux/5.5.0/../../../../lib64/libavcodec.so: undefined reference to `speex_bits_reset'
  799. /usr/lib64/gcc/x86_64-slackware-linux/5.5.0/../../../../lib64/libavcodec.so: undefined reference to `twolame_set_bitrate'
  800. /usr/lib64/gcc/x86_64-slackware-linux/5.5.0/../../../../lib64/libavcodec.so: undefined reference to `aacDecoder_DecodeFrame'
  801. /usr/lib64/gcc/x86_64-slackware-linux/5.5.0/../../../../lib64/libopencv_videoio.so: undefined reference to `dc1394_feature_set_value'
  802. /usr/lib64/gcc/x86_64-slackware-linux/5.5.0/../../../../lib64/libopencv_videoio.so: undefined reference to `dc1394_feature_set_absolute_control'
  803. /usr/lib64/gcc/x86_64-slackware-linux/5.5.0/../../../../lib64/libavformat.so: undefined reference to `ModPlug_Unload'
  804. /usr/lib64/gcc/x86_64-slackware-linux/5.5.0/../../../../lib64/libavcodec.so: undefined reference to `aacDecoder_AncDataInit'
  805. /usr/lib64/gcc/x86_64-slackware-linux/5.5.0/../../../../lib64/libavformat.so: undefined reference to `RTMP_Read'
  806. /usr/lib64/gcc/x86_64-slackware-linux/5.5.0/../../../../lib64/libavcodec.so: undefined reference to `speex_encode_stereo_int'
  807. /usr/lib64/gcc/x86_64-slackware-linux/5.5.0/../../../../lib64/libavcodec.so: undefined reference to `celt_decoder_destroy'
  808. /usr/lib64/gcc/x86_64-slackware-linux/5.5.0/../../../../lib64/libavcodec.so: undefined reference to `aacEncEncode'
  809. /usr/lib64/gcc/x86_64-slackware-linux/5.5.0/../../../../lib64/libavformat.so: undefined reference to `ModPlug_SetSettings'
  810. /usr/lib64/gcc/x86_64-slackware-linux/5.5.0/../../../../lib64/libavformat.so: undefined reference to `gme_track_ended'
  811. /usr/lib64/gcc/x86_64-slackware-linux/5.5.0/../../../../lib64/libavformat.so: undefined reference to `gme_track_count'
  812. /usr/lib64/gcc/x86_64-slackware-linux/5.5.0/../../../../lib64/libopencv_videoio.so: undefined reference to `dc1394_convert_frames'
  813. /usr/lib64/gcc/x86_64-slackware-linux/5.5.0/../../../../lib64/libavcodec.so: undefined reference to `aacDecoder_Close'
  814. /usr/lib64/gcc/x86_64-slackware-linux/5.5.0/../../../../lib64/libavformat.so: undefined reference to `ModPlug_NumChannels'
  815. /usr/lib64/gcc/x86_64-slackware-linux/5.5.0/../../../../lib64/libopencv_videoio.so: undefined reference to `dc1394_capture_is_frame_corrupt'
  816. /usr/lib64/gcc/x86_64-slackware-linux/5.5.0/../../../../lib64/libavcodec.so: undefined reference to `speex_bits_nbytes'
  817. /usr/lib64/gcc/x86_64-slackware-linux/5.5.0/../../../../lib64/libavformat.so: undefined reference to `ModPlug_GetCurrentTempo'
  818. /usr/lib64/gcc/x86_64-slackware-linux/5.5.0/../../../../lib64/libavcodec.so: undefined reference to `speex_header_free'
  819. /usr/lib64/gcc/x86_64-slackware-linux/5.5.0/../../../../lib64/libavcodec.so: undefined reference to `speex_bits_remaining'
  820. /usr/lib64/gcc/x86_64-slackware-linux/5.5.0/../../../../lib64/libavcodec.so: undefined reference to `twolame_set_energy_levels'
  821. /usr/lib64/gcc/x86_64-slackware-linux/5.5.0/../../../../lib64/libopencv_videoio.so: undefined reference to `dc1394_video_set_operation_mode'
  822. /usr/lib64/gcc/x86_64-slackware-linux/5.5.0/../../../../lib64/libavcodec.so: undefined reference to `vbi_unref_page'
  823. /usr/lib64/gcc/x86_64-slackware-linux/5.5.0/../../../../lib64/libavformat.so: undefined reference to `gme_start_track'
  824. /usr/lib64/gcc/x86_64-slackware-linux/5.5.0/../../../../lib64/libavformat.so: undefined reference to `ModPlug_GetName'
  825. /usr/lib64/gcc/x86_64-slackware-linux/5.5.0/../../../../lib64/libavcodec.so: undefined reference to `twolame_init_params'
  826. /usr/lib64/gcc/x86_64-slackware-linux/5.5.0/../../../../lib64/libavformat.so: undefined reference to `ModPlug_Seek'
  827. /usr/lib64/gcc/x86_64-slackware-linux/5.5.0/../../../../lib64/libavcodec.so: undefined reference to `speex_std_stereo_request_handler'
  828. /usr/lib64/gcc/x86_64-slackware-linux/5.5.0/../../../../lib64/libavformat.so: undefined reference to `RTMP_LogSetLevel'
  829. /usr/lib64/gcc/x86_64-slackware-linux/5.5.0/../../../../lib64/libavcodec.so: undefined reference to `aacDecoder_SetParam'
  830. /usr/lib64/gcc/x86_64-slackware-linux/5.5.0/../../../../lib64/libavformat.so: undefined reference to `RTMP_LogSetCallback'
  831. /usr/lib64/gcc/x86_64-slackware-linux/5.5.0/../../../../lib64/libavcodec.so: undefined reference to `D_IF_init'
  832. /usr/lib64/gcc/x86_64-slackware-linux/5.5.0/../../../../lib64/libavformat.so: undefined reference to `gme_open_data'
  833. /usr/lib64/gcc/x86_64-slackware-linux/5.5.0/../../../../lib64/libavcodec.so: undefined reference to `WebRtcIlbcfix_InitEncode'
  834. /usr/lib64/gcc/x86_64-slackware-linux/5.5.0/../../../../lib64/libavcodec.so: undefined reference to `speex_bits_read_from'
  835. /usr/lib64/gcc/x86_64-slackware-linux/5.5.0/../../../../lib64/libavcodec.so: undefined reference to `twolame_encode_buffer'
  836. /usr/lib64/gcc/x86_64-slackware-linux/5.5.0/../../../../lib64/libavcodec.so: undefined reference to `twolame_set_copyright'
  837. /usr/lib64/gcc/x86_64-slackware-linux/5.5.0/../../../../lib64/libavformat.so: undefined reference to `RTMP_Connect'
  838. /usr/lib64/gcc/x86_64-slackware-linux/5.5.0/../../../../lib64/libopencv_videoio.so: undefined reference to `dc1394_free'
  839. /usr/lib64/gcc/x86_64-slackware-linux/5.5.0/../../../../lib64/libavcodec.so: undefined reference to `twolame_encode_buffer_interleaved'
  840. /usr/lib64/gcc/x86_64-slackware-linux/5.5.0/../../../../lib64/libavcodec.so: undefined reference to `twolame_set_VBR_level'
  841. /usr/lib64/gcc/x86_64-slackware-linux/5.5.0/../../../../lib64/libavcodec.so: undefined reference to `vbi_draw_vt_page_region'
  842. /usr/lib64/gcc/x86_64-slackware-linux/5.5.0/../../../../lib64/libavcodec.so: undefined reference to `vbi_decoder_delete'
  843. /usr/lib64/gcc/x86_64-slackware-linux/5.5.0/../../../../lib64/libavformat.so: undefined reference to `ModPlug_GetCurrentSpeed'
  844. /usr/lib64/gcc/x86_64-slackware-linux/5.5.0/../../../../lib64/libavcodec.so: undefined reference to `_vbi_bit_reverse'
  845. /usr/lib64/gcc/x86_64-slackware-linux/5.5.0/../../../../lib64/libavcodec.so: undefined reference to `celt_mode_destroy'
  846. /usr/lib64/gcc/x86_64-slackware-linux/5.5.0/../../../../lib64/libavcodec.so: undefined reference to `Encoder_Interface_exit'
  847. /usr/lib64/gcc/x86_64-slackware-linux/5.5.0/../../../../lib64/libavcodec.so: undefined reference to `twolame_set_mode'
  848. /usr/lib64/gcc/x86_64-slackware-linux/5.5.0/../../../../lib64/libavcodec.so: undefined reference to `aacDecoder_ConfigRaw'
  849. /usr/lib64/gcc/x86_64-slackware-linux/5.5.0/../../../../lib64/libopencv_videoio.so: undefined reference to `dc1394_camera_new'
  850. /usr/lib64/gcc/x86_64-slackware-linux/5.5.0/../../../../lib64/libavcodec.so: undefined reference to `speex_wb_mode'
  851. /usr/lib64/gcc/x86_64-slackware-linux/5.5.0/../../../../lib64/libavcodec.so: undefined reference to `speex_bits_pack'
  852. /usr/lib64/gcc/x86_64-slackware-linux/5.5.0/../../../../lib64/libavformat.so: undefined reference to `ModPlug_GetLength'
  853. /usr/lib64/gcc/x86_64-slackware-linux/5.5.0/../../../../lib64/libavformat.so: undefined reference to `ModPlug_Read'
  854. /usr/lib64/gcc/x86_64-slackware-linux/5.5.0/../../../../lib64/libopencv_videoio.so: undefined reference to `dc1394_video_set_mode'
  855. /usr/lib64/gcc/x86_64-slackware-linux/5.5.0/../../../../lib64/libavcodec.so: undefined reference to `Encoder_Interface_init'
  856. /usr/lib64/gcc/x86_64-slackware-linux/5.5.0/../../../../lib64/libavcodec.so: undefined reference to `celt_decode'
  857. /usr/lib64/gcc/x86_64-slackware-linux/5.5.0/../../../../lib64/libavformat.so: undefined reference to `ModPlug_NumInstruments'
  858. /usr/lib64/gcc/x86_64-slackware-linux/5.5.0/../../../../lib64/libopencv_videoio.so: undefined reference to `dc1394_feature_whitebalance_set_value'
  859. /usr/lib64/gcc/x86_64-slackware-linux/5.5.0/../../../../lib64/libavcodec.so: undefined reference to `speex_header_to_packet'
  860. /usr/lib64/gcc/x86_64-slackware-linux/5.5.0/../../../../lib64/libavformat.so: undefined reference to `RTMP_SetupURL'
  861. /usr/lib64/gcc/x86_64-slackware-linux/5.5.0/../../../../lib64/libavformat.so: undefined reference to `RTMP_Init'
  862. /usr/lib64/gcc/x86_64-slackware-linux/5.5.0/../../../../lib64/libopencv_videoio.so: undefined reference to `dc1394_capture_stop'
  863. /usr/lib64/gcc/x86_64-slackware-linux/5.5.0/../../../../lib64/libopencv_videoio.so: undefined reference to `dc1394_capture_enqueue'
  864. /usr/lib64/gcc/x86_64-slackware-linux/5.5.0/../../../../lib64/libavcodec.so: undefined reference to `twolame_close'
  865. /usr/lib64/gcc/x86_64-slackware-linux/5.5.0/../../../../lib64/libavformat.so: undefined reference to `gme_seek'
  866. /usr/lib64/gcc/x86_64-slackware-linux/5.5.0/../../../../lib64/libopencv_videoio.so: undefined reference to `dc1394_get_control_registers'
  867. /usr/lib64/gcc/x86_64-slackware-linux/5.5.0/../../../../lib64/libopencv_videoio.so: undefined reference to `dc1394_capture_get_fileno'
  868. /usr/lib64/gcc/x86_64-slackware-linux/5.5.0/../../../../lib64/libavcodec.so: undefined reference to `aacEncoder_SetParam'
  869. /usr/lib64/gcc/x86_64-slackware-linux/5.5.0/../../../../lib64/libopencv_videoio.so: undefined reference to `dc1394_video_set_framerate'
  870. /usr/lib64/gcc/x86_64-slackware-linux/5.5.0/../../../../lib64/libavformat.so: undefined reference to `ModPlug_GetCurrentPattern'
  871. /usr/lib64/gcc/x86_64-slackware-linux/5.5.0/../../../../lib64/libavcodec.so: undefined reference to `twolame_set_verbosity'
  872. /usr/lib64/gcc/x86_64-slackware-linux/5.5.0/../../../../lib64/libopencv_videoio.so: undefined reference to `dc1394_new'
  873. /usr/lib64/gcc/x86_64-slackware-linux/5.5.0/../../../../lib64/libavcodec.so: undefined reference to `aacEncClose'
  874. /usr/lib64/gcc/x86_64-slackware-linux/5.5.0/../../../../lib64/libavformat.so: undefined reference to `ModPlug_SampleName'
  875. /usr/lib64/gcc/x86_64-slackware-linux/5.5.0/../../../../lib64/libavcodec.so: undefined reference to `D_IF_exit'
  876. /usr/lib64/gcc/x86_64-slackware-linux/5.5.0/../../../../lib64/libavformat.so: undefined reference to `RTMP_Write'
  877. /usr/lib64/gcc/x86_64-slackware-linux/5.5.0/../../../../lib64/libavcodec.so: undefined reference to `speex_uwb_mode'
  878. /usr/lib64/gcc/x86_64-slackware-linux/5.5.0/../../../../lib64/libopencv_videoio.so: undefined reference to `dc1394_video_set_transmission'
  879. /usr/lib64/gcc/x86_64-slackware-linux/5.5.0/../../../../lib64/libavcodec.so: undefined reference to `twolame_set_error_protection'
  880. /usr/lib64/gcc/x86_64-slackware-linux/5.5.0/../../../../lib64/libavformat.so: undefined reference to `RTMP_Pause'
  881. /usr/lib64/gcc/x86_64-slackware-linux/5.5.0/../../../../lib64/libavformat.so: undefined reference to `ModPlug_Load'
  882. /usr/lib64/gcc/x86_64-slackware-linux/5.5.0/../../../../lib64/libavformat.so: undefined reference to `ModPlug_GetCurrentRow'
  883. /usr/lib64/gcc/x86_64-slackware-linux/5.5.0/../../../../lib64/libopencv_videoio.so: undefined reference to `dc1394_video_set_iso_speed'
  884. /usr/lib64/gcc/x86_64-slackware-linux/5.5.0/../../../../lib64/libavcodec.so: undefined reference to `twolame_set_original'
  885. /usr/lib64/gcc/x86_64-slackware-linux/5.5.0/../../../../lib64/libavcodec.so: undefined reference to `twolame_set_psymodel'
  886. /usr/lib64/gcc/x86_64-slackware-linux/5.5.0/../../../../lib64/libopencv_videoio.so: undefined reference to `dc1394_feature_set_power'
  887. /usr/lib64/gcc/x86_64-slackware-linux/5.5.0/../../../../lib64/libopencv_videoio.so: undefined reference to `dc1394_feature_get_value'
  888. /usr/lib64/gcc/x86_64-slackware-linux/5.5.0/../../../../lib64/libavcodec.so: undefined reference to `twolame_set_num_channels'
  889. /usr/lib64/gcc/x86_64-slackware-linux/5.5.0/../../../../lib64/libavcodec.so: undefined reference to `speex_decode_int'
  890. /usr/lib64/gcc/x86_64-slackware-linux/5.5.0/../../../../lib64/libavcodec.so: undefined reference to `aacDecoder_GetStreamInfo'
  891. /usr/lib64/gcc/x86_64-slackware-linux/5.5.0/../../../../lib64/libavformat.so: undefined reference to `ModPlug_GetCurrentOrder'
  892. /usr/lib64/gcc/x86_64-slackware-linux/5.5.0/../../../../lib64/libopencv_videoio.so: undefined reference to `dc1394_camera_free'
  893. /usr/lib64/gcc/x86_64-slackware-linux/5.5.0/../../../../lib64/libopencv_videoio.so: undefined reference to `dc1394_get_color_coding_from_video_mode'
  894. /usr/lib64/gcc/x86_64-slackware-linux/5.5.0/../../../../lib64/libavformat.so: undefined reference to `ModPlug_InstrumentName'
  895. /usr/lib64/gcc/x86_64-slackware-linux/5.5.0/../../../../lib64/libavcodec.so: undefined reference to `speex_bits_peek_unsigned'
  896. /usr/lib64/gcc/x86_64-slackware-linux/5.5.0/../../../../lib64/libopencv_videoio.so: undefined reference to `dc1394_camera_free_list'
  897. /usr/lib64/gcc/x86_64-slackware-linux/5.5.0/../../../../lib64/libavcodec.so: undefined reference to `aacEncOpen'
  898. /usr/lib64/gcc/x86_64-slackware-linux/5.5.0/../../../../lib64/libavcodec.so: undefined reference to `aacDecoder_Fill'
  899. /usr/lib64/gcc/x86_64-slackware-linux/5.5.0/../../../../lib64/libavcodec.so: undefined reference to `Decoder_Interface_exit'
  900. /usr/lib64/gcc/x86_64-slackware-linux/5.5.0/../../../../lib64/libavcodec.so: undefined reference to `twolame_encode_buffer_float32'
  901. /usr/lib64/gcc/x86_64-slackware-linux/5.5.0/../../../../lib64/libavcodec.so: undefined reference to `twolame_set_out_samplerate'
  902. /usr/lib64/gcc/x86_64-slackware-linux/5.5.0/../../../../lib64/libavcodec.so: undefined reference to `celt_mode_create'
  903. /usr/lib64/gcc/x86_64-slackware-linux/5.5.0/../../../../lib64/libavcodec.so: undefined reference to `speex_nb_mode'
  904. /usr/lib64/gcc/x86_64-slackware-linux/5.5.0/../../../../lib64/libavcodec.so: undefined reference to `speex_decode_stereo_int'
  905. /usr/lib64/gcc/x86_64-slackware-linux/5.5.0/../../../../lib64/libavcodec.so: undefined reference to `Decoder_Interface_init'
  906. /usr/lib64/gcc/x86_64-slackware-linux/5.5.0/../../../../lib64/libavformat.so: undefined reference to `RTMP_EnableWrite'
  907. /usr/lib64/gcc/x86_64-slackware-linux/5.5.0/../../../../lib64/libavcodec.so: undefined reference to `twolame_set_VBR'
  908. /usr/lib64/gcc/x86_64-slackware-linux/5.5.0/../../../../lib64/libavcodec.so: undefined reference to `speex_decoder_destroy'
  909. /usr/lib64/gcc/x86_64-slackware-linux/5.5.0/../../../../lib64/libavformat.so: undefined reference to `gme_play'
  910. /usr/lib64/gcc/x86_64-slackware-linux/5.5.0/../../../../lib64/libavcodec.so: undefined reference to `vbi_version'
  911. /usr/lib64/gcc/x86_64-slackware-linux/5.5.0/../../../../lib64/libavformat.so: undefined reference to `gme_track_info'
  912. /usr/lib64/gcc/x86_64-slackware-linux/5.5.0/../../../../lib64/libavcodec.so: undefined reference to `speex_encoder_ctl'
  913. /usr/lib64/gcc/x86_64-slackware-linux/5.5.0/../../../../lib64/libavcodec.so: undefined reference to `D_IF_decode'
  914. /usr/lib64/gcc/x86_64-slackware-linux/5.5.0/../../../../lib64/libavcodec.so: undefined reference to `speex_bits_init'
  915. /usr/lib64/gcc/x86_64-slackware-linux/5.5.0/../../../../lib64/libavcodec.so: undefined reference to `snappy_compress'
  916. /usr/lib64/gcc/x86_64-slackware-linux/5.5.0/../../../../lib64/libavcodec.so: undefined reference to `vbi_event_handler_add'
  917. /usr/lib64/gcc/x86_64-slackware-linux/5.5.0/../../../../lib64/libavcodec.so: undefined reference to `Decoder_Interface_Decode'
  918. /usr/lib64/gcc/x86_64-slackware-linux/5.5.0/../../../../lib64/libavcodec.so: undefined reference to `speex_encoder_destroy'
  919. /usr/lib64/gcc/x86_64-slackware-linux/5.5.0/../../../../lib64/libopencv_videoio.so: undefined reference to `dc1394_debayer_frames'
  920. /usr/lib64/gcc/x86_64-slackware-linux/5.5.0/../../../../lib64/libopencv_videoio.so: undefined reference to `dc1394_video_get_supported_modes'
  921. /usr/lib64/gcc/x86_64-slackware-linux/5.5.0/../../../../lib64/libavcodec.so: undefined reference to `speex_decoder_init'
  922. /usr/lib64/gcc/x86_64-slackware-linux/5.5.0/../../../../lib64/libavformat.so: undefined reference to `ModPlug_NumSamples'
  923. /usr/lib64/gcc/x86_64-slackware-linux/5.5.0/../../../../lib64/libavformat.so: undefined reference to `ModPlug_GetMessage'
  924. /usr/lib64/gcc/x86_64-slackware-linux/5.5.0/../../../../lib64/libavcodec.so: undefined reference to `speex_bits_destroy'
  925. /usr/lib64/gcc/x86_64-slackware-linux/5.5.0/../../../../lib64/libopencv_videoio.so: undefined reference to `dc1394_video_get_mode'
  926. /usr/lib64/gcc/x86_64-slackware-linux/5.5.0/../../../../lib64/libavformat.so: undefined reference to `ModPlug_GetSettings'
  927. /usr/lib64/gcc/x86_64-slackware-linux/5.5.0/../../../../lib64/libavcodec.so: undefined reference to `WebRtcIlbcfix_InitDecode'
  928. /usr/lib64/gcc/x86_64-slackware-linux/5.5.0/../../../../lib64/libavcodec.so: undefined reference to `vbi_fetch_vt_page'
  929. /usr/lib64/gcc/x86_64-slackware-linux/5.5.0/../../../../lib64/libavformat.so: undefined reference to `RTMP_Close'
  930. /usr/lib64/gcc/x86_64-slackware-linux/5.5.0/../../../../lib64/libopencv_videoio.so: undefined reference to `dc1394_feature_get_all'
  931. /usr/lib64/gcc/x86_64-slackware-linux/5.5.0/../../../../lib64/libopencv_videoio.so: undefined reference to `dc1394_video_get_supported_framerates'
  932. /usr/lib64/gcc/x86_64-slackware-linux/5.5.0/../../../../lib64/libopencv_videoio.so: undefined reference to `dc1394_capture_dequeue'
  933. /usr/lib64/gcc/x86_64-slackware-linux/5.5.0/../../../../lib64/libavcodec.so: undefined reference to `twolame_encode_flush'
  934. /usr/lib64/gcc/x86_64-slackware-linux/5.5.0/../../../../lib64/libavcodec.so: undefined reference to `vbi_decode'
  935. /usr/lib64/gcc/x86_64-slackware-linux/5.5.0/../../../../lib64/libavcodec.so: undefined reference to `aacEncInfo'
  936. /usr/lib64/gcc/x86_64-slackware-linux/5.5.0/../../../../lib64/libopencv_videoio.so: undefined reference to `dc1394_get_image_size_from_video_mode'
  937. /usr/lib64/gcc/x86_64-slackware-linux/5.5.0/../../../../lib64/libavformat.so: undefined reference to `RTMP_ConnectStream'
  938. /usr/lib64/gcc/x86_64-slackware-linux/5.5.0/../../../../lib64/libavcodec.so: undefined reference to `vbi_print_page_region'
  939. /usr/lib64/gcc/x86_64-slackware-linux/5.5.0/../../../../lib64/libavcodec.so: undefined reference to `twolame_set_in_samplerate'
  940. /usr/lib64/gcc/x86_64-slackware-linux/5.5.0/../../../../lib64/libavcodec.so: undefined reference to `WebRtcIlbcfix_EncodeImpl'
  941. /usr/lib64/gcc/x86_64-slackware-linux/5.5.0/../../../../lib64/libavcodec.so: undefined reference to `aacDecoder_Open'
  942. /usr/lib64/gcc/x86_64-slackware-linux/5.5.0/../../../../lib64/libavformat.so: undefined reference to `gme_identify_header'
  943. /usr/lib64/gcc/x86_64-slackware-linux/5.5.0/../../../../lib64/libavformat.so: undefined reference to `RTMP_SendSeek'
  944. /usr/lib64/gcc/x86_64-slackware-linux/5.5.0/../../../../lib64/libavcodec.so: undefined reference to `speex_bits_write'
  945. /usr/lib64/gcc/x86_64-slackware-linux/5.5.0/../../../../lib64/libavformat.so: undefined reference to `ModPlug_NumPatterns'
  946. /usr/lib64/gcc/x86_64-slackware-linux/5.5.0/../../../../lib64/libavcodec.so: undefined reference to `celt_header_init'
  947. /usr/lib64/gcc/x86_64-slackware-linux/5.5.0/../../../../lib64/libavcodec.so: undefined reference to `x265_api_get_188'
  948. /usr/lib64/gcc/x86_64-slackware-linux/5.5.0/../../../../lib64/libavcodec.so: undefined reference to `Encoder_Interface_Encode'
  949. /usr/lib64/gcc/x86_64-slackware-linux/5.5.0/../../../../lib64/libopencv_videoio.so: undefined reference to `dc1394_capture_setup'
  950. /usr/lib64/gcc/x86_64-slackware-linux/5.5.0/../../../../lib64/libavcodec.so: undefined reference to `twolame_init'
  951. /usr/lib64/gcc/x86_64-slackware-linux/5.5.0/../../../../lib64/libavcodec.so: undefined reference to `speex_init_header'
  952. /usr/lib64/gcc/x86_64-slackware-linux/5.5.0/../../../../lib64/libavcodec.so: undefined reference to `speex_decoder_ctl'
  953. /usr/lib64/gcc/x86_64-slackware-linux/5.5.0/../../../../lib64/libavcodec.so: undefined reference to `twolame_encode_buffer_float32_interleaved'
  954. /usr/lib64/gcc/x86_64-slackware-linux/5.5.0/../../../../lib64/libopencv_videoio.so: undefined reference to `dc1394_feature_set_mode'
  955. /usr/lib64/gcc/x86_64-slackware-linux/5.5.0/../../../../lib64/libavcodec.so: undefined reference to `speex_lib_get_mode'
  956. /usr/lib64/gcc/x86_64-slackware-linux/5.5.0/../../../../lib64/libavcodec.so: undefined reference to `speex_packet_to_header'
  957. /usr/lib64/gcc/x86_64-slackware-linux/5.5.0/../../../../lib64/libavcodec.so: undefined reference to `celt_decoder_create_custom'
  958. /usr/lib64/gcc/x86_64-slackware-linux/5.5.0/../../../../lib64/libavformat.so: undefined reference to `RTMP_Socket'
  959. /usr/lib64/gcc/x86_64-slackware-linux/5.5.0/../../../../lib64/libavcodec.so: undefined reference to `vbi_decoder_new'
  960. collect2: error: ld returned 1 exit status
  961. src/iconvert/CMakeFiles/iconvert.dir/build.make:163: recipe for target 'src/iconvert/iconvert' failed
  962. make[2]: *** [src/iconvert/iconvert] Error 1
  963. CMakeFiles/Makefile2:1700: recipe for target 'src/iconvert/CMakeFiles/iconvert.dir/all' failed
  964. make[1]: *** [src/iconvert/CMakeFiles/iconvert.dir/all] Error 2
  965. Makefile:160: recipe for target 'all' failed
  966. make: *** [all] Error 2
  967.  
RAW Paste Data