Advertisement
Guest User

Untitled

a guest
Jun 18th, 2019
181
Never
Not a member of Pastebin yet? Sign Up, it unlocks many cool features!
  1. :: Parsing SRCINFO (1/1): pcsx2-git
  2. ==> Making package: pcsx2-git 1.5.0.r2255.43d0bd99c-1 (Tue 18 Jun 2019 01:45:25 PM EDT)
  3. ==> Retrieving sources...
  4. -> Updating pcsx2 git repo...
  5. Fetching origin
  6. ==> Validating source files with sha256sums...
  7. pcsx2 ... Skipped
  8. ==> Cleaning up...
  9. ==> Making package: pcsx2-git 1.5.0.r2255.43d0bd99c-1 (Tue 18 Jun 2019 01:45:26 PM EDT)
  10. ==> Checking runtime dependencies...
  11. ==> Checking buildtime dependencies...
  12. ==> Retrieving sources...
  13. -> Updating pcsx2 git repo...
  14. Fetching origin
  15. ==> Validating source files with sha256sums...
  16. pcsx2 ... Skipped
  17. ==> Removing existing $srcdir/ directory...
  18. ==> Extracting sources...
  19. -> Creating working copy of pcsx2 git repo...
  20. Cloning into 'pcsx2'...
  21. done.
  22. ==> Starting prepare()...
  23. ==> Starting pkgver()...
  24. ==> Updated version: pcsx2-git 1.5.0.r3163.1fc351663-1
  25. ==> Sources are ready.
  26. ==> Making package: pcsx2-git 1.5.0.r3163.1fc351663-1 (Tue 18 Jun 2019 01:45:28 PM EDT)
  27. ==> Checking runtime dependencies...
  28. ==> Checking buildtime dependencies...
  29. ==> WARNING: Using existing $srcdir/ tree
  30. ==> Starting pkgver()...
  31. ==> Starting build()...
  32. -- The C compiler identification is GNU 9.1.0
  33. -- The CXX compiler identification is GNU 9.1.0
  34. -- Check for working C compiler: /usr/bin/cc
  35. -- Check for working C compiler: /usr/bin/cc -- works
  36. -- Detecting C compiler ABI info
  37. -- Detecting C compiler ABI info - done
  38. -- Detecting C compile features
  39. -- Detecting C compile features - done
  40. -- Check for working CXX compiler: /usr/bin/c++
  41. -- Check for working CXX compiler: /usr/bin/c++ -- works
  42. -- Detecting CXX compiler ABI info
  43. -- Detecting CXX compiler ABI info - done
  44. -- Detecting CXX compile features
  45. -- Detecting CXX compile features - done
  46. -- Building with GNU GCC
  47. -- Enable the building of po files by default in Release build !!!
  48. -- Cross compilation is enabled.
  49. -- Compiling a i386 build on a x86_64 host.
  50. -- Found ALSA: /usr/lib32/libasound.so (found version "1.1.9")
  51. -- Found PCAP: /usr/lib32/libpcap.so
  52. -- Performing Test PCAP_LINKS_SOLO
  53. -- Performing Test PCAP_LINKS_SOLO - Success
  54. -- Looking for pcap_get_pfring_id
  55. -- Looking for pcap_get_pfring_id - not found
  56. -- Found LibXml2: /usr/lib32/libxml2.so (found version "2.9.9")
  57. -- Found Freetype: /usr/lib32/libfreetype.so (found version "2.10.0")
  58. -- Found Gettext: /usr/bin/msgmerge (found version "0.19.8.1")
  59. -- Found Git: /usr/bin/git (found version "2.22.0")
  60. -- Looking for lzma_auto_decoder in /usr/lib32/liblzma.so
  61. -- Looking for lzma_auto_decoder in /usr/lib32/liblzma.so - found
  62. -- Looking for lzma_easy_encoder in /usr/lib32/liblzma.so
  63. -- Looking for lzma_easy_encoder in /usr/lib32/liblzma.so - found
  64. -- Looking for lzma_lzma_preset in /usr/lib32/liblzma.so
  65. -- Looking for lzma_lzma_preset in /usr/lib32/liblzma.so - found
  66. -- Found LibLZMA: /usr/lib32/liblzma.so (found version "5.2.4")
  67. -- Found OpenGL: /usr/lib32/libOpenGL.so
  68. -- Found ZLIB: /usr/lib32/libz.so (found version "1.2.11")
  69. -- Found PNG: /usr/lib32/libpng.so (found version "1.6.37")
  70. -- Could NOT find Vtune (missing: VTUNE_LIBRARIES VTUNE_INCLUDE_DIRS)
  71. -- Found wxWidgets: -L/usr/lib32;-pthread;;;-lwx_baseu-3.0;-lwx_gtk2u_core-3.0;-lwx_gtk2u_adv-3.0 (found version "3.0.4")
  72. -- Found Libc: /usr/lib32/librt.so;/usr/lib32/libdl.so;/usr/lib32/libm.so
  73. -- Found Cg: /usr/lib32/libCg.so;/usr/lib32/libCgGL.so
  74. -- Found GLEW: /usr/lib32/libGLEW.so
  75. -- Found JPEG: /usr/lib32/libjpeg.so (found version "80")
  76. -- Found PkgConfig: /usr/bin/pkg-config (found version "1.6.1")
  77. -- AIO found
  78. -- LIBUDEV found
  79. -- PORTAUDIO found
  80. -- SOUNDTOUCH found
  81. -- SDL2 found
  82. -- Found X11: /usr/include
  83. -- Looking for XOpenDisplay in /usr/lib32/libX11.so;/usr/lib32/libXext.so
  84. -- Looking for XOpenDisplay in /usr/lib32/libX11.so;/usr/lib32/libXext.so - found
  85. -- Looking for gethostbyname
  86. -- Looking for gethostbyname - found
  87. -- Looking for connect
  88. -- Looking for connect - found
  89. -- Looking for remove
  90. -- Looking for remove - found
  91. -- Looking for shmat
  92. -- Looking for shmat - found
  93. -- Looking for IceConnectionNumber in ICE
  94. -- Looking for IceConnectionNumber in ICE - found
  95. -- Found GTK2_GTK: /usr/lib32/libgtk-x11-2.0.so
  96. -- Don't build zerospu2. It is super-seeded by spu2x
  97. -- Configuring done
  98. -- Generating done
  99. -- Build files have been written to: /home/rob/.cache/yay/pcsx2-git/src/pcsx2/build
  100. Scanning dependencies of target translations_pcsx2_Main
  101. Scanning dependencies of target x86emitter
  102. Scanning dependencies of target Utilities
  103. Scanning dependencies of target Utilities_NO_TLS
  104. Scanning dependencies of target CDVDnull
  105. Scanning dependencies of target cdvdGigaherz
  106. Scanning dependencies of target translations_pcsx2_Iconized
  107. Scanning dependencies of target dev9null-0.5.0
  108. [ 0%] Generating ../ar_SA__pcsx2_Main.gmo
  109. [ 0%] Generating ../ar_SA__pcsx2_Iconized.gmo
  110. [ 0%] Building CXX object plugins/cdvdGigaherz/src/CMakeFiles/cdvdGigaherz.dir/CDVD.cpp.o
  111. [ 0%] Building CXX object plugins/dev9null/CMakeFiles/dev9null-0.5.0.dir/DEV9.cpp.o
  112. [ 0%] Building CXX object plugins/CDVDnull/CMakeFiles/CDVDnull.dir/CDVD.cpp.o
  113. [ 0%] Building CXX object common/src/x86emitter/CMakeFiles/x86emitter.dir/bmi.cpp.o
  114. [ 0%] Generating ../ca_ES__pcsx2_Iconized.gmo
  115. [ 0%] Generating ../ca_ES__pcsx2_Main.gmo
  116. [ 0%] Generating ../cs_CZ__pcsx2_Iconized.gmo
  117. [ 1%] Building CXX object common/src/Utilities/CMakeFiles/Utilities_NO_TLS.dir/VirtualMemory.cpp.o
  118. [ 2%] Generating ../da_DK__pcsx2_Iconized.gmo
  119. [ 3%] Generating ../cs_CZ__pcsx2_Main.gmo
  120. [ 4%] Building CXX object common/src/Utilities/CMakeFiles/Utilities.dir/VirtualMemory.cpp.o
  121. [ 4%] Generating ../de_DE__pcsx2_Iconized.gmo
  122. [ 4%] Generating ../da_DK__pcsx2_Main.gmo
  123. /home/rob/.cache/yay/pcsx2-git/src/pcsx2/locales/de_DE/pcsx2_Iconized.po:735: warning: internationalized messages should not contain the '\v' escape sequence
  124. [ 4%] Generating ../es_ES__pcsx2_Iconized.gmo
  125. [ 4%] Generating ../de_DE__pcsx2_Main.gmo
  126. [ 4%] Generating ../fi_FI__pcsx2_Iconized.gmo
  127. [ 4%] Generating ../es_ES__pcsx2_Main.gmo
  128. [ 4%] Generating ../fr_FR__pcsx2_Iconized.gmo
  129. [ 4%] Generating ../fi_FI__pcsx2_Main.gmo
  130. [ 4%] Generating ../hr_HR__pcsx2_Iconized.gmo
  131. [ 4%] Generating ../fr_FR__pcsx2_Main.gmo
  132. [ 5%] Generating ../hu_HU__pcsx2_Iconized.gmo
  133. [ 6%] Generating ../hr_HR__pcsx2_Main.gmo
  134. [ 6%] Linking CXX shared module libCDVDnull.so
  135. [ 6%] Generating ../id_ID__pcsx2_Iconized.gmo
  136. [ 6%] Generating ../hu_HU__pcsx2_Main.gmo
  137. [ 6%] Generating ../it_IT__pcsx2_Iconized.gmo
  138. /usr/bin/ld: warning: /usr/lib32/ld-linux.so.2: corrupt GNU_PROPERTY_TYPE (5) size: 0
  139. [ 6%] Built target CDVDnull
  140. [ 6%] Linking CXX shared module libdev9null-0.5.0.so
  141. [ 6%] Building CXX object plugins/cdvdGigaherz/src/CMakeFiles/cdvdGigaherz.dir/ReadThread.cpp.o
  142. [ 6%] Generating ../id_ID__pcsx2_Main.gmo
  143. [ 6%] Generating ../ja_JP__pcsx2_Iconized.gmo
  144. [ 6%] Building CXX object common/src/Utilities/CMakeFiles/Utilities_NO_TLS.dir/AlignedMalloc.cpp.o
  145. [ 6%] Generating ../it_IT__pcsx2_Main.gmo
  146. /usr/bin/ld: warning: /usr/lib32/ld-linux.so.2: corrupt GNU_PROPERTY_TYPE (5) size: 0
  147. [ 6%] Built target dev9null-0.5.0
  148. [ 6%] Building CXX object common/src/Utilities/CMakeFiles/Utilities.dir/AlignedMalloc.cpp.o
  149. [ 6%] Generating ../ja_JP__pcsx2_Main.gmo
  150. [ 6%] Generating ../ko_KR__pcsx2_Iconized.gmo
  151. [ 6%] Generating ../ko_KR__pcsx2_Main.gmo
  152. [ 7%] Building CXX object common/src/x86emitter/CMakeFiles/x86emitter.dir/cpudetect.cpp.o
  153. [ 7%] Generating ../ms_MY__pcsx2_Iconized.gmo
  154. [ 8%] Generating ../ms_MY__pcsx2_Main.gmo
  155. [ 9%] Generating ../nb_NO__pcsx2_Iconized.gmo
  156. [ 9%] Generating ../nb_NO__pcsx2_Main.gmo
  157. [ 9%] Generating ../nl_NL__pcsx2_Iconized.gmo
  158. [ 9%] Generating ../nl_NL__pcsx2_Main.gmo
  159. [ 9%] Generating ../pl_PL__pcsx2_Iconized.gmo
  160. [ 9%] Generating ../pl_PL__pcsx2_Main.gmo
  161. [ 9%] Generating ../pt_BR__pcsx2_Iconized.gmo
  162. [ 9%] Generating ../pt_BR__pcsx2_Main.gmo
  163. [ 9%] Building CXX object plugins/cdvdGigaherz/src/CMakeFiles/cdvdGigaherz.dir/Settings.cpp.o
  164. [ 9%] Generating ../ru_RU__pcsx2_Iconized.gmo
  165. [ 9%] Generating ../ru_RU__pcsx2_Main.gmo
  166. [ 9%] Generating ../sv_SE__pcsx2_Iconized.gmo
  167. [ 9%] Creating gresources XML file (.gresource.xml)
  168. [ 10%] Generating ../sv_SE__pcsx2_Main.gmo
  169. [ 11%] Generating ../th_TH__pcsx2_Iconized.gmo
  170. [ 11%] Generating resources.c
  171. [ 11%] Generating resources.h
  172. [ 11%] Generating ../th_TH__pcsx2_Main.gmo
  173. [ 11%] Generating ../tr_TR__pcsx2_Iconized.gmo
  174. Scanning dependencies of target dev9ghzdrk-0.4
  175. [ 11%] Generating ../tr_TR__pcsx2_Main.gmo
  176. [ 11%] Generating ../zh_CN__pcsx2_Iconized.gmo
  177. [ 11%] Building CXX object common/src/Utilities/CMakeFiles/Utilities_NO_TLS.dir/CheckedStaticBox.cpp.o
  178. [ 11%] Generating ../zh_CN__pcsx2_Main.gmo
  179. [ 12%] Building CXX object plugins/dev9ghzdrk/CMakeFiles/dev9ghzdrk-0.4.dir/smap.cpp.o
  180. [ 12%] Generating ../zh_TW__pcsx2_Main.gmo
  181. [ 12%] Building CXX object common/src/Utilities/CMakeFiles/Utilities.dir/CheckedStaticBox.cpp.o
  182. [ 12%] Built target translations_pcsx2_Main
  183. Scanning dependencies of target FWnull-0.7.0
  184. [ 12%] Building CXX object plugins/FWnull/CMakeFiles/FWnull-0.7.0.dir/FW.cpp.o
  185. [ 13%] Generating GSdxResources.h
  186. [ 13%] Generating GSdxResources.cpp
  187. Scanning dependencies of target GSdx
  188. [ 13%] Building CXX object common/src/x86emitter/CMakeFiles/x86emitter.dir/fpu.cpp.o
  189. [ 13%] Building CXX object plugins/GSdx/CMakeFiles/GSdx.dir/PSX/GPU.cpp.o
  190. [ 13%] Building CXX object plugins/dev9ghzdrk/CMakeFiles/dev9ghzdrk-0.4.dir/DEV9.cpp.o
  191. [ 13%] Linking CXX shared module libFWnull-0.7.0.so
  192. /usr/bin/ld: warning: /usr/lib32/ld-linux.so.2: corrupt GNU_PROPERTY_TYPE (5) size: 0
  193. [ 13%] Built target FWnull-0.7.0
  194. [ 13%] Building CXX object plugins/GSdx/CMakeFiles/GSdx.dir/PSX/GPUDrawScanline.cpp.o
  195. [ 13%] Building CXX object common/src/x86emitter/CMakeFiles/x86emitter.dir/groups.cpp.o
  196. [ 13%] Building CXX object plugins/dev9ghzdrk/CMakeFiles/dev9ghzdrk-0.4.dir/flash.cpp.o
  197. [ 13%] Building CXX object common/src/Utilities/CMakeFiles/Utilities_NO_TLS.dir/Console.cpp.o
  198. [ 13%] Building CXX object common/src/Utilities/CMakeFiles/Utilities.dir/Console.cpp.o
  199. /home/rob/.cache/yay/pcsx2-git/src/pcsx2/plugins/dev9ghzdrk/flash.cpp: In function ‘void FLASHwrite32(u32, u32, int)’:
  200. /home/rob/.cache/yay/pcsx2-git/src/pcsx2/plugins/dev9ghzdrk/flash.cpp:215:9: warning: variable ‘bytes’ set but not used [-Wunused-but-set-variable]
  201. 215 | u32 bytes, pages, blocks;
  202. | ^~~~~
  203. [ 13%] Building CXX object plugins/dev9ghzdrk/CMakeFiles/dev9ghzdrk-0.4.dir/pcap_io.cpp.o
  204. cc1plus: internal compiler error: Segmentation fault
  205. Please submit a full bug report,
  206. with preprocessed source if appropriate.
  207. See <https://bugs.archlinux.org/> for instructions.
  208. make[2]: *** [plugins/GSdx/CMakeFiles/GSdx.dir/build.make:91: plugins/GSdx/CMakeFiles/GSdx.dir/PSX/GPU.cpp.o] Error 1
  209. make[2]: *** Waiting for unfinished jobs....
  210. [ 13%] Building CXX object plugins/dev9ghzdrk/CMakeFiles/dev9ghzdrk-0.4.dir/Linux/Config.cpp.o
  211. [ 13%] Building CXX object common/src/x86emitter/CMakeFiles/x86emitter.dir/jmp.cpp.o
  212. [ 13%] Building CXX object plugins/dev9ghzdrk/CMakeFiles/dev9ghzdrk-0.4.dir/Linux/Linux.cpp.o
  213. cc1plus: internal compiler error: Segmentation fault
  214. Please submit a full bug report,
  215. with preprocessed source if appropriate.
  216. See <https://bugs.archlinux.org/> for instructions.
  217. make[2]: *** [plugins/GSdx/CMakeFiles/GSdx.dir/build.make:104: plugins/GSdx/CMakeFiles/GSdx.dir/PSX/GPUDrawScanline.cpp.o] Error 1
  218. make[1]: *** [CMakeFiles/Makefile2:722: plugins/GSdx/CMakeFiles/GSdx.dir/all] Error 2
  219. make[1]: *** Waiting for unfinished jobs....
  220. [ 14%] Building CXX object plugins/dev9ghzdrk/CMakeFiles/dev9ghzdrk-0.4.dir/Linux/net.cpp.o
  221. [ 14%] Building C object plugins/dev9ghzdrk/CMakeFiles/dev9ghzdrk-0.4.dir/resources.c.o
  222. [ 14%] Building CXX object common/src/Utilities/CMakeFiles/Utilities_NO_TLS.dir/EventSource.cpp.o
  223. [ 14%] Building CXX object common/src/Utilities/CMakeFiles/Utilities_NO_TLS.dir/Exceptions.cpp.o
  224. [ 14%] Building CXX object common/src/Utilities/CMakeFiles/Utilities.dir/EventSource.cpp.o
  225. [ 14%] Building CXX object common/src/Utilities/CMakeFiles/Utilities.dir/Exceptions.cpp.o
  226. /home/rob/.cache/yay/pcsx2-git/src/pcsx2/plugins/dev9ghzdrk/Linux/net.cpp: In function ‘void InitNet(NetAdapter*)’:
  227. /home/rob/.cache/yay/pcsx2-git/src/pcsx2/plugins/dev9ghzdrk/Linux/net.cpp:58:12: warning: unused variable ‘ret’ [-Wunused-variable]
  228. 58 | int ret = pthread_create(&rx_thread, NULL, NetRxThread, NULL);
  229. | ^~~
  230. [ 14%] Linking CXX shared module libdev9ghzdrk-0.4.so
  231. /usr/bin/ld: warning: /usr/lib32/ld-linux.so.2: corrupt GNU_PROPERTY_TYPE (5) size: 0
  232. [ 14%] Built target dev9ghzdrk-0.4
  233. [ 15%] Building CXX object common/src/Utilities/CMakeFiles/Utilities.dir/FastFormatString.cpp.o
  234. [ 15%] Building CXX object common/src/x86emitter/CMakeFiles/x86emitter.dir/legacy.cpp.o
  235. [ 16%] Building CXX object common/src/Utilities/CMakeFiles/Utilities_NO_TLS.dir/FastFormatString.cpp.o
  236. [ 16%] Building CXX object common/src/Utilities/CMakeFiles/Utilities.dir/IniInterface.cpp.o
  237. [ 16%] Building CXX object common/src/Utilities/CMakeFiles/Utilities_NO_TLS.dir/IniInterface.cpp.o
  238. [ 16%] Building CXX object common/src/Utilities/CMakeFiles/Utilities.dir/Linux/LnxHostSys.cpp.o
  239. [ 16%] Building CXX object common/src/x86emitter/CMakeFiles/x86emitter.dir/legacy_sse.cpp.o
  240. [ 16%] Building CXX object common/src/Utilities/CMakeFiles/Utilities.dir/Mutex.cpp.o
  241. [ 16%] Building CXX object common/src/Utilities/CMakeFiles/Utilities_NO_TLS.dir/Linux/LnxHostSys.cpp.o
  242. [ 16%] Building CXX object common/src/Utilities/CMakeFiles/Utilities.dir/PathUtils.cpp.o
  243. [ 17%] Building CXX object common/src/x86emitter/CMakeFiles/x86emitter.dir/movs.cpp.o
  244. [ 17%] Building CXX object common/src/Utilities/CMakeFiles/Utilities.dir/PrecompiledHeader.cpp.o
  245. [ 17%] Building CXX object common/src/Utilities/CMakeFiles/Utilities_NO_TLS.dir/Mutex.cpp.o
  246. [ 17%] Building CXX object common/src/Utilities/CMakeFiles/Utilities_NO_TLS.dir/PathUtils.cpp.o
  247. [ 18%] Building CXX object common/src/Utilities/CMakeFiles/Utilities.dir/Perf.cpp.o
  248. [ 18%] Building CXX object common/src/Utilities/CMakeFiles/Utilities.dir/pxCheckBox.cpp.o
  249. [ 18%] Building CXX object common/src/x86emitter/CMakeFiles/x86emitter.dir/PrecompiledHeader.cpp.o
  250. [ 18%] Building CXX object common/src/Utilities/CMakeFiles/Utilities.dir/pxRadioPanel.cpp.o
  251. [ 18%] Building CXX object common/src/Utilities/CMakeFiles/Utilities_NO_TLS.dir/PrecompiledHeader.cpp.o
  252. [ 18%] Building CXX object common/src/Utilities/CMakeFiles/Utilities.dir/pxStaticText.cpp.o
  253. [ 19%] Building CXX object common/src/Utilities/CMakeFiles/Utilities_NO_TLS.dir/Perf.cpp.o
  254. [ 19%] Building CXX object common/src/x86emitter/CMakeFiles/x86emitter.dir/simd.cpp.o
  255. [ 19%] Building CXX object common/src/Utilities/CMakeFiles/Utilities_NO_TLS.dir/pxCheckBox.cpp.o
  256. [ 19%] Building CXX object common/src/Utilities/CMakeFiles/Utilities.dir/pxStreams.cpp.o
  257. [ 19%] Building CXX object common/src/Utilities/CMakeFiles/Utilities_NO_TLS.dir/pxRadioPanel.cpp.o
  258. [ 19%] Building CXX object common/src/Utilities/CMakeFiles/Utilities.dir/pxTranslate.cpp.o
  259. [ 19%] Building CXX object common/src/x86emitter/CMakeFiles/x86emitter.dir/x86emitter.cpp.o
  260. [ 20%] Building CXX object common/src/Utilities/CMakeFiles/Utilities.dir/pxWindowTextWriter.cpp.o
  261. [ 20%] Building CXX object common/src/Utilities/CMakeFiles/Utilities.dir/RwMutex.cpp.o
  262. [ 20%] Building CXX object common/src/Utilities/CMakeFiles/Utilities.dir/StringHelpers.cpp.o
  263. [ 20%] Building CXX object common/src/Utilities/CMakeFiles/Utilities_NO_TLS.dir/pxStaticText.cpp.o
  264. [ 20%] Building CXX object common/src/x86emitter/CMakeFiles/x86emitter.dir/LnxCpuDetect.cpp.o
  265. [ 20%] Building CXX object common/src/Utilities/CMakeFiles/Utilities_NO_TLS.dir/pxStreams.cpp.o
  266. [ 20%] Building CXX object common/src/Utilities/CMakeFiles/Utilities.dir/ThreadingDialogs.cpp.o
  267. [ 20%] Building CXX object common/src/Utilities/CMakeFiles/Utilities.dir/ThreadTools.cpp.o
  268. [ 20%] Building CXX object common/src/Utilities/CMakeFiles/Utilities.dir/wxAppWithHelpers.cpp.o
  269. [ 21%] Linking CXX static library libx86emitter.a
  270. [ 21%] Built target x86emitter
  271. [ 22%] Building CXX object common/src/Utilities/CMakeFiles/Utilities.dir/wxGuiTools.cpp.o
  272. [ 22%] Building CXX object common/src/Utilities/CMakeFiles/Utilities_NO_TLS.dir/pxTranslate.cpp.o
  273. [ 23%] Building CXX object common/src/Utilities/CMakeFiles/Utilities_NO_TLS.dir/pxWindowTextWriter.cpp.o
  274. [ 23%] Building CXX object common/src/Utilities/CMakeFiles/Utilities.dir/wxHelpers.cpp.o
  275. [ 23%] Building CXX object common/src/Utilities/CMakeFiles/Utilities_NO_TLS.dir/RwMutex.cpp.o
  276. [ 23%] Building CXX object common/src/Utilities/CMakeFiles/Utilities.dir/Linux/LnxThreads.cpp.o
  277. [ 23%] Building CXX object common/src/Utilities/CMakeFiles/Utilities.dir/Linux/LnxMisc.cpp.o
  278. [ 23%] Building CXX object common/src/Utilities/CMakeFiles/Utilities.dir/Semaphore.cpp.o
  279. [ 23%] Building CXX object common/src/Utilities/CMakeFiles/Utilities_NO_TLS.dir/StringHelpers.cpp.o
  280. [ 23%] Building CXX object common/src/Utilities/CMakeFiles/Utilities_NO_TLS.dir/ThreadingDialogs.cpp.o
  281. [ 23%] Building CXX object common/src/Utilities/CMakeFiles/Utilities_NO_TLS.dir/ThreadTools.cpp.o
  282. [ 24%] Building CXX object common/src/Utilities/CMakeFiles/Utilities_NO_TLS.dir/wxAppWithHelpers.cpp.o
  283. [ 24%] Building CXX object common/src/Utilities/CMakeFiles/Utilities_NO_TLS.dir/wxGuiTools.cpp.o
  284. [ 24%] Building CXX object common/src/Utilities/CMakeFiles/Utilities_NO_TLS.dir/wxHelpers.cpp.o
  285. [ 24%] Linking CXX static library libUtilities.a
  286. [ 24%] Built target Utilities
  287. [ 24%] Building CXX object common/src/Utilities/CMakeFiles/Utilities_NO_TLS.dir/Linux/LnxThreads.cpp.o
  288. [ 24%] Building CXX object common/src/Utilities/CMakeFiles/Utilities_NO_TLS.dir/Linux/LnxMisc.cpp.o
  289. [ 24%] Building CXX object common/src/Utilities/CMakeFiles/Utilities_NO_TLS.dir/Semaphore.cpp.o
  290. [ 24%] Generating ../zh_TW__pcsx2_Iconized.gmo
  291. [ 24%] Building CXX object plugins/cdvdGigaherz/src/CMakeFiles/cdvdGigaherz.dir/TocStuff.cpp.o
  292. [ 24%] Building CXX object plugins/cdvdGigaherz/src/CMakeFiles/cdvdGigaherz.dir/Unix/GtkGui.cpp.o
  293. [ 24%] Built target translations_pcsx2_Iconized
  294. [ 25%] Building CXX object plugins/cdvdGigaherz/src/CMakeFiles/cdvdGigaherz.dir/Unix/LinuxConfig.cpp.o
  295. [ 25%] Building CXX object plugins/cdvdGigaherz/src/CMakeFiles/cdvdGigaherz.dir/Unix/LinuxIOCtlSrc.cpp.o
  296. [ 25%] Linking CXX shared module libcdvdGigaherz.so
  297. /usr/bin/ld: warning: /usr/lib32/ld-linux.so.2: corrupt GNU_PROPERTY_TYPE (5) size: 0
  298. [ 25%] Built target cdvdGigaherz
  299. [ 26%] Linking CXX static library libUtilities_NO_TLS.a
  300. [ 26%] Built target Utilities_NO_TLS
  301. make: *** [Makefile:130: all] Error 2
  302. ==> ERROR: A failure occurred in build().
  303. Aborting...
Advertisement
RAW Paste Data Copied
Advertisement