Advertisement
Guest User

Error output of ofxSoundObject example audio output

a guest
Oct 31st, 2016
132
Never
Not a member of Pastebin yet? Sign Up, it unlocks many cool features!
C++ 19.85 KB | None
  1. n file included from /home/pi/Code/openFrameworks/addons/ofxSoundObjects/src/of                                                                                                             xSoundFile.cpp:8:0:
  2. /home/pi/Code/openFrameworks/addons/ofxSoundObjects/src/ofxSoundFile.h:90:2: err                                                                                                             or: ‘mpg123_handle’ does not name a type
  3.   mpg123_handle * mp3File;
  4.   ^
  5. /home/pi/Code/openFrameworks/addons/ofxSoundObjects/src/ofxSoundFile.cpp: In con                                                                                                             structor ‘ofxSoundFile::ofxSoundFile():
  6. /home/pi/Code/openFrameworks/addons/ofxSoundObjects/src/ofxSoundFile.cpp:54:2: e                                                                                                             rror: ‘mp3File’ was not declared in this scope
  7.   mp3File = NULL;
  8.   ^
  9. /home/pi/Code/openFrameworks/addons/ofxSoundObjects/src/ofxSoundFile.cpp:56:15:                                                                                                              error: ‘mpg123_init’ was not declared in this scope
  10.    mpg123_init();
  11.                ^
  12. /home/pi/Code/openFrameworks/addons/ofxSoundObjects/src/ofxSoundFile.cpp: In mem                                                                                                             ber function ‘bool ofxSoundFile::save(std::string, const ofSoundBuffer&):
  13. /home/pi/Code/openFrameworks/addons/ofxSoundObjects/src/ofxSoundFile.cpp:148:11:                                                                                                              warning: comparison between signed and unsigned integer expressions [-Wsign-com                                                                                                             pare]
  14.   while(pos<buff.size()) {
  15.            ^
  16. /home/pi/Code/openFrameworks/addons/ofxSoundObjects/src/ofxSoundFile.cpp: In mem                                                                                                             ber function ‘bool ofxSoundFile::mpg123Open(std::string):
  17. /home/pi/Code/openFrameworks/addons/ofxSoundObjects/src/ofxSoundFile.cpp:179:2:                                                                                                              error: ‘mp3File’ was not declared in this scope
  18.   mp3File = mpg123_new(NULL,&err);
  19.   ^
  20. /home/pi/Code/openFrameworks/addons/ofxSoundObjects/src/ofxSoundFile.cpp:179:32:                                                                                                              error: ‘mpg123_new’ was not declared in this scope
  21.   mp3File = mpg123_new(NULL,&err);
  22.                                 ^
  23. /home/pi/Code/openFrameworks/addons/ofxSoundObjects/src/ofxSoundFile.cpp:181:24:                                                                                                              error: ‘MPG123_ADD_FLAGS’ was not declared in this scope
  24.   mpg123_param(mp3File, MPG123_ADD_FLAGS, MPG123_FORCE_FLOAT, 0.);
  25.                         ^
  26. /home/pi/Code/openFrameworks/addons/ofxSoundObjects/src/ofxSoundFile.cpp:181:42:                                                                                                              error: ‘MPG123_FORCE_FLOAT’ was not declared in this scope
  27.   mpg123_param(mp3File, MPG123_ADD_FLAGS, MPG123_FORCE_FLOAT, 0.);
  28.                                           ^
  29. /home/pi/Code/openFrameworks/addons/ofxSoundObjects/src/ofxSoundFile.cpp:181:64:                                                                                                              error: ‘mpg123_param’ was not declared in this scope
  30.   mpg123_param(mp3File, MPG123_ADD_FLAGS, MPG123_FORCE_FLOAT, 0.);
  31.                                                                 ^
  32. /home/pi/Code/openFrameworks/addons/ofxSoundObjects/src/ofxSoundFile.cpp:183:37:                                                                                                              error: ‘mpg123_open’ was not declared in this scope
  33.   if(mpg123_open(mp3File,path.c_str())!=MPG123_OK){
  34.                                      ^
  35. /home/pi/Code/openFrameworks/addons/ofxSoundObjects/src/ofxSoundFile.cpp:183:40:                                                                                                              error: ‘MPG123_OK’ was not declared in this scope
  36.   if(mpg123_open(mp3File,path.c_str())!=MPG123_OK){
  37.                                         ^
  38. /home/pi/Code/openFrameworks/addons/ofxSoundObjects/src/ofxSoundFile.cpp:190:52:                                                                                                              error: ‘mpg123_getformat’ was not declared in this scope
  39.   mpg123_getformat(mp3File,&rate,&channels,&encoding);
  40.                                                     ^
  41. /home/pi/Code/openFrameworks/addons/ofxSoundObjects/src/ofxSoundFile.cpp:191:15:                                                                                                              error: ‘MPG123_ENC_SIGNED_16’ was not declared in this scope
  42.   if(encoding!=MPG123_ENC_SIGNED_16 && encoding != MPG123_ENC_FLOAT_32){
  43.                ^
  44. /home/pi/Code/openFrameworks/addons/ofxSoundObjects/src/ofxSoundFile.cpp:191:51:                                                                                                              error: ‘MPG123_ENC_FLOAT_32’ was not declared in this scope
  45.   if(encoding!=MPG123_ENC_SIGNED_16 && encoding != MPG123_ENC_FLOAT_32){
  46.                                                    ^
  47. /home/pi/Code/openFrameworks/addons/ofxSoundObjects/src/ofxSoundFile.cpp:196:28:                                                                                                              error: ‘mpg123_format_none’ was not declared in this scope
  48.   mpg123_format_none(mp3File);
  49.                             ^
  50. /home/pi/Code/openFrameworks/addons/ofxSoundObjects/src/ofxSoundFile.cpp:197:49:                                                                                                              error: ‘mpg123_format’ was not declared in this scope
  51.   mpg123_format(mp3File, rate, channels, encoding);
  52.                                                  ^
  53. /home/pi/Code/openFrameworks/addons/ofxSoundObjects/src/ofxSoundFile.cpp:202:32:                                                                                                              error: ‘mpg123_seek’ was not declared in this scope
  54.   mpg123_seek(mp3File,0,SEEK_END);
  55.                                 ^
  56. /home/pi/Code/openFrameworks/addons/ofxSoundObjects/src/ofxSoundFile.cpp:203:31:                                                                                                              error: ‘mpg123_tell’ was not declared in this scope
  57.   samples = mpg123_tell(mp3File);
  58.                                ^
  59. /home/pi/Code/openFrameworks/addons/ofxSoundObjects/src/ofxSoundFile.cpp:206:5:                                                                                                              error: ‘bitDepth’ was not declared in this scope
  60.      bitDepth = 16; //TODO:get real bitdepth;.
  61.      ^
  62. /home/pi/Code/openFrameworks/addons/ofxSoundObjects/src/ofxSoundFile.cpp: In mem                                                                                                             ber function ‘bool ofxSoundFile::sfOpen(std::string):
  63. /home/pi/Code/openFrameworks/addons/ofxSoundObjects/src/ofxSoundFile.cpp:237:5:                                                                                                              error: ‘bitDepth’ was not declared in this scope
  64.      bitDepth = 16; //fix
  65.      ^
  66. /home/pi/Code/openFrameworks/addons/ofxSoundObjects/src/ofxSoundFile.cpp: In mem                                                                                                             ber function ‘void ofxSoundFile::close():
  67. /home/pi/Code/openFrameworks/addons/ofxSoundObjects/src/ofxSoundFile.cpp:256:5:                                                                                                              error: ‘mp3File’ was not declared in this scope
  68.   if(mp3File){
  69.      ^
  70. /home/pi/Code/openFrameworks/addons/ofxSoundObjects/src/ofxSoundFile.cpp:257:23:                                                                                                              error: ‘mpg123_close’ was not declared in this scope
  71.    mpg123_close(mp3File);
  72.                        ^
  73. /home/pi/Code/openFrameworks/addons/ofxSoundObjects/src/ofxSoundFile.cpp:258:24:                                                                                                              error: ‘mpg123_delete’ was not declared in this scope
  74.    mpg123_delete(mp3File);
  75.                         ^
  76. /home/pi/Code/openFrameworks/addons/ofxSoundObjects/src/ofxSoundFile.cpp: In mem                                                                                                             ber function ‘bool ofxSoundFile::readTo(ofSoundBuffer&, unsigned int):
  77. /home/pi/Code/openFrameworks/addons/ofxSoundObjects/src/ofxSoundFile.cpp:326:10:                                                                                                              error: ‘mp3File’ was not declared in this scope
  78.   else if(mp3File){
  79.           ^
  80. /home/pi/Code/openFrameworks/addons/ofxSoundObjects/src/ofxSoundFile.cpp: In mem                                                                                                             ber function ‘bool ofxSoundFile::seekTo(unsigned int):
  81. /home/pi/Code/openFrameworks/addons/ofxSoundObjects/src/ofxSoundFile.cpp:351:10:                                                                                                              error: ‘mp3File’ was not declared in this scope
  82.   else if(mp3File) mpg123_seek(mp3File,sample,SEEK_SET);
  83.           ^
  84. /home/pi/Code/openFrameworks/addons/ofxSoundObjects/src/ofxSoundFile.cpp:351:54:                                                                                                              error: ‘mpg123_seek’ was not declared in this scope
  85.   else if(mp3File) mpg123_seek(mp3File,sample,SEEK_SET);
  86.                                                       ^
  87. /home/pi/Code/openFrameworks/addons/ofxSoundObjects/src/ofxSoundFile.cpp: In mem                                                                                                             ber function ‘bool ofxSoundFile::mpg123ReadFile(ofSoundBuffer&):
  88. /home/pi/Code/openFrameworks/addons/ofxSoundObjects/src/ofxSoundFile.cpp:387:39:                                                                                                              error: ‘mp3File’ was not declared in this scope
  89.   size_t block_size = mpg123_outblock( mp3File );
  90.                                        ^
  91. /home/pi/Code/openFrameworks/addons/ofxSoundObjects/src/ofxSoundFile.cpp:387:47:                                                                                                              error: ‘mpg123_outblock’ was not declared in this scope
  92.   size_t block_size = mpg123_outblock( mp3File );
  93.                                                ^
  94. /home/pi/Code/openFrameworks/addons/ofxSoundObjects/src/ofxSoundFile.cpp:392:98:                                                                                                              error: ‘mpg123_read’ was not declared in this scope
  95.     err = mpg123_read(mp3File,(unsigned char*)&buffer[buffer.size()-block_size],                                                                                                             block_size*4,&done);
  96.                                                                                                                                                                                                                ^
  97. /home/pi/Code/openFrameworks/addons/ofxSoundObjects/src/ofxSoundFile.cpp:394:15:                                                                                                              error: ‘MPG123_OK’ was not declared in this scope
  98.    }while(err==MPG123_OK);
  99.                ^
  100. /home/pi/Code/openFrameworks/addons/ofxSoundObjects/src/ofxSoundFile.cpp:396:13:                                                                                                              error: ‘MPG123_DONE’ was not declared in this scope
  101.    if(err != MPG123_DONE){
  102.              ^
  103. /home/pi/Code/openFrameworks/addons/ofxSoundObjects/src/ofxSoundFile.cpp:397:80:                                                                                                              error: ‘MPG123_ERR’ was not declared in this scope
  104.     ofLogError() <<  "Warning: Decoding ended prematurely because: " << (err ==                                                                                                              MPG123_ERR ? mpg123_strerror(mp3File) : mpg123_plain_strerror(err));
  105.                                                                                                                                                                                              ^
  106. /home/pi/Code/openFrameworks/addons/ofxSoundObjects/src/ofxSoundFile.cpp:397:116                                                                                                             : error: ‘mpg123_strerror’ was not declared in this scope
  107.     ofLogError() <<  "Warning: Decoding ended prematurely because: " << (err ==                                                                                                              MPG123_ERR ? mpg123_strerror(mp3File) : mpg123_plain_strerror(err));
  108.                                                                                                                                                                                                                                  ^
  109. /home/pi/Code/openFrameworks/addons/ofxSoundObjects/src/ofxSoundFile.cpp:397:145                                                                                                             : error: ‘mpg123_plain_strerror’ was not declared in this scope
  110.     ofLogError() <<  "Warning: Decoding ended prematurely because: " << (err ==                                                                                                              MPG123_ERR ? mpg123_strerror(mp3File) : mpg123_plain_strerror(err));
  111.                                                                                                                                                                                                                                                               ^
  112. /home/pi/Code/openFrameworks/addons/ofxSoundObjects/src/ofxSoundFile.cpp:402:89:                                                                                                              error: ‘mpg123_read’ was not declared in this scope
  113.    err = mpg123_read(mp3File,(unsigned char*)&buffer[0],buffer.size()*sizeof(flo                                                                                                             at),&done);
  114.                                                                                                                                                                                                       ^
  115. /home/pi/Code/openFrameworks/addons/ofxSoundObjects/src/ofxSoundFile.cpp:403:13:                                                                                                              error: ‘MPG123_OK’ was not declared in this scope
  116.    if(err != MPG123_OK){
  117.              ^
  118. /home/pi/Code/openFrameworks/addons/ofxSoundObjects/src/ofxSoundFile.cpp:404:64:                                                                                                              error: ‘MPG123_ERR’ was not declared in this scope
  119.     ofLogError() <<  "Warning: Error decoding mp3: " << (err == MPG123_ERR ? mpg                                                                                                             123_strerror(mp3File) : mpg123_plain_strerror(err));
  120.                                                                 ^
  121. /home/pi/Code/openFrameworks/addons/ofxSoundObjects/src/ofxSoundFile.cpp:404:100                                                                                                             : error: ‘mpg123_strerror’ was not declared in this scope
  122.     ofLogError() <<  "Warning: Error decoding mp3: " << (err == MPG123_ERR ? mpg                                                                                                             123_strerror(mp3File) : mpg123_plain_strerror(err));
  123.                                                                                                                                                                                                                  ^
  124. /home/pi/Code/openFrameworks/addons/ofxSoundObjects/src/ofxSoundFile.cpp:404:129                                                                                                             : error: ‘mpg123_plain_strerror’ was not declared in this scope
  125.     ofLogError() <<  "Warning: Error decoding mp3: " << (err == MPG123_ERR ? mpg                                                                                                             123_strerror(mp3File) : mpg123_plain_strerror(err));
  126.                                                                                                                                                                                                                                               ^
  127. /home/pi/Code/openFrameworks/addons/ofxSoundObjects/src/ofxSoundFile.cpp: In mem                                                                                                             ber function ‘bool ofxSoundFile::mpg123Open(std::string):
  128. /home/pi/Code/openFrameworks/addons/ofxSoundObjects/src/ofxSoundFile.cpp:207:1:                                                                                                              warning: control reaches end of non-void function [-Wreturn-type]
  129.  }
  130.  ^
  131. /home/pi/Code/openFrameworks/addons/ofxSoundObjects/src/ofxSoundFile.cpp: In mem                                                                                                             ber function ‘bool ofxSoundFile::sfOpen(std::string):
  132. /home/pi/Code/openFrameworks/addons/ofxSoundObjects/src/ofxSoundFile.cpp:238:1:                                                                                                              warning: control reaches end of non-void function [-Wreturn-type]
  133.  }
  134.  ^
  135. /home/pi/Code/openFrameworks/libs/openFrameworksCompiled/project/makefileCommon/                                                                                                             compile.project.mk:336: recipe for target '/home/pi/Code/openFrameworks/addons/o                                                                                                             bj/linuxarmv6l/Release/ofxSoundObjects/src/ofxSoundFile.o' failed
  136. make[1]: *** [/home/pi/Code/openFrameworks/addons/obj/linuxarmv6l/Release/ofxSou                                                                                                             ndObjects/src/ofxSoundFile.o] Error 1
  137. make[1]: Leaving directory '/home/pi/Code/openFrameworks/addons/ofxSoundObjects/                                                                                                             example-audioOutput'
  138. /home/pi/Code/openFrameworks/libs/openFrameworksCompiled/project/makefileCommon/                                                                                                             compile.project.mk:125: recipe for target 'Release' failed
  139. make: *** [Release] Error 2
  140. pi@raspberrypi:~/Code/openFrameworks/addons/ofxSoundObjects/example-audioOutput $ checking pkg-config libraries:   cairo zlib gstreamer-app-1.0 gstreamer-1.0 gstreamer-video-1.0 gstreamer-base-1.0 libud
  141. -bash: checking : commande introuvable
  142. pi@raspberrypi:~/Code/openFrameworks/addons/ofxSoundObjects/example-audioOutput $ ev freetype2 fontconfig sndfile openal openssl gtk+-3.0 libmpg123
Advertisement
RAW Paste Data Copied
Advertisement