Advertisement
Guest User

Untitled

a guest
Jun 17th, 2020
170
Never
Not a member of Pastebin yet? Sign Up, it unlocks many cool features!
  1. ```ERROR: Command errored out with exit status 1:
  2.    command: /usr/bin/python3 -u -c 'import sys, setuptools, tokenize; sys.argv[0] = '"'"'/tmp/pip-req-build-_od32i_x/setup.py'"'"'; __file__='"'"'/tmp/pip-req-build-_od32i_x/setup.py'"'"';f=getattr(tokenize, '"'"'open'"'"', open)(__file__);code=f.read().replace('"'"'\r\n'"'"', '"'"'\n'"'"');f.close();exec(compile(code, __file__, '"'"'exec'"'"'))' bdist_wheel -d /tmp/pip-wheel-spo6ltjl
  3.        cwd: /tmp/pip-req-build-_od32i_x/
  4.   Complete output (230 lines):
  5.   running bdist_wheel
  6.   running build
  7.   running build_ext
  8.   INFO: Can't locate Tcl/Tk libs and/or headers
  9.  building '_ctypes_test' extension
  10.  creating build/temp.linux-x86_64-3.8/_ctypes
  11.  x86_64-linux-gnu-gcc -pthread -Wno-unused-result -Wsign-compare -DNDEBUG -g -fwrapv -O2 -Wall -g -fstack-protector-strong -Wformat -Werror=format-security -g -fwrapv -O2 -g -fstack-protector-strong -Wformat -Werror=format-security -Wdate-time -D_FORTIFY_SOURCE=2 -fPIC -I. -IObjects -IInclude -IPython -I/usr/include/x86_64-linux-gnu -I/usr/local/include -I/usr/include/python3.8 -c _ctypes/_ctypes_test.c -o build/temp.linux-x86_64-3.8/_ctypes/_ctypes_test.o
  12.  x86_64-linux-gnu-gcc: error: _ctypes/_ctypes_test.c: No such file or directory
  13.  x86_64-linux-gnu-gcc: fatal error: no input files
  14.  compilation terminated.
  15.  building '_contextvars' extension
  16.  x86_64-linux-gnu-gcc -pthread -Wno-unused-result -Wsign-compare -DNDEBUG -g -fwrapv -O2 -Wall -g -fstack-protector-strong -Wformat -Werror=format-security -g -fwrapv -O2 -g -fstack-protector-strong -Wformat -Werror=format-security -Wdate-time -D_FORTIFY_SOURCE=2 -fPIC -I. -IObjects -IInclude -IPython -I/usr/include/x86_64-linux-gnu -I/usr/local/include -I/usr/include/python3.8 -c _contextvarsmodule.c -o build/temp.linux-x86_64-3.8/_contextvarsmodule.o
  17.  x86_64-linux-gnu-gcc: error: _contextvarsmodule.c: No such file or directory
  18.  x86_64-linux-gnu-gcc: fatal error: no input files
  19.  compilation terminated.
  20.  building '_json' extension
  21.  x86_64-linux-gnu-gcc -pthread -Wno-unused-result -Wsign-compare -DNDEBUG -g -fwrapv -O2 -Wall -g -fstack-protector-strong -Wformat -Werror=format-security -g -fwrapv -O2 -g -fstack-protector-strong -Wformat -Werror=format-security -Wdate-time -D_FORTIFY_SOURCE=2 -fPIC -I. -IObjects -IInclude -IPython -I/usr/include/x86_64-linux-gnu -I/usr/local/include -I/usr/include/python3.8 -c _json.c -o build/temp.linux-x86_64-3.8/_json.o
  22.  x86_64-linux-gnu-gcc: error: _json.c: No such file or directory
  23.  x86_64-linux-gnu-gcc: fatal error: no input files
  24.  compilation terminated.
  25.  building '_testcapi' extension
  26.  x86_64-linux-gnu-gcc -pthread -Wno-unused-result -Wsign-compare -DNDEBUG -g -fwrapv -O2 -Wall -g -fstack-protector-strong -Wformat -Werror=format-security -g -fwrapv -O2 -g -fstack-protector-strong -Wformat -Werror=format-security -Wdate-time -D_FORTIFY_SOURCE=2 -fPIC -I. -IObjects -IInclude -IPython -I/usr/include/x86_64-linux-gnu -I/usr/local/include -I/usr/include/python3.8 -c _testcapimodule.c -o build/temp.linux-x86_64-3.8/_testcapimodule.o
  27.  x86_64-linux-gnu-gcc: error: _testcapimodule.c: No such file or directory
  28.  x86_64-linux-gnu-gcc: fatal error: no input files
  29.  compilation terminated.
  30.  building '_testbuffer' extension
  31.  x86_64-linux-gnu-gcc -pthread -Wno-unused-result -Wsign-compare -DNDEBUG -g -fwrapv -O2 -Wall -g -fstack-protector-strong -Wformat -Werror=format-security -g -fwrapv -O2 -g -fstack-protector-strong -Wformat -Werror=format-security -Wdate-time -D_FORTIFY_SOURCE=2 -fPIC -I. -IObjects -IInclude -IPython -I/usr/include/x86_64-linux-gnu -I/usr/local/include -I/usr/include/python3.8 -c _testbuffer.c -o build/temp.linux-x86_64-3.8/_testbuffer.o
  32.  x86_64-linux-gnu-gcc: error: _testbuffer.c: No such file or directory
  33.  x86_64-linux-gnu-gcc: fatal error: no input files
  34.  compilation terminated.
  35.  building '_testimportmultiple' extension
  36.  x86_64-linux-gnu-gcc -pthread -Wno-unused-result -Wsign-compare -DNDEBUG -g -fwrapv -O2 -Wall -g -fstack-protector-strong -Wformat -Werror=format-security -g -fwrapv -O2 -g -fstack-protector-strong -Wformat -Werror=format-security -Wdate-time -D_FORTIFY_SOURCE=2 -fPIC -I. -IObjects -IInclude -IPython -I/usr/include/x86_64-linux-gnu -I/usr/local/include -I/usr/include/python3.8 -c _testimportmultiple.c -o build/temp.linux-x86_64-3.8/_testimportmultiple.o
  37.  x86_64-linux-gnu-gcc: error: _testimportmultiple.c: No such file or directory
  38.  x86_64-linux-gnu-gcc: fatal error: no input files
  39.  compilation terminated.
  40.  building '_testmultiphase' extension
  41.  x86_64-linux-gnu-gcc -pthread -Wno-unused-result -Wsign-compare -DNDEBUG -g -fwrapv -O2 -Wall -g -fstack-protector-strong -Wformat -Werror=format-security -g -fwrapv -O2 -g -fstack-protector-strong -Wformat -Werror=format-security -Wdate-time -D_FORTIFY_SOURCE=2 -fPIC -I. -IObjects -IInclude -IPython -I/usr/include/x86_64-linux-gnu -I/usr/local/include -I/usr/include/python3.8 -c _testmultiphase.c -o build/temp.linux-x86_64-3.8/_testmultiphase.o
  42.  x86_64-linux-gnu-gcc: error: _testmultiphase.c: No such file or directory
  43.  x86_64-linux-gnu-gcc: fatal error: no input files
  44.  compilation terminated.
  45.  building '_lsprof' extension
  46.  x86_64-linux-gnu-gcc -pthread -Wno-unused-result -Wsign-compare -DNDEBUG -g -fwrapv -O2 -Wall -g -fstack-protector-strong -Wformat -Werror=format-security -g -fwrapv -O2 -g -fstack-protector-strong -Wformat -Werror=format-security -Wdate-time -D_FORTIFY_SOURCE=2 -fPIC -I. -IObjects -IInclude -IPython -I/usr/include/x86_64-linux-gnu -I/usr/local/include -I/usr/include/python3.8 -c _lsprof.c -o build/temp.linux-x86_64-3.8/_lsprof.o
  47.  x86_64-linux-gnu-gcc: error: _lsprof.c: No such file or directory
  48.  x86_64-linux-gnu-gcc: fatal error: no input files
  49.  compilation terminated.
  50.  building '_opcode' extension
  51.  x86_64-linux-gnu-gcc -pthread -Wno-unused-result -Wsign-compare -DNDEBUG -g -fwrapv -O2 -Wall -g -fstack-protector-strong -Wformat -Werror=format-security -g -fwrapv -O2 -g -fstack-protector-strong -Wformat -Werror=format-security -Wdate-time -D_FORTIFY_SOURCE=2 -fPIC -I. -IObjects -IInclude -IPython -I/usr/include/x86_64-linux-gnu -I/usr/local/include -I/usr/include/python3.8 -c _opcode.c -o build/temp.linux-x86_64-3.8/_opcode.o
  52.  x86_64-linux-gnu-gcc: error: _opcode.c: No such file or directory
  53.  x86_64-linux-gnu-gcc: fatal error: no input files
  54.  compilation terminated.
  55.  building '_asyncio' extension
  56.  x86_64-linux-gnu-gcc -pthread -Wno-unused-result -Wsign-compare -DNDEBUG -g -fwrapv -O2 -Wall -g -fstack-protector-strong -Wformat -Werror=format-security -g -fwrapv -O2 -g -fstack-protector-strong -Wformat -Werror=format-security -Wdate-time -D_FORTIFY_SOURCE=2 -fPIC -I. -IObjects -IInclude -IPython -I/usr/include/x86_64-linux-gnu -I/usr/local/include -I/usr/include/python3.8 -c _asynciomodule.c -o build/temp.linux-x86_64-3.8/_asynciomodule.o
  57.  x86_64-linux-gnu-gcc: error: _asynciomodule.c: No such file or directory
  58.  x86_64-linux-gnu-gcc: fatal error: no input files
  59.  compilation terminated.
  60.  building '_queue' extension
  61.  x86_64-linux-gnu-gcc -pthread -Wno-unused-result -Wsign-compare -DNDEBUG -g -fwrapv -O2 -Wall -g -fstack-protector-strong -Wformat -Werror=format-security -g -fwrapv -O2 -g -fstack-protector-strong -Wformat -Werror=format-security -Wdate-time -D_FORTIFY_SOURCE=2 -fPIC -I. -IObjects -IInclude -IPython -I/usr/include/x86_64-linux-gnu -I/usr/local/include -I/usr/include/python3.8 -c _queuemodule.c -o build/temp.linux-x86_64-3.8/_queuemodule.o
  62.  x86_64-linux-gnu-gcc: error: _queuemodule.c: No such file or directory
  63.  x86_64-linux-gnu-gcc: fatal error: no input files
  64.  compilation terminated.
  65.  building 'parser' extension
  66.  x86_64-linux-gnu-gcc -pthread -Wno-unused-result -Wsign-compare -DNDEBUG -g -fwrapv -O2 -Wall -g -fstack-protector-strong -Wformat -Werror=format-security -g -fwrapv -O2 -g -fstack-protector-strong -Wformat -Werror=format-security -Wdate-time -D_FORTIFY_SOURCE=2 -fPIC -I. -IObjects -IInclude -IPython -I/usr/include/x86_64-linux-gnu -I/usr/local/include -I/usr/include/python3.8 -c parsermodule.c -o build/temp.linux-x86_64-3.8/parsermodule.o
  67.  x86_64-linux-gnu-gcc: error: parsermodule.c: No such file or directory
  68.  x86_64-linux-gnu-gcc: fatal error: no input files
  69.  compilation terminated.
  70.  building 'mmap' extension
  71.  x86_64-linux-gnu-gcc -pthread -Wno-unused-result -Wsign-compare -DNDEBUG -g -fwrapv -O2 -Wall -g -fstack-protector-strong -Wformat -Werror=format-security -g -fwrapv -O2 -g -fstack-protector-strong -Wformat -Werror=format-security -Wdate-time -D_FORTIFY_SOURCE=2 -fPIC -I. -IObjects -IInclude -IPython -I/usr/include/x86_64-linux-gnu -I/usr/local/include -I/usr/include/python3.8 -c mmapmodule.c -o build/temp.linux-x86_64-3.8/mmapmodule.o
  72.  x86_64-linux-gnu-gcc: error: mmapmodule.c: No such file or directory
  73.  x86_64-linux-gnu-gcc: fatal error: no input files
  74.  compilation terminated.
  75.  building '_xxtestfuzz' extension
  76.  creating build/temp.linux-x86_64-3.8/_xxtestfuzz
  77.  x86_64-linux-gnu-gcc -pthread -Wno-unused-result -Wsign-compare -DNDEBUG -g -fwrapv -O2 -Wall -g -fstack-protector-strong -Wformat -Werror=format-security -g -fwrapv -O2 -g -fstack-protector-strong -Wformat -Werror=format-security -Wdate-time -D_FORTIFY_SOURCE=2 -fPIC -I. -IObjects -IInclude -IPython -I/usr/include/x86_64-linux-gnu -I/usr/local/include -I/usr/include/python3.8 -c _xxtestfuzz/_xxtestfuzz.c -o build/temp.linux-x86_64-3.8/_xxtestfuzz/_xxtestfuzz.o
  78.  x86_64-linux-gnu-gcc: error: _xxtestfuzz/_xxtestfuzz.c: No such file or directory
  79.  x86_64-linux-gnu-gcc: fatal error: no input files
  80.  compilation terminated.
  81.  building 'audioop' extension
  82.  x86_64-linux-gnu-gcc -pthread -Wno-unused-result -Wsign-compare -DNDEBUG -g -fwrapv -O2 -Wall -g -fstack-protector-strong -Wformat -Werror=format-security -g -fwrapv -O2 -g -fstack-protector-strong -Wformat -Werror=format-security -Wdate-time -D_FORTIFY_SOURCE=2 -fPIC -I. -IObjects -IInclude -IPython -I/usr/include/x86_64-linux-gnu -I/usr/local/include -I/usr/include/python3.8 -c audioop.c -o build/temp.linux-x86_64-3.8/audioop.o
  83.  x86_64-linux-gnu-gcc: error: audioop.c: No such file or directory
  84.  x86_64-linux-gnu-gcc: fatal error: no input files
  85.  compilation terminated.
  86.  building '_crypt' extension
  87.  x86_64-linux-gnu-gcc -pthread -Wno-unused-result -Wsign-compare -DNDEBUG -g -fwrapv -O2 -Wall -g -fstack-protector-strong -Wformat -Werror=format-security -g -fwrapv -O2 -g -fstack-protector-strong -Wformat -Werror=format-security -Wdate-time -D_FORTIFY_SOURCE=2 -fPIC -I. -IObjects -IInclude -IPython -I/usr/include/x86_64-linux-gnu -I/usr/local/include -I/usr/include/python3.8 -c _cryptmodule.c -o build/temp.linux-x86_64-3.8/_cryptmodule.o
  88.  x86_64-linux-gnu-gcc: error: _cryptmodule.c: No such file or directory
  89.  x86_64-linux-gnu-gcc: fatal error: no input files
  90.  compilation terminated.
  91.  building '_ssl' extension
  92.  x86_64-linux-gnu-gcc -pthread -Wno-unused-result -Wsign-compare -DNDEBUG -g -fwrapv -O2 -Wall -g -fstack-protector-strong -Wformat -Werror=format-security -g -fwrapv -O2 -g -fstack-protector-strong -Wformat -Werror=format-security -Wdate-time -D_FORTIFY_SOURCE=2 -fPIC -I. -IObjects -IInclude -IPython -I/usr/include/x86_64-linux-gnu -I/usr/local/include -I/usr/include/python3.8 -c _ssl.c -o build/temp.linux-x86_64-3.8/_ssl.o
  93.  x86_64-linux-gnu-gcc: error: _ssl.c: No such file or directory
  94.  x86_64-linux-gnu-gcc: fatal error: no input files
  95.  compilation terminated.
  96.  building '_hashlib' extension
  97.  x86_64-linux-gnu-gcc -pthread -Wno-unused-result -Wsign-compare -DNDEBUG -g -fwrapv -O2 -Wall -g -fstack-protector-strong -Wformat -Werror=format-security -g -fwrapv -O2 -g -fstack-protector-strong -Wformat -Werror=format-security -Wdate-time -D_FORTIFY_SOURCE=2 -fPIC -I. -IObjects -IInclude -IPython -I/usr/include/x86_64-linux-gnu -I/usr/local/include -I/usr/include/python3.8 -c _hashopenssl.c -o build/temp.linux-x86_64-3.8/_hashopenssl.o
  98.  x86_64-linux-gnu-gcc: error: _hashopenssl.c: No such file or directory
  99.  x86_64-linux-gnu-gcc: fatal error: no input files
  100.  compilation terminated.
  101.  building 'termios' extension
  102.  x86_64-linux-gnu-gcc -pthread -Wno-unused-result -Wsign-compare -DNDEBUG -g -fwrapv -O2 -Wall -g -fstack-protector-strong -Wformat -Werror=format-security -g -fwrapv -O2 -g -fstack-protector-strong -Wformat -Werror=format-security -Wdate-time -D_FORTIFY_SOURCE=2 -fPIC -I. -IObjects -IInclude -IPython -I/usr/include/x86_64-linux-gnu -I/usr/local/include -I/usr/include/python3.8 -c termios.c -o build/temp.linux-x86_64-3.8/termios.o
  103.  x86_64-linux-gnu-gcc: error: termios.c: No such file or directory
  104.  x86_64-linux-gnu-gcc: fatal error: no input files
  105.  compilation terminated.
  106.  building 'resource' extension
  107.  x86_64-linux-gnu-gcc -pthread -Wno-unused-result -Wsign-compare -DNDEBUG -g -fwrapv -O2 -Wall -g -fstack-protector-strong -Wformat -Werror=format-security -g -fwrapv -O2 -g -fstack-protector-strong -Wformat -Werror=format-security -Wdate-time -D_FORTIFY_SOURCE=2 -fPIC -I. -IObjects -IInclude -IPython -I/usr/include/x86_64-linux-gnu -I/usr/local/include -I/usr/include/python3.8 -c resource.c -o build/temp.linux-x86_64-3.8/resource.o
  108.  x86_64-linux-gnu-gcc: error: resource.c: No such file or directory
  109.  x86_64-linux-gnu-gcc: fatal error: no input files
  110.  compilation terminated.
  111.  building 'nis' extension
  112.  x86_64-linux-gnu-gcc -pthread -Wno-unused-result -Wsign-compare -DNDEBUG -g -fwrapv -O2 -Wall -g -fstack-protector-strong -Wformat -Werror=format-security -g -fwrapv -O2 -g -fstack-protector-strong -Wformat -Werror=format-security -Wdate-time -D_FORTIFY_SOURCE=2 -fPIC -I. -IObjects -IInclude -IPython -I/usr/include/x86_64-linux-gnu -I/usr/local/include -I/usr/include/python3.8 -c nismodule.c -o build/temp.linux-x86_64-3.8/nismodule.o
  113.  x86_64-linux-gnu-gcc: error: nismodule.c: No such file or directory
  114.  x86_64-linux-gnu-gcc: fatal error: no input files
  115.  compilation terminated.
  116.  building '_curses' extension
  117.  x86_64-linux-gnu-gcc -pthread -Wno-unused-result -Wsign-compare -DNDEBUG -g -fwrapv -O2 -Wall -g -fstack-protector-strong -Wformat -Werror=format-security -g -fwrapv -O2 -g -fstack-protector-strong -Wformat -Werror=format-security -Wdate-time -D_FORTIFY_SOURCE=2 -fPIC -DHAVE_NCURSESW=1 -I/usr/include/ncursesw -I. -IObjects -IInclude -IPython -I/usr/include/x86_64-linux-gnu -I/usr/local/include -I/usr/include/python3.8 -c _cursesmodule.c -o build/temp.linux-x86_64-3.8/_cursesmodule.o
  118.  x86_64-linux-gnu-gcc: error: _cursesmodule.c: No such file or directory
  119.  x86_64-linux-gnu-gcc: fatal error: no input files
  120.  compilation terminated.
  121.  building '_curses_panel' extension
  122.  x86_64-linux-gnu-gcc -pthread -Wno-unused-result -Wsign-compare -DNDEBUG -g -fwrapv -O2 -Wall -g -fstack-protector-strong -Wformat -Werror=format-security -g -fwrapv -O2 -g -fstack-protector-strong -Wformat -Werror=format-security -Wdate-time -D_FORTIFY_SOURCE=2 -fPIC -DHAVE_NCURSESW=1 -I/usr/include/ncursesw -I. -IObjects -IInclude -IPython -I/usr/include/x86_64-linux-gnu -I/usr/local/include -I/usr/include/python3.8 -c _curses_panel.c -o build/temp.linux-x86_64-3.8/_curses_panel.o
  123.  x86_64-linux-gnu-gcc: error: _curses_panel.c: No such file or directory
  124.  x86_64-linux-gnu-gcc: fatal error: no input files
  125.  compilation terminated.
  126.  building '_multibytecodec' extension
  127.  creating build/temp.linux-x86_64-3.8/cjkcodecs
  128.  x86_64-linux-gnu-gcc -pthread -Wno-unused-result -Wsign-compare -DNDEBUG -g -fwrapv -O2 -Wall -g -fstack-protector-strong -Wformat -Werror=format-security -g -fwrapv -O2 -g -fstack-protector-strong -Wformat -Werror=format-security -Wdate-time -D_FORTIFY_SOURCE=2 -fPIC -I. -IObjects -IInclude -IPython -I/usr/include/x86_64-linux-gnu -I/usr/local/include -I/usr/include/python3.8 -c cjkcodecs/multibytecodec.c -o build/temp.linux-x86_64-3.8/cjkcodecs/multibytecodec.o
  129.  x86_64-linux-gnu-gcc: error: cjkcodecs/multibytecodec.c: No such file or directory
  130.  x86_64-linux-gnu-gcc: fatal error: no input files
  131.  compilation terminated.
  132.  building '_codecs_kr' extension
  133.  x86_64-linux-gnu-gcc -pthread -Wno-unused-result -Wsign-compare -DNDEBUG -g -fwrapv -O2 -Wall -g -fstack-protector-strong -Wformat -Werror=format-security -g -fwrapv -O2 -g -fstack-protector-strong -Wformat -Werror=format-security -Wdate-time -D_FORTIFY_SOURCE=2 -fPIC -I. -IObjects -IInclude -IPython -I/usr/include/x86_64-linux-gnu -I/usr/local/include -I/usr/include/python3.8 -c cjkcodecs/_codecs_kr.c -o build/temp.linux-x86_64-3.8/cjkcodecs/_codecs_kr.o
  134.  x86_64-linux-gnu-gcc: error: cjkcodecs/_codecs_kr.c: No such file or directory
  135.  x86_64-linux-gnu-gcc: fatal error: no input files
  136.  compilation terminated.
  137.  building '_codecs_jp' extension
  138.  x86_64-linux-gnu-gcc -pthread -Wno-unused-result -Wsign-compare -DNDEBUG -g -fwrapv -O2 -Wall -g -fstack-protector-strong -Wformat -Werror=format-security -g -fwrapv -O2 -g -fstack-protector-strong -Wformat -Werror=format-security -Wdate-time -D_FORTIFY_SOURCE=2 -fPIC -I. -IObjects -IInclude -IPython -I/usr/include/x86_64-linux-gnu -I/usr/local/include -I/usr/include/python3.8 -c cjkcodecs/_codecs_jp.c -o build/temp.linux-x86_64-3.8/cjkcodecs/_codecs_jp.o
  139.  x86_64-linux-gnu-gcc: error: cjkcodecs/_codecs_jp.c: No such file or directory
  140.  x86_64-linux-gnu-gcc: fatal error: no input files
  141.  compilation terminated.
  142.  building '_codecs_cn' extension
  143.  x86_64-linux-gnu-gcc -pthread -Wno-unused-result -Wsign-compare -DNDEBUG -g -fwrapv -O2 -Wall -g -fstack-protector-strong -Wformat -Werror=format-security -g -fwrapv -O2 -g -fstack-protector-strong -Wformat -Werror=format-security -Wdate-time -D_FORTIFY_SOURCE=2 -fPIC -I. -IObjects -IInclude -IPython -I/usr/include/x86_64-linux-gnu -I/usr/local/include -I/usr/include/python3.8 -c cjkcodecs/_codecs_cn.c -o build/temp.linux-x86_64-3.8/cjkcodecs/_codecs_cn.o
  144.  x86_64-linux-gnu-gcc: error: cjkcodecs/_codecs_cn.c: No such file or directory
  145.  x86_64-linux-gnu-gcc: fatal error: no input files
  146.  compilation terminated.
  147.  building '_codecs_tw' extension
  148.  x86_64-linux-gnu-gcc -pthread -Wno-unused-result -Wsign-compare -DNDEBUG -g -fwrapv -O2 -Wall -g -fstack-protector-strong -Wformat -Werror=format-security -g -fwrapv -O2 -g -fstack-protector-strong -Wformat -Werror=format-security -Wdate-time -D_FORTIFY_SOURCE=2 -fPIC -I. -IObjects -IInclude -IPython -I/usr/include/x86_64-linux-gnu -I/usr/local/include -I/usr/include/python3.8 -c cjkcodecs/_codecs_tw.c -o build/temp.linux-x86_64-3.8/cjkcodecs/_codecs_tw.o
  149.  x86_64-linux-gnu-gcc: error: cjkcodecs/_codecs_tw.c: No such file or directory
  150.  x86_64-linux-gnu-gcc: fatal error: no input files
  151.  compilation terminated.
  152.  building '_codecs_hk' extension
  153.  x86_64-linux-gnu-gcc -pthread -Wno-unused-result -Wsign-compare -DNDEBUG -g -fwrapv -O2 -Wall -g -fstack-protector-strong -Wformat -Werror=format-security -g -fwrapv -O2 -g -fstack-protector-strong -Wformat -Werror=format-security -Wdate-time -D_FORTIFY_SOURCE=2 -fPIC -I. -IObjects -IInclude -IPython -I/usr/include/x86_64-linux-gnu -I/usr/local/include -I/usr/include/python3.8 -c cjkcodecs/_codecs_hk.c -o build/temp.linux-x86_64-3.8/cjkcodecs/_codecs_hk.o
  154.  x86_64-linux-gnu-gcc: error: cjkcodecs/_codecs_hk.c: No such file or directory
  155.  x86_64-linux-gnu-gcc: fatal error: no input files
  156.  compilation terminated.
  157.  building '_codecs_iso2022' extension
  158.  x86_64-linux-gnu-gcc -pthread -Wno-unused-result -Wsign-compare -DNDEBUG -g -fwrapv -O2 -Wall -g -fstack-protector-strong -Wformat -Werror=format-security -g -fwrapv -O2 -g -fstack-protector-strong -Wformat -Werror=format-security -Wdate-time -D_FORTIFY_SOURCE=2 -fPIC -I. -IObjects -IInclude -IPython -I/usr/include/x86_64-linux-gnu -I/usr/local/include -I/usr/include/python3.8 -c cjkcodecs/_codecs_iso2022.c -o build/temp.linux-x86_64-3.8/cjkcodecs/_codecs_iso2022.o
  159.  x86_64-linux-gnu-gcc: error: cjkcodecs/_codecs_iso2022.c: No such file or directory
  160.  x86_64-linux-gnu-gcc: fatal error: no input files
  161.  compilation terminated.
  162.  building '_decimal' extension
  163.  creating build/temp.linux-x86_64-3.8/_decimal
  164.  x86_64-linux-gnu-gcc -pthread -Wno-unused-result -Wsign-compare -DNDEBUG -g -fwrapv -O2 -Wall -g -fstack-protector-strong -Wformat -Werror=format-security -g -fwrapv -O2 -g -fstack-protector-strong -Wformat -Werror=format-security -Wdate-time -D_FORTIFY_SOURCE=2 -fPIC -DCONFIG_64=1 -DASM=1 -I. -IObjects -IInclude -IPython -I/usr/include/x86_64-linux-gnu -I/usr/local/include -I/usr/include/python3.8 -c _decimal/_decimal.c -o build/temp.linux-x86_64-3.8/_decimal/_decimal.o
  165.  x86_64-linux-gnu-gcc: error: _decimal/_decimal.c: No such file or directory
  166.  x86_64-linux-gnu-gcc: fatal error: no input files
  167.  compilation terminated.
  168.  building '_multiprocessing' extension
  169.  creating build/temp.linux-x86_64-3.8/_multiprocessing
  170.  x86_64-linux-gnu-gcc -pthread -Wno-unused-result -Wsign-compare -DNDEBUG -g -fwrapv -O2 -Wall -g -fstack-protector-strong -Wformat -Werror=format-security -g -fwrapv -O2 -g -fstack-protector-strong -Wformat -Werror=format-security -Wdate-time -D_FORTIFY_SOURCE=2 -fPIC -IModules/_multiprocessing -I. -IObjects -IInclude -IPython -I/usr/include/x86_64-linux-gnu -I/usr/local/include -I/usr/include/python3.8 -c _multiprocessing/multiprocessing.c -o build/temp.linux-x86_64-3.8/_multiprocessing/multiprocessing.o
  171.  x86_64-linux-gnu-gcc: error: _multiprocessing/multiprocessing.c: No such file or directory
  172.  x86_64-linux-gnu-gcc: fatal error: no input files
  173.  compilation terminated.
  174.  building 'ossaudiodev' extension
  175.  x86_64-linux-gnu-gcc -pthread -Wno-unused-result -Wsign-compare -DNDEBUG -g -fwrapv -O2 -Wall -g -fstack-protector-strong -Wformat -Werror=format-security -g -fwrapv -O2 -g -fstack-protector-strong -Wformat -Werror=format-security -Wdate-time -D_FORTIFY_SOURCE=2 -fPIC -I. -IObjects -IInclude -IPython -I/usr/include/x86_64-linux-gnu -I/usr/local/include -I/usr/include/python3.8 -c ossaudiodev.c -o build/temp.linux-x86_64-3.8/ossaudiodev.o
  176.  x86_64-linux-gnu-gcc: error: ossaudiodev.c: No such file or directory
  177.  x86_64-linux-gnu-gcc: fatal error: no input files
  178.  compilation terminated.
  179.  building 'xxlimited' extension
  180.  x86_64-linux-gnu-gcc -pthread -Wno-unused-result -Wsign-compare -DNDEBUG -g -fwrapv -O2 -Wall -g -fstack-protector-strong -Wformat -Werror=format-security -g -fwrapv -O2 -g -fstack-protector-strong -Wformat -Werror=format-security -Wdate-time -D_FORTIFY_SOURCE=2 -fPIC -DPy_LIMITED_API=0x03050000 -I. -IObjects -IInclude -IPython -I/usr/include/x86_64-linux-gnu -I/usr/local/include -I/usr/include/python3.8 -c xxlimited.c -o build/temp.linux-x86_64-3.8/xxlimited.o
  181.  x86_64-linux-gnu-gcc: error: xxlimited.c: No such file or directory
  182.  x86_64-linux-gnu-gcc: fatal error: no input files
  183.  compilation terminated.
  184.  building '_ctypes' extension
  185.  x86_64-linux-gnu-gcc -pthread -Wno-unused-result -Wsign-compare -DNDEBUG -g -fwrapv -O2 -Wall -g -fstack-protector-strong -Wformat -Werror=format-security -g -fwrapv -O2 -g -fstack-protector-strong -Wformat -Werror=format-security -Wdate-time -D_FORTIFY_SOURCE=2 -fPIC -I/usr/include/x86_64-linux-gnu -I. -IObjects -IInclude -IPython -I/usr/include/x86_64-linux-gnu -I/usr/local/include -I/usr/include/python3.8 -c _ctypes/_ctypes.c -o build/temp.linux-x86_64-3.8/_ctypes/_ctypes.o
  186.  x86_64-linux-gnu-gcc: error: _ctypes/_ctypes.c: No such file or directory
  187.  x86_64-linux-gnu-gcc: fatal error: no input files
  188.  compilation terminated.
  189.  
  190.  Python build finished successfully!
  191.  The necessary bits to build these optional modules were not found:
  192.  _bz2                  _dbm                  _elementtree
  193.  _gdbm                 _lzma                 _sqlite3
  194.  _tkinter              _uuid                 readline
  195.  spwd
  196.  To find the necessary bits, look in setup.py in detect_modules() for the module's name.
  197.  
  198.  
  199.   The following modules found by detect_modules() in setup.py, have been
  200.   built by the Makefile instead, as configured by the Setup files:
  201.   _abc                  _bisect               _blake2
  202.   _csv                  _datetime             _heapq
  203.   _md5                  _pickle               _posixsubprocess
  204.   _random               _sha1                 _sha256
  205.   _sha3                 _sha512               _socket
  206.   _struct               array                 atexit
  207.   binascii              cmath                 fcntl
  208.   grp                   math                  pwd
  209.   pyexpat               select                syslog
  210.   time                  unicodedata           zlib
  211.  
  212.  
  213.   Failed to build these modules:
  214.   _asyncio              _codecs_cn            _codecs_hk
  215.   _codecs_iso2022       _codecs_jp            _codecs_kr
  216.   _codecs_tw            _contextvars          _crypt
  217.   _ctypes               _ctypes_test          _curses
  218.   _curses_panel         _decimal              _hashlib
  219.   _json                 _lsprof               _multibytecodec
  220.   _multiprocessing      _opcode               _queue
  221.   _ssl                  _testbuffer           _testcapi
  222.   _testimportmultiple   _testmultiphase       _xxtestfuzz
  223.   audioop               mmap                  nis
  224.   ossaudiodev           parser                resource
  225.   termios               xxlimited
  226.  
  227.  
  228.   Could not build the ssl module!
  229.   Python requires an OpenSSL 1.0.2 or 1.1 compatible libssl with X509_VERIFY_PARAM_set1_host().
  230.   LibreSSL 2.6.4 and earlier do not provide the necessary APIs, https://github.com/libressl-portable/portable/issues/381
  231.  
  232.   running build_scripts
  233.   creating build/scripts-3.8
  234.   error: [Errno 2] No such file or directory: '/usr/lib/python3.8/config-3.8-x86_64-linux-gnu/Tools/scripts/pydoc3'
  235.   ----------------------------------------
  236.   ERROR: Failed building wheel for Python
  237.   Running setup.py clean for Python
  238. Failed to build Python
  239. Installing collected packages: Python
  240.     Running setup.py install for Python ... error
  241.     ERROR: Command errored out with exit status 1:
  242.      command: /usr/bin/python3 -u -c 'import sys, setuptools, tokenize; sys.argv[0] = '"'"'/tmp/pip-req-build-_od32i_x/setup.py'"'"'; __file__='"'"'/tmp/pip-req-build-_od32i_x/setup.py'"'"';f=getattr(tokenize, '"'"'open'"'"', open)(__file__);code=f.read().replace('"'"'\r\n'"'"', '"'"'\n'"'"');f.close();exec(compile(code, __file__, '"'"'exec'"'"'))' install --record /tmp/pip-record-kzs09dnd/install-record.txt --single-version-externally-managed --user --prefix= --compile --install-headers /home/beany_lass/.local/include/python3.8/Python
  243.          cwd: /tmp/pip-req-build-_od32i_x/
  244.     Complete output (6 lines):
  245.     usage: setup.py [global_opts] cmd1 [cmd1_opts] [cmd2 [cmd2_opts] ...]
  246.        or: setup.py --help [cmd1 cmd2 ...]
  247.        or: setup.py --help-commands
  248.        or: setup.py cmd --help
  249.    
  250.     error: option --single-version-externally-managed not recognized
  251.     ----------------------------------------
  252. ERROR: Command errored out with exit status 1: /usr/bin/python3 -u -c 'import sys, setuptools, tokenize; sys.argv[0] = '"'"'/tmp/pip-req-build-_od32i_x/setup.py'"'"'; __file__='"'"'/tmp/pip-req-build-_od32i_x/setup.py'"'"';f=getattr(tokenize, '"'"'open'"'"', open)(__file__);code=f.read().replace('"'"'\r\n'"'"', '"'"'\n'"'"');f.close();exec(compile(code, __file__, '"'"'exec'"'"'))' install --record /tmp/pip-record-kzs09dnd/install-record.txt --single-version-externally-managed --user --prefix= --compile --install-headers /home/beany_lass/.local/include/python3.8/Python Check the logs for full command output.
  253. ```
Advertisement
RAW Paste Data Copied
Advertisement