SHARE
TWEET

Untitled

a guest Jun 19th, 2019 74 Never
Not a member of Pastebin yet? Sign Up, it unlocks many cool features!
  1. ...
  2. [ 62%] Linking CXX executable Telegram
  3. /usr/bin/ld: cannot find -ldrm
  4. collect2: error: ld returned 1 exit status
  5. CMakeFiles/Telegram.dir/build.make:13917: recipe for target 'Telegram' failed
  6. make[2]: *** [Telegram] Error 1
  7. CMakeFiles/Makefile2:88: recipe for target 'CMakeFiles/Telegram.dir/all' failed
  8. make[1]: *** [CMakeFiles/Telegram.dir/all] Error 2
  9. Makefile:83: recipe for target 'all' failed
  10. make: *** [all] Error 2
RAW Paste Data
We use cookies for various purposes including analytics. By continuing to use Pastebin, you agree to our use of cookies as described in the Cookies Policy. OK, I Understand
Not a member of Pastebin yet?
Sign Up, it unlocks many cool features!
 
Top