Advertisement
Guest User

multilib_support

a guest
Sep 3rd, 2021
85
0
Never
Not a member of Pastebin yet? Sign Up, it unlocks many cool features!
text 6.13 KB | None | 0 0
  1. DEBUG: Executing shell function do_compile_kernelmodules
  2. NOTE: make HOSTCC=gcc -isystem/home/user/kasturi_new/imx-yocto-bsp_with_multilib/build/tmp/work/imx8mmevk-poky-linux/linux-imx/5.4-r0/recipe-sysroot-native/usr/include -O2 -pipe -L/home/user/kasturi_new/imx-yocto-bsp_with_multilib/build/tmp/work/imx8mmevk-poky-linux/linux-imx/5.4-r0/recipe-sysroot-native/usr/lib -L/home/user/kasturi_new/imx-yocto-bsp_with_multilib/build/tmp/work/imx8mmevk-poky-linux/linux-imx/5.4-r0/recipe-sysroot-native/lib -Wl,--enable-new-dtags -Wl,-rpath-link,/home/user/kasturi_new/imx-yocto-bsp_with_multilib/build/tmp/work/imx8mmevk-poky-linux/linux-imx/5.4-r0/recipe-sysroot-native/usr/lib -Wl,-rpath-link,/home/user/kasturi_new/imx-yocto-bsp_with_multilib/build/tmp/work/imx8mmevk-poky-linux/linux-imx/5.4-r0/recipe-sysroot-native/lib -Wl,-rpath,/home/user/kasturi_new/imx-yocto-bsp_with_multilib/build/tmp/work/imx8mmevk-poky-linux/linux-imx/5.4-r0/recipe-sysroot-native/usr/lib -Wl,-rpath,/home/user/kasturi_new/imx-yocto-bsp_with_multilib/build/tmp/work/imx8mmevk-poky-linux/linux-imx/5.4-r0/recipe-sysroot-native/lib -Wl,-O1 HOSTCPP=gcc -E -C /home/user/kasturi_new/imx-yocto-bsp_with_multilib/build/tmp/work/imx8mmevk-poky-linux/linux-imx/5.4-r0/build -j 8 modules CC=aarch64-poky-linux-gcc -fuse-ld=bfd -fmacro-prefix-map=/home/user/kasturi_new/imx-yocto-bsp_with_multilib/build/tmp/work/imx8mmevk-poky-linux/linux-imx/5.4-r0=/usr/src/debug/linux-imx/5.4-r0 -fdebug-prefix-map=/home/user/kasturi_new/imx-yocto-bsp_with_multilib/build/tmp/work/imx8mmevk-poky-linux/linux-imx/5.4-r0=/usr/src/debug/linux-imx/5.4-r0 -fdebug-prefix-map=/home/user/kasturi_new/imx-yocto-bsp_with_multilib/build/tmp/work/imx8mmevk-poky-linux/linux-imx/5.4-r0/recipe-sysroot= -fdebug-prefix-map=/home/user/kasturi_new/imx-yocto-bsp_with_multilib/build/tmp/work/imx8mmevk-poky-linux/linux-imx/5.4-r0/recipe-sysroot-native= -fdebug-prefix-map=/home/user/kasturi_new/imx-yocto-bsp_with_multilib/build/tmp/work-shared/imx8mmevk/kernel-source=/usr/src/kernel LD=aarch64-poky-linux-ld.bfd LOADADDR=0x40480000
  3. make: Entering directory '/home/user/kasturi_new/imx-yocto-bsp_with_multilib/build/tmp/work/imx8mmevk-poky-linux/linux-imx/5.4-r0/build'
  4. GEN Makefile
  5. CALL /home/user/kasturi_new/imx-yocto-bsp_with_multilib/build/tmp/work-shared/imx8mmevk/kernel-source/scripts/atomic/check-atomics.sh
  6. sha1sum not available, skipping atomic header checks.
  7. CALL /home/user/kasturi_new/imx-yocto-bsp_with_multilib/build/tmp/work-shared/imx8mmevk/kernel-source/scripts/checksyscalls.sh
  8. CHK include/generated/compile.h
  9. LD [M] drivers/gpu/drm/etnaviv/etnaviv.o
  10. aarch64-poky-linux-ld.bfd: drivers/gpu/drm/etnaviv/etnaviv_buffer.o: file not recognized: file truncated
  11. make[5]: *** [/home/user/kasturi_new/imx-yocto-bsp_with_multilib/build/tmp/work-shared/imx8mmevk/kernel-source/scripts/Makefile.build:437: drivers/gpu/drm/etnaviv/etnaviv.o] Error 1
  12. make[4]: *** [/home/user/kasturi_new/imx-yocto-bsp_with_multilib/build/tmp/work-shared/imx8mmevk/kernel-source/scripts/Makefile.build:500: drivers/gpu/drm/etnaviv] Error 2
  13. make[3]: *** [/home/user/kasturi_new/imx-yocto-bsp_with_multilib/build/tmp/work-shared/imx8mmevk/kernel-source/scripts/Makefile.build:500: drivers/gpu/drm] Error 2
  14. make[2]: *** [/home/user/kasturi_new/imx-yocto-bsp_with_multilib/build/tmp/work-shared/imx8mmevk/kernel-source/scripts/Makefile.build:500: drivers/gpu] Error 2
  15. make[2]: *** Waiting for unfinished jobs....
  16. make[1]: *** [/home/user/kasturi_new/imx-yocto-bsp_with_multilib/build/tmp/work-shared/imx8mmevk/kernel-source/Makefile:1729: drivers] Error 2
  17. make: *** [/home/user/kasturi_new/imx-yocto-bsp_with_multilib/build/tmp/work-shared/imx8mmevk/kernel-source/Makefile:179: sub-make] Error 2
  18. make: Leaving directory '/home/user/kasturi_new/imx-yocto-bsp_with_multilib/build/tmp/work/imx8mmevk-poky-linux/linux-imx/5.4-r0/build'
  19. ERROR: oe_runmake failed
  20. WARNING: exit code 1 from a shell command.
  21. ERROR: Execution of '/home/user/kasturi_new/imx-yocto-bsp_with_multilib/build/tmp/work/imx8mmevk-poky-linux/linux-imx/5.4-r0/temp/run.do_compile_kernelmodules.76836' failed with exit code 1:
  22. make: Entering directory '/home/user/kasturi_new/imx-yocto-bsp_with_multilib/build/tmp/work/imx8mmevk-poky-linux/linux-imx/5.4-r0/build'
  23. GEN Makefile
  24. CALL /home/user/kasturi_new/imx-yocto-bsp_with_multilib/build/tmp/work-shared/imx8mmevk/kernel-source/scripts/atomic/check-atomics.sh
  25. sha1sum not available, skipping atomic header checks.
  26. CALL /home/user/kasturi_new/imx-yocto-bsp_with_multilib/build/tmp/work-shared/imx8mmevk/kernel-source/scripts/checksyscalls.sh
  27. CHK include/generated/compile.h
  28. LD [M] drivers/gpu/drm/etnaviv/etnaviv.o
  29. aarch64-poky-linux-ld.bfd: drivers/gpu/drm/etnaviv/etnaviv_buffer.o: file not recognized: file truncated
  30. make[5]: *** [/home/user/kasturi_new/imx-yocto-bsp_with_multilib/build/tmp/work-shared/imx8mmevk/kernel-source/scripts/Makefile.build:437: drivers/gpu/drm/etnaviv/etnaviv.o] Error 1
  31. make[4]: *** [/home/user/kasturi_new/imx-yocto-bsp_with_multilib/build/tmp/work-shared/imx8mmevk/kernel-source/scripts/Makefile.build:500: drivers/gpu/drm/etnaviv] Error 2
  32. make[3]: *** [/home/user/kasturi_new/imx-yocto-bsp_with_multilib/build/tmp/work-shared/imx8mmevk/kernel-source/scripts/Makefile.build:500: drivers/gpu/drm] Error 2
  33. make[2]: *** [/home/user/kasturi_new/imx-yocto-bsp_with_multilib/build/tmp/work-shared/imx8mmevk/kernel-source/scripts/Makefile.build:500: drivers/gpu] Error 2
  34. make[2]: *** Waiting for unfinished jobs....
  35. make[1]: *** [/home/user/kasturi_new/imx-yocto-bsp_with_multilib/build/tmp/work-shared/imx8mmevk/kernel-source/Makefile:1729: drivers] Error 2
  36. make: *** [/home/user/kasturi_new/imx-yocto-bsp_with_multilib/build/tmp/work-shared/imx8mmevk/kernel-source/Makefile:179: sub-make] Error 2
  37. make: Leaving directory '/home/user/kasturi_new/imx-yocto-bsp_with_multilib/build/tmp/work/imx8mmevk-poky-linux/linux-imx/5.4-r0/build'
  38. WARNING: exit code 1 from a shell command.
  39.  
Advertisement
Add Comment
Please, Sign In to add comment
Advertisement