Guest User

Untitled

a guest
Nov 7th, 2023
109
0
Never
Not a member of Pastebin yet? Sign Up, it unlocks many cool features!
Python 231.35 KB | Source Code | 0 0
  1. est/orm/test_versioning.py::VersionOnPostUpdateTest_sqlite+pysqlite_3_44_0::test_m2o_post_update_version_assert PASSED [ 99%]
  2. test/orm/test_versioning.py::VersionOnPostUpdateTest_sqlite+pysqlite_3_44_0::test_o2m_plain PASSED [ 99%]
  3. test/orm/test_versioning.py::VersionOnPostUpdateTest_sqlite+pysqlite_3_44_0::test_o2m_post_update PASSED [ 99%]
  4. test/orm/test_versioning.py::VersionOnPostUpdateTest_sqlite+pysqlite_3_44_0::test_o2m_post_update_no_sane_rowcount PASSED [ 99%]
  5. test/orm/test_versioning.py::VersionOnPostUpdateTest_sqlite+pysqlite_3_44_0::test_o2m_post_update_not_assoc_w_insert PASSED [ 99%]
  6. test/orm/test_versioning.py::VersionOnPostUpdateTest_sqlite+pysqlite_3_44_0::test_o2m_post_update_version_assert PASSED [ 99%]
  7. test/orm/test_versioning.py::VersioningMappedSelectTest_sqlite+pysqlite_3_44_0::test_explicit PASSED [ 99%]
  8. test/orm/test_versioning.py::VersioningMappedSelectTest_sqlite+pysqlite_3_44_0::test_explicit_assign_from_expired PASSED [ 99%]
  9. test/orm/test_versioning.py::VersioningMappedSelectTest_sqlite+pysqlite_3_44_0::test_implicit PASSED [ 99%]
  10. test/orm/test_versioning.py::VersioningMappedSelectTest_sqlite+pysqlite_3_44_0::test_implicit_no_readonly PASSED [ 99%]
  11. test/orm/test_versioning.py::VersioningTest_sqlite+pysqlite_3_44_0::test_basic PASSED [ 99%]
  12. test/orm/test_versioning.py::VersioningTest_sqlite+pysqlite_3_44_0::test_bulk_insert PASSED [ 99%]
  13. test/orm/test_versioning.py::VersioningTest_sqlite+pysqlite_3_44_0::test_bulk_update PASSED [ 99%]
  14. test/orm/test_versioning.py::VersioningTest_sqlite+pysqlite_3_44_0::test_bump_version PASSED [ 99%]
  15. test/orm/test_versioning.py::VersioningTest_sqlite+pysqlite_3_44_0::test_merge_correct_version PASSED [ 99%]
  16. test/orm/test_versioning.py::VersioningTest_sqlite+pysqlite_3_44_0::test_merge_incorrect_version PASSED [ 99%]
  17. test/orm/test_versioning.py::VersioningTest_sqlite+pysqlite_3_44_0::test_merge_incorrect_version_not_in_session PASSED [ 99%]
  18. test/orm/test_versioning.py::VersioningTest_sqlite+pysqlite_3_44_0::test_merge_no_version PASSED [ 99%]
  19. test/orm/test_versioning.py::VersioningTest_sqlite+pysqlite_3_44_0::test_multiple_updates PASSED [ 99%]
  20. test/orm/test_versioning.py::VersioningTest_sqlite+pysqlite_3_44_0::test_notsane_warning PASSED [ 99%]
  21. test/orm/test_versioning.py::VersioningTest_sqlite+pysqlite_3_44_0::test_noversioncheck PASSED [ 99%]
  22. test/orm/test_versioning.py::VersioningTest_sqlite+pysqlite_3_44_0::test_update_delete_no_plain_rowcount PASSED [ 99%]
  23. test/orm/test_versioning.py::VersioningTest_sqlite+pysqlite_3_44_0::test_update_multi_missing_broken_multi_rowcount PASSED [ 99%]
  24. test/orm/test_versioning.py::VersioningTest_sqlite+pysqlite_3_44_0::test_versioncheck PASSED [ 99%]
  25. test/orm/test_versioning.py::VersioningTest_sqlite+pysqlite_3_44_0::test_versioncheck_for_update SKIPPED [ 99%]
  26. test/orm/test_versioning.py::VersioningTest_sqlite+pysqlite_3_44_0::test_versioncheck_not_versioned PASSED [ 99%]
  27. test/base/test_warnings.py::ClsWarningTest::test_dep_inspectable PASSED  [ 99%]
  28. test/base/test_warnings.py::WarnDeprecatedLimitedTest::test_warn_deprecated_limited_cap PASSED [ 99%]
  29. test/base/test_warnings.py::WarnDeprecatedLimitedTest::test_warn_deprecated_limited_text PASSED [ 99%]
  30. test/orm/inheritance/test_with_poly.py::PolymorphicAliasedJoinsTest::test_col_expression_base_plus_two_subs[False] PASSED [ 99%]
  31. test/orm/inheritance/test_with_poly.py::PolymorphicAliasedJoinsTest::test_col_expression_base_plus_two_subs[True] PASSED [ 99%]
  32. test/orm/inheritance/test_with_poly.py::PolymorphicAliasedJoinsTest::test_join_base_to_sub PASSED [ 99%]
  33. test/orm/inheritance/test_with_poly.py::PolymorphicAliasedJoinsTest::test_join_to_join_columns PASSED [ 99%]
  34. test/orm/inheritance/test_with_poly.py::PolymorphicAliasedJoinsTest::test_join_to_join_entities PASSED [ 99%]
  35. test/orm/inheritance/test_with_poly.py::PolymorphicAliasedJoinsTest::test_orm_entity_w_gc PASSED [ 99%]
  36. test/orm/inheritance/test_with_poly.py::PolymorphicJoinsTest::test_col_expression_base_plus_two_subs[False] PASSED [ 99%]
  37. test/orm/inheritance/test_with_poly.py::PolymorphicJoinsTest::test_col_expression_base_plus_two_subs[True] PASSED [ 99%]
  38. test/orm/inheritance/test_with_poly.py::PolymorphicJoinsTest::test_join_base_to_sub PASSED [ 99%]
  39. test/orm/inheritance/test_with_poly.py::PolymorphicJoinsTest::test_join_to_join_columns PASSED [ 99%]
  40. test/orm/inheritance/test_with_poly.py::PolymorphicJoinsTest::test_join_to_join_entities PASSED [ 99%]
  41. test/orm/inheritance/test_with_poly.py::PolymorphicJoinsTest::test_orm_entity_w_gc PASSED [ 99%]
  42. test/orm/inheritance/test_with_poly.py::PolymorphicPolymorphicTest::test_col_expression_base_plus_two_subs[False] PASSED [ 99%]
  43. test/orm/inheritance/test_with_poly.py::PolymorphicPolymorphicTest::test_col_expression_base_plus_two_subs[True] PASSED [ 99%]
  44. test/orm/inheritance/test_with_poly.py::PolymorphicPolymorphicTest::test_join_base_to_sub PASSED [ 99%]
  45. test/orm/inheritance/test_with_poly.py::PolymorphicPolymorphicTest::test_join_to_join_columns PASSED [ 99%]
  46. test/orm/inheritance/test_with_poly.py::PolymorphicPolymorphicTest::test_join_to_join_entities PASSED [ 99%]
  47. test/orm/inheritance/test_with_poly.py::PolymorphicPolymorphicTest::test_orm_entity_w_gc PASSED [ 99%]
  48. test/orm/inheritance/test_with_poly.py::PolymorphicTest::test_col_expression_base_plus_two_subs[False] PASSED [ 99%]
  49. test/orm/inheritance/test_with_poly.py::PolymorphicTest::test_col_expression_base_plus_two_subs[True] PASSED [ 99%]
  50. test/orm/inheritance/test_with_poly.py::PolymorphicTest::test_join_base_to_sub PASSED [ 99%]
  51. test/orm/inheritance/test_with_poly.py::PolymorphicTest::test_join_to_join_columns PASSED [ 99%]
  52. test/orm/inheritance/test_with_poly.py::PolymorphicTest::test_join_to_join_entities PASSED [ 99%]
  53. test/orm/inheritance/test_with_poly.py::PolymorphicTest::test_orm_entity_w_gc PASSED [ 99%]
  54. test/orm/inheritance/test_with_poly.py::PolymorphicUnionsTest::test_col_expression_base_plus_two_subs[False] PASSED [ 99%]
  55. test/orm/inheritance/test_with_poly.py::PolymorphicUnionsTest::test_col_expression_base_plus_two_subs[True] PASSED [ 99%]
  56. test/orm/inheritance/test_with_poly.py::PolymorphicUnionsTest::test_join_base_to_sub PASSED [ 99%]
  57. test/orm/inheritance/test_with_poly.py::PolymorphicUnionsTest::test_join_to_join_columns PASSED [ 99%]
  58. test/orm/inheritance/test_with_poly.py::PolymorphicUnionsTest::test_join_to_join_entities PASSED [ 99%]
  59. test/orm/inheritance/test_with_poly.py::PolymorphicUnionsTest::test_orm_entity_w_gc PASSED [ 99%]
  60. test/orm/inheritance/test_with_poly.py::WithPolymorphicAPITest::test_no_use_flat_and_aliased PASSED [ 99%]
  61.  
  62. =================================== FAILURES ===================================
  63. _ CursorResultTest_sqlite+pysqlite_3_44_0.test_pickle_rows_other_process[not_use_labels] _
  64. Traceback (most recent call last):
  65.   File "/usr/lib/python3.11/site-packages/_pytest/runner.py", line 341, in from_call
  66.     result: Optional[TResult] = func()
  67.                                 ^^^^^^
  68.   File "/usr/lib/python3.11/site-packages/_pytest/runner.py", line 262, in <lambda>
  69.     lambda: ihook(item=item, **kwds), when=when, reraise=reraise
  70.             ^^^^^^^^^^^^^^^^^^^^^^^^
  71.   File "/usr/lib/python3.11/site-packages/pluggy/_hooks.py", line 493, in __call__
  72.     return self._hookexec(self.name, self._hookimpls, kwargs, firstresult)
  73.            ^^^^^^^^^^^^^^^^^^^^^^^^^^^^^^^^^^^^^^^^^^^^^^^^^^^^^^^^^^^^^^^
  74.   File "/usr/lib/python3.11/site-packages/pluggy/_manager.py", line 115, in _hookexec
  75.     return self._inner_hookexec(hook_name, methods, kwargs, firstresult)
  76.            ^^^^^^^^^^^^^^^^^^^^^^^^^^^^^^^^^^^^^^^^^^^^^^^^^^^^^^^^^^^^^
  77.   File "/usr/lib/python3.11/site-packages/pluggy/_callers.py", line 152, in _multicall
  78.     return outcome.get_result()
  79.            ^^^^^^^^^^^^^^^^^^^^
  80.   File "/usr/lib/python3.11/site-packages/pluggy/_result.py", line 114, in get_result
  81.     raise exc.with_traceback(exc.__traceback__)
  82.   File "/usr/lib/python3.11/site-packages/pluggy/_callers.py", line 77, in _multicall
  83.     res = hook_impl.function(*args)
  84.           ^^^^^^^^^^^^^^^^^^^^^^^^^
  85.   File "/usr/lib/python3.11/site-packages/_pytest/runner.py", line 177, in pytest_runtest_call
  86.     raise e
  87.   File "/usr/lib/python3.11/site-packages/_pytest/runner.py", line 169, in pytest_runtest_call
  88.     item.runtest()
  89.   File "/usr/lib/python3.11/site-packages/_pytest/python.py", line 1792, in runtest
  90.     self.ihook.pytest_pyfunc_call(pyfuncitem=self)
  91.   File "/usr/lib/python3.11/site-packages/pluggy/_hooks.py", line 493, in __call__
  92.     return self._hookexec(self.name, self._hookimpls, kwargs, firstresult)
  93.            ^^^^^^^^^^^^^^^^^^^^^^^^^^^^^^^^^^^^^^^^^^^^^^^^^^^^^^^^^^^^^^^
  94.   File "/usr/lib/python3.11/site-packages/pluggy/_manager.py", line 115, in _hookexec
  95.     return self._inner_hookexec(hook_name, methods, kwargs, firstresult)
  96.            ^^^^^^^^^^^^^^^^^^^^^^^^^^^^^^^^^^^^^^^^^^^^^^^^^^^^^^^^^^^^^
  97.   File "/usr/lib/python3.11/site-packages/pluggy/_callers.py", line 113, in _multicall
  98.     raise exception.with_traceback(exception.__traceback__)
  99.   File "/usr/lib/python3.11/site-packages/pluggy/_callers.py", line 77, in _multicall
  100.     res = hook_impl.function(*args)
  101.           ^^^^^^^^^^^^^^^^^^^^^^^^^
  102.   File "/usr/lib/python3.11/site-packages/_pytest/python.py", line 194, in pytest_pyfunc_call
  103.     result = testfunction(**testargs)
  104.              ^^^^^^^^^^^^^^^^^^^^^^^^
  105.   File "/build/python-sqlalchemy/src/SQLAlchemy-2.0.23/test/sql/test_resultset.py", line 534, in test_pickle_rows_other_process
  106.     eq_(proc.returncode, 0)
  107.   File "/build/python-sqlalchemy/src/SQLAlchemy-2.0.23/lib/sqlalchemy/testing/assertions.py", line 283, in eq_
  108.     assert a == b, msg or "%r != %r" % (a, b)
  109. AssertionError: 1 != 0
  110. assert 1 == 0
  111. ----------------------------- Captured stderr call -----------------------------
  112. Traceback (most recent call last):
  113.   File "<string>", line 1, in <module>
  114. ModuleNotFoundError: No module named 'sqlalchemy'
  115. _ CursorResultTest_sqlite+pysqlite_3_44_0.test_pickle_rows_other_process[use_labels] _
  116. Traceback (most recent call last):
  117.   File "/usr/lib/python3.11/site-packages/_pytest/runner.py", line 341, in from_call
  118.     result: Optional[TResult] = func()
  119.                                 ^^^^^^
  120.   File "/usr/lib/python3.11/site-packages/_pytest/runner.py", line 262, in <lambda>
  121.     lambda: ihook(item=item, **kwds), when=when, reraise=reraise
  122.             ^^^^^^^^^^^^^^^^^^^^^^^^
  123.   File "/usr/lib/python3.11/site-packages/pluggy/_hooks.py", line 493, in __call__
  124.     return self._hookexec(self.name, self._hookimpls, kwargs, firstresult)
  125.            ^^^^^^^^^^^^^^^^^^^^^^^^^^^^^^^^^^^^^^^^^^^^^^^^^^^^^^^^^^^^^^^
  126.   File "/usr/lib/python3.11/site-packages/pluggy/_manager.py", line 115, in _hookexec
  127.     return self._inner_hookexec(hook_name, methods, kwargs, firstresult)
  128.            ^^^^^^^^^^^^^^^^^^^^^^^^^^^^^^^^^^^^^^^^^^^^^^^^^^^^^^^^^^^^^
  129.   File "/usr/lib/python3.11/site-packages/pluggy/_callers.py", line 152, in _multicall
  130.     return outcome.get_result()
  131.            ^^^^^^^^^^^^^^^^^^^^
  132.   File "/usr/lib/python3.11/site-packages/pluggy/_result.py", line 114, in get_result
  133.     raise exc.with_traceback(exc.__traceback__)
  134.   File "/usr/lib/python3.11/site-packages/pluggy/_callers.py", line 77, in _multicall
  135.     res = hook_impl.function(*args)
  136.           ^^^^^^^^^^^^^^^^^^^^^^^^^
  137.   File "/usr/lib/python3.11/site-packages/_pytest/runner.py", line 177, in pytest_runtest_call
  138.     raise e
  139.   File "/usr/lib/python3.11/site-packages/_pytest/runner.py", line 169, in pytest_runtest_call
  140.     item.runtest()
  141.   File "/usr/lib/python3.11/site-packages/_pytest/python.py", line 1792, in runtest
  142.     self.ihook.pytest_pyfunc_call(pyfuncitem=self)
  143.   File "/usr/lib/python3.11/site-packages/pluggy/_hooks.py", line 493, in __call__
  144.     return self._hookexec(self.name, self._hookimpls, kwargs, firstresult)
  145.            ^^^^^^^^^^^^^^^^^^^^^^^^^^^^^^^^^^^^^^^^^^^^^^^^^^^^^^^^^^^^^^^
  146.   File "/usr/lib/python3.11/site-packages/pluggy/_manager.py", line 115, in _hookexec
  147.     return self._inner_hookexec(hook_name, methods, kwargs, firstresult)
  148.            ^^^^^^^^^^^^^^^^^^^^^^^^^^^^^^^^^^^^^^^^^^^^^^^^^^^^^^^^^^^^^
  149.   File "/usr/lib/python3.11/site-packages/pluggy/_callers.py", line 113, in _multicall
  150.     raise exception.with_traceback(exception.__traceback__)
  151.   File "/usr/lib/python3.11/site-packages/pluggy/_callers.py", line 77, in _multicall
  152.     res = hook_impl.function(*args)
  153.           ^^^^^^^^^^^^^^^^^^^^^^^^^
  154.   File "/usr/lib/python3.11/site-packages/_pytest/python.py", line 194, in pytest_pyfunc_call
  155.     result = testfunction(**testargs)
  156.              ^^^^^^^^^^^^^^^^^^^^^^^^
  157.   File "/build/python-sqlalchemy/src/SQLAlchemy-2.0.23/test/sql/test_resultset.py", line 534, in test_pickle_rows_other_process
  158.     eq_(proc.returncode, 0)
  159.   File "/build/python-sqlalchemy/src/SQLAlchemy-2.0.23/lib/sqlalchemy/testing/assertions.py", line 283, in eq_
  160.     assert a == b, msg or "%r != %r" % (a, b)
  161. AssertionError: 1 != 0
  162. assert 1 == 0
  163. ----------------------------- Captured stderr call -----------------------------
  164. Traceback (most recent call last):
  165.   File "<string>", line 1, in <module>
  166. ModuleNotFoundError: No module named 'sqlalchemy'
  167. =========================== short test summary info ============================
  168. SKIPPED [1] lib/sqlalchemy/testing/config.py:420: 'test/ext/mypy/test_mypy_plugin_py3k.py::MypyPluginTest::test_incremental[/build/python-sqlalchemy/src/SQLAlchemy-2.0.23/test/ext/mypy/incremental/stubs_14] (call)' : patch library needed
  169. SKIPPED [1] lib/sqlalchemy/testing/config.py:420: 'test/ext/mypy/test_mypy_plugin_py3k.py::MypyPluginTest::test_incremental[/build/python-sqlalchemy/src/SQLAlchemy-2.0.23/test/ext/mypy/incremental/ticket_6147] (call)' : patch library needed
  170. SKIPPED [1] lib/sqlalchemy/testing/config.py:420: 'test/ext/mypy/test_mypy_plugin_py3k.py::MypyPluginTest::test_incremental[/build/python-sqlalchemy/src/SQLAlchemy-2.0.23/test/ext/mypy/incremental/ticket_6435] (call)' : patch library needed
  171. SKIPPED [1] lib/sqlalchemy/testing/config.py:420: 'test/ext/mypy/test_mypy_plugin_py3k.py::MypyPluginTest::test_incremental[/build/python-sqlalchemy/src/SQLAlchemy-2.0.23/test/ext/mypy/incremental/ticket_6476] (call)' : patch library needed
  172. SKIPPED [9] lib/sqlalchemy/testing/config.py:420: 'test.dialect.postgresql.test_async_pg_py3k.AsyncPgTest' unsupported on any DB implementation 'sqlite(3.44.0)+pysqlite'
  173. SKIPPED [2] test/orm/declarative/test_basic.py:2276: current base has no metaclass
  174. SKIPPED [1] test/orm/declarative/test_basic.py:2372: current base has no metaclass
  175. SKIPPED [1] test/orm/declarative/test_basic.py:2385: current base has no metaclass
  176. SKIPPED [1] test/orm/declarative/test_basic.py:2699: current base has no metaclass
  177. SKIPPED [1] test/orm/declarative/test_basic.py:1232: current base has no metaclass
  178. SKIPPED [1] test/orm/declarative/test_basic.py:2576: current base has no metaclass
  179. SKIPPED [1] test/orm/declarative/test_basic.py:3029: current base has no metaclass
  180. SKIPPED [1] test/orm/declarative/test_basic.py:2958: current base has no metaclass
  181. SKIPPED [4] lib/sqlalchemy/testing/config.py:420: 'test.orm.inheritance.test_basic.PassiveDeletesTest' unsupported on any DB implementation 'sqlite(3.44.0)+pysqlite'not supported by database
  182. SKIPPED [12] lib/sqlalchemy/testing/config.py:420: 'test.orm.dml.test_bulk_statements.CTETest' unsupported on any DB implementation 'sqlite(3.44.0)+pysqlite'not postgresql
  183. SKIPPED [61] lib/sqlalchemy/testing/config.py:420: No profiling stats available on this platform for this function.  Run tests with --write-profiles to add statistics to profiles.txt for this platform.
  184. SKIPPED [2] lib/sqlalchemy/testing/config.py:420: 'test.base.test_concurrency_py3k.TestAsyncAdaptedQueue' unsupported on any DB implementation 'sqlite(3.44.0)+pysqlite'custom function
  185. SKIPPED [10] lib/sqlalchemy/testing/config.py:420: 'test.base.test_concurrency_py3k.TestAsyncioCompat' unsupported on any DB implementation 'sqlite(3.44.0)+pysqlite'custom function
  186. SKIPPED [1] lib/sqlalchemy/testing/config.py:420: 'test/orm/test_core_compilation.py::PropagateAttrsTest::test_autoflushes[<lambda>-True-_exclusions_013] (call)' : not postgresql
  187. SKIPPED [1] lib/sqlalchemy/testing/config.py:420: 'test/orm/test_core_compilation.py::PropagateAttrsTest::test_propagate_attr_yesno[<lambda>-True-_exclusions_013] (call)' : not postgresql
  188. SKIPPED [2] lib/sqlalchemy/testing/config.py:420: 'test.engine.test_ddlevents.SequenceDDLEventTest' unsupported on any DB implementation 'sqlite(3.44.0)+pysqlite'no sequence support
  189. SKIPPED [5] lib/sqlalchemy/testing/config.py:420: 'test.sql.test_defaults.CTEDefaultTest' unsupported on any DB implementation 'sqlite(3.44.0)+pysqlite'not postgresql
  190. SKIPPED [1] lib/sqlalchemy/testing/config.py:420: 'test.orm.test_defaults.IdentityDefaultsOnUpdateTest' unsupported on any DB implementation 'sqlite(3.44.0)+pysqlite'not postgresql >= (10,) and not oracle >= (12,) and not mssql
  191. SKIPPED [1] lib/sqlalchemy/testing/config.py:420: 'test/sql/test_delete.py::DeleteFromRoundTripTest_sqlite+pysqlite_3_44_0::test_exec_alias_plus_table (call)' : Backend does not support DELETE..USING or equivalent and Backend does not support DELETE..USING or equivalent and Backend does not support DELETE..USING or equivalent and Backend does not support DELETE..USING or equivalent
  192. SKIPPED [1] lib/sqlalchemy/testing/config.py:420: 'test/sql/test_delete.py::DeleteFromRoundTripTest_sqlite+pysqlite_3_44_0::test_exec_three_table (call)' : Backend does not support DELETE..USING or equivalent and Backend does not support DELETE..USING or equivalent and Backend does not support DELETE..USING or equivalent and Backend does not support DELETE..USING or equivalent
  193. SKIPPED [1] lib/sqlalchemy/testing/config.py:420: 'test/sql/test_delete.py::DeleteFromRoundTripTest_sqlite+pysqlite_3_44_0::test_exec_two_table (call)' : Backend does not support DELETE..USING or equivalent and Backend does not support DELETE..USING or equivalent and Backend does not support DELETE..USING or equivalent and Backend does not support DELETE..USING or equivalent
  194. SKIPPED [1] lib/sqlalchemy/testing/config.py:420: 'test/sql/test_delete.py::DeleteFromRoundTripTest_sqlite+pysqlite_3_44_0::test_exec_two_table_plus_alias (call)' : Backend does not support DELETE..USING or equivalent and Backend does not support DELETE..USING or equivalent and Backend does not support DELETE..USING or equivalent and Backend does not support DELETE..USING or equivalent
  195. SKIPPED [3] lib/sqlalchemy/testing/config.py:420: 'test.dialect.mssql.test_deprecations.LegacySchemaAliasingBackendTest' unsupported on any DB implementation 'sqlite(3.44.0)+pysqlite'
  196. SKIPPED [8] lib/sqlalchemy/testing/config.py:420: 'test.dialect.mysql.test_dialect.BackendDialectTest' unsupported on any DB implementation 'sqlite(3.44.0)+pysqlite'
  197. SKIPPED [1] lib/sqlalchemy/testing/config.py:420: 'test/dialect/postgresql/test_dialect.py::BackendDialectTest_sqlite+pysqlite_3_44_0::test_multiple_host_real_connect[postgresql+D://U:PS@/DB?host=H&host=H:P&host=H-False] (call)' : not +psycopg and not +psycopg2 and not +asyncpg
  198. SKIPPED [1] lib/sqlalchemy/testing/config.py:420: 'test/dialect/postgresql/test_dialect.py::BackendDialectTest_sqlite+pysqlite_3_44_0::test_multiple_host_real_connect[postgresql+D://U:PS@/DB?host=H,H,H&port=P,P,P-True] (call)' : not +psycopg and not +psycopg2 and not +asyncpg
  199. SKIPPED [1] lib/sqlalchemy/testing/config.py:420: 'test/dialect/postgresql/test_dialect.py::BackendDialectTest_sqlite+pysqlite_3_44_0::test_multiple_host_real_connect[postgresql+D://U:PS@/DB?host=H:P&host=H&host=H-False] (call)' : not +psycopg and not +psycopg2 and not +asyncpg
  200. SKIPPED [1] lib/sqlalchemy/testing/config.py:420: 'test/dialect/postgresql/test_dialect.py::BackendDialectTest_sqlite+pysqlite_3_44_0::test_multiple_host_real_connect[postgresql+D://U:PS@/DB?host=H:P&host=H&host=H:P-False] (call)' : not +psycopg and not +psycopg2 and not +asyncpg
  201. SKIPPED [1] lib/sqlalchemy/testing/config.py:420: 'test/dialect/postgresql/test_dialect.py::BackendDialectTest_sqlite+pysqlite_3_44_0::test_multiple_host_real_connect[postgresql+D://U:PS@/DB?host=H:P&host=H:P&host=H:P-True] (call)' : not +psycopg and not +psycopg2 and not +asyncpg
  202. SKIPPED [1] lib/sqlalchemy/testing/config.py:420: 'test/dialect/postgresql/test_dialect.py::BackendDialectTest_sqlite+pysqlite_3_44_0::test_multiple_host_real_connect[postgresql+D://U:PS@H:P/DB-True] (call)' : not +psycopg and not +psycopg2 and not +asyncpg
  203. SKIPPED [11] lib/sqlalchemy/testing/config.py:420: 'test.dialect.oracle.test_dialect.CXOracleConnectArgsTest' unsupported on any DB implementation 'sqlite(3.44.0)+pysqlite'
  204. SKIPPED [3] lib/sqlalchemy/testing/config.py:420: 'test.dialect.oracle.test_dialect.ComputedReturningTest' unsupported on any DB implementation 'sqlite(3.44.0)+pysqlite'
  205. SKIPPED [2] lib/sqlalchemy/testing/config.py:420: 'test.dialect.oracle.test_dialect.DefaultSchemaNameTest' unsupported on any DB implementation 'sqlite(3.44.0)+pysqlite'
  206. SKIPPED [1] lib/sqlalchemy/testing/config.py:420: 'test/dialect/postgresql/test_dialect.py::DialectTest::test_ensure_version_is_qualified (call)' : not postgresql
  207. SKIPPED [1] lib/sqlalchemy/testing/config.py:420: 'test/dialect/mysql/test_dialect.py::DialectTest_sqlite+pysqlite_3_44_0::test_mariadb_connector_special_encodings (call)' : not mariadb+mariadbconnector
  208. SKIPPED [1] lib/sqlalchemy/testing/config.py:420: 'test/dialect/mysql/test_dialect.py::DialectTest_sqlite+pysqlite_3_44_0::test_random_arg (call)' : not mysql+mysqldb and not mysql+pymysql and not mariadb+mysqldb and not mariadb+pymysql
  209. SKIPPED [1] lib/sqlalchemy/testing/config.py:420: 'test/dialect/mysql/test_dialect.py::DialectTest_sqlite+pysqlite_3_44_0::test_special_encodings[utf8] (call)' : not mysql+mysqldb and not mysql+pymysql and not mariadb+mysqldb and not mariadb+pymysql
  210. SKIPPED [1] lib/sqlalchemy/testing/config.py:420: 'test/dialect/mysql/test_dialect.py::DialectTest_sqlite+pysqlite_3_44_0::test_special_encodings[utf8mb4] (call)' : not mysql+mysqldb and not mysql+pymysql and not mariadb+mysqldb and not mariadb+pymysql
  211. SKIPPED [9] lib/sqlalchemy/testing/config.py:420: 'test.dialect.oracle.test_dialect.DialectWBackendTest' unsupported on any DB implementation 'sqlite(3.44.0)+pysqlite'
  212. SKIPPED [3] lib/sqlalchemy/testing/config.py:420: 'test.dialect.oracle.test_dialect.ExecuteTest' unsupported on any DB implementation 'sqlite(3.44.0)+pysqlite'
  213. SKIPPED [2] lib/sqlalchemy/testing/config.py:420: 'test.dialect.postgresql.test_dialect.ExecutemanyFlagOptionsTest' unsupported on any DB implementation 'sqlite(3.44.0)+pysqlite'
  214. SKIPPED [4] lib/sqlalchemy/testing/config.py:420: 'test.dialect.postgresql.test_dialect.ExecutemanyValuesInsertsTest' unsupported on any DB implementation 'sqlite(3.44.0)+pysqlite'
  215. SKIPPED [4] lib/sqlalchemy/testing/config.py:420: 'test.dialect.postgresql.test_dialect.ExecutemanyValuesPlusBatchInsertsTest' unsupported on any DB implementation 'sqlite(3.44.0)+pysqlite'
  216. SKIPPED [2] lib/sqlalchemy/testing/config.py:420: 'test.dialect.mysql.test_dialect.ExecutionTest' unsupported on any DB implementation 'sqlite(3.44.0)+pysqlite'
  217. SKIPPED [33] lib/sqlalchemy/testing/config.py:420: 'test.dialect.postgresql.test_dialect.MiscBackendTest' unsupported on any DB implementation 'sqlite(3.44.0)+pysqlite'
  218. SKIPPED [29] lib/sqlalchemy/testing/config.py:420: 'test.dialect.oracle.test_dialect.OptimizedFetchLimitOffsetTest' unsupported on any DB implementation 'sqlite(3.44.0)+pysqlite'
  219. SKIPPED [11] lib/sqlalchemy/testing/config.py:420: 'test.dialect.oracle.test_dialect.OracleDbConnectArgsTest' unsupported on any DB implementation 'sqlite(3.44.0)+pysqlite'
  220. SKIPPED [6] lib/sqlalchemy/testing/config.py:420: 'test.dialect.oracle.test_dialect.OracledbMode' unsupported on any DB implementation 'sqlite(3.44.0)+pysqlite'
  221. SKIPPED [2] lib/sqlalchemy/testing/config.py:420: 'test.dialect.oracle.test_dialect.OutParamTest' unsupported on any DB implementation 'sqlite(3.44.0)+pysqlite'
  222. SKIPPED [1] lib/sqlalchemy/testing/config.py:420: 'test.dialect.postgresql.test_dialect.PGCodeTest' unsupported on any DB implementation 'sqlite(3.44.0)+pysqlite'
  223. SKIPPED [4] lib/sqlalchemy/testing/config.py:420: 'test.dialect.postgresql.test_dialect.Psycopg3Test' unsupported on any DB implementation 'sqlite(3.44.0)+pysqlite'
  224. SKIPPED [7] lib/sqlalchemy/testing/config.py:420: 'test.dialect.oracle.test_dialect.QuotedBindRoundTripTest' unsupported on any DB implementation 'sqlite(3.44.0)+pysqlite'
  225. SKIPPED [4] lib/sqlalchemy/testing/config.py:420: 'test.dialect.mysql.test_dialect.RemoveUTCTimestampTest' unsupported on any DB implementation 'sqlite(3.44.0)+pysqlite'
  226. SKIPPED [3] lib/sqlalchemy/testing/config.py:420: 'test.dialect.mysql.test_dialect.SQLModeDetectionTest' unsupported on any DB implementation 'sqlite(3.44.0)+pysqlite'
  227. SKIPPED [6] lib/sqlalchemy/testing/config.py:420: 'test.dialect.oracle.test_dialect.TableValuedTest' unsupported on any DB implementation 'sqlite(3.44.0)+pysqlite'
  228. SKIPPED [2] lib/sqlalchemy/testing/config.py:420: 'test.dialect.oracle.test_dialect.UnicodeSchemaTest' unsupported on any DB implementation 'sqlite(3.44.0)+pysqlite'
  229. SKIPPED [17] lib/sqlalchemy/testing/config.py:420: 'test.dialect.mssql.test_engine.FastExecutemanyTest' unsupported on any DB implementation 'sqlite(3.44.0)+pysqlite'
  230. SKIPPED [1] lib/sqlalchemy/testing/config.py:420: 'test.dialect.mssql.test_engine.InvalidTransactionFalsePositiveTest' unsupported on any DB implementation 'sqlite(3.44.0)+pysqlite'
  231. SKIPPED [2] lib/sqlalchemy/testing/config.py:420: 'test.dialect.mssql.test_engine.MiscTest' unsupported on any DB implementation 'sqlite(3.44.0)+pysqlite'
  232. SKIPPED [1] lib/sqlalchemy/testing/config.py:420: 'test/dialect/mssql/test_engine.py::ParseConnectTest::test_bad_freetds_warning (call)' : not mssql+pymssql
  233. SKIPPED [1] lib/sqlalchemy/testing/config.py:420: 'test.dialect.mssql.test_engine.RealIsolationLevelTest' unsupported on any DB implementation 'sqlite(3.44.0)+pysqlite'
  234. SKIPPED [23] lib/sqlalchemy/testing/config.py:420: 'test.ext.asyncio.test_engine_py3k.AsyncEngineTest' unsupported on any DB implementation 'sqlite(3.44.0)+pysqlite'Async dialect required, custom function
  235. SKIPPED [22] lib/sqlalchemy/testing/config.py:420: 'test.ext.asyncio.test_engine_py3k.AsyncEngineTest' unsupported on any DB implementation 'sqlite(3.44.0)+pysqlite'custom function, Async dialect required
  236. SKIPPED [5] lib/sqlalchemy/testing/config.py:420: 'test.ext.asyncio.test_engine_py3k.AsyncEventTest' unsupported on any DB implementation 'sqlite(3.44.0)+pysqlite'custom function, Async dialect required
  237. SKIPPED [1] lib/sqlalchemy/testing/config.py:420: 'test.ext.asyncio.test_engine_py3k.AsyncEventTest' unsupported on any DB implementation 'sqlite(3.44.0)+pysqlite'Async dialect required, custom function
  238. SKIPPED [1] lib/sqlalchemy/testing/config.py:420: 'test.ext.asyncio.test_engine_py3k.AsyncInspection' unsupported on any DB implementation 'sqlite(3.44.0)+pysqlite'custom function, Async dialect required
  239. SKIPPED [1] lib/sqlalchemy/testing/config.py:420: 'test.ext.asyncio.test_engine_py3k.AsyncInspection' unsupported on any DB implementation 'sqlite(3.44.0)+pysqlite'Async dialect required, custom function
  240. SKIPPED [5] lib/sqlalchemy/testing/config.py:420: 'test.ext.asyncio.test_engine_py3k.AsyncProxyTest' unsupported on any DB implementation 'sqlite(3.44.0)+pysqlite'custom function, Async dialect required
  241. SKIPPED [3] lib/sqlalchemy/testing/config.py:420: 'test.ext.asyncio.test_engine_py3k.AsyncProxyTest' unsupported on any DB implementation 'sqlite(3.44.0)+pysqlite'Async dialect required, custom function
  242. SKIPPED [17] lib/sqlalchemy/testing/config.py:420: 'test.ext.asyncio.test_engine_py3k.AsyncResultTest' unsupported on any DB implementation 'sqlite(3.44.0)+pysqlite'Async dialect required, custom function
  243. SKIPPED [29] lib/sqlalchemy/testing/config.py:420: 'test.ext.asyncio.test_engine_py3k.AsyncResultTest' unsupported on any DB implementation 'sqlite(3.44.0)+pysqlite'custom function, Async dialect required
  244. SKIPPED [5] lib/sqlalchemy/testing/config.py:420: 'test.ext.asyncio.test_engine_py3k.TextSyncDBAPI' unsupported on any DB implementation 'sqlite(3.44.0)+pysqlite'custom function
  245. SKIPPED [1] lib/sqlalchemy/testing/config.py:420: 'test/engine/test_execute.py::EngineEventsTest_sqlite+pysqlite_3_44_0::test_cursor_execute (call)' : no sequence support
  246. SKIPPED [1] lib/sqlalchemy/testing/config.py:420: 'test/engine/test_execute.py::EngineEventsTest_sqlite+pysqlite_3_44_0::test_transactional_advanced (call)' : two-phase xact not supported by drivers or two-phase xact not supported by database or max_prepared_transactions not available or zero
  247. SKIPPED [1] lib/sqlalchemy/testing/config.py:420: 'test/engine/test_execute.py::ExecuteTest_sqlite+pysqlite_3_44_0::test_raw_python (call)' : not postgresql+psycopg and not postgresql+psycopg2 and not postgresql+psycopg2cffi and not mysql+mysqlconnector and not mysql+pymysql and not mysql+cymysql and not mariadb+mysqlconnector and not mariadb+pymysql and not mariadb+cymysql and not mssql+pymssql
  248. SKIPPED [1] lib/sqlalchemy/testing/config.py:420: 'test/engine/test_execute.py::ExecuteTest_sqlite+pysqlite_3_44_0::test_raw_sprintf (call)' : not mysql+mysqldb and not mysql+pymysql and not mysql+cymysql and not mysql+mysqlconnector and not mariadb+mysqldb and not mariadb+pymysql and not mariadb+cymysql and not mariadb+mysqlconnector and not postgresql+pg8000
  249. SKIPPED [1] lib/sqlalchemy/testing/config.py:420: 'test/engine/test_execute.py::HandleErrorTest_sqlite+pysqlite_3_44_0::test_alter_invalidate_pool_stays_true (call)' : sqlite
  250. SKIPPED [1] lib/sqlalchemy/testing/config.py:420: 'test/engine/test_execute.py::HandleErrorTest_sqlite+pysqlite_3_44_0::test_alter_invalidate_pool_to_false (call)' : sqlite
  251. SKIPPED [5] lib/sqlalchemy/testing/config.py:420: 'test.engine.test_execute.SetInputSizesTest' unsupported on any DB implementation 'sqlite(3.44.0)+pysqlite'sqlite
  252. SKIPPED [7] lib/sqlalchemy/testing/config.py:420: 'test.dialect.mysql.test_for_update.MySQLForUpdateLockingTest' unsupported on any DB implementation 'sqlite(3.44.0)+pysqlite'
  253. SKIPPED [2] lib/sqlalchemy/testing/config.py:420: 'test.dialect.mysql.test_for_update.SkipLockedTest' unsupported on any DB implementation 'sqlite(3.44.0)+pysqlite'
  254. SKIPPED [1] lib/sqlalchemy/testing/config.py:420: 'test/sql/test_from_linter.py::TestLinterRoundTrip_sqlite+pysqlite_3_44_0::test_warn_dml[False-False-delete] (call)' : Backend does not support DELETE..USING or equivalent and Backend does not support DELETE..USING or equivalent and Backend does not support DELETE..USING or equivalent and Backend does not support DELETE..USING or equivalent
  255. SKIPPED [1] lib/sqlalchemy/testing/config.py:420: 'test/sql/test_from_linter.py::TestLinterRoundTrip_sqlite+pysqlite_3_44_0::test_warn_dml[True-False-delete] (call)' : Backend does not support DELETE..USING or equivalent and Backend does not support DELETE..USING or equivalent and Backend does not support DELETE..USING or equivalent and Backend does not support DELETE..USING or equivalent
  256. SKIPPED [1] lib/sqlalchemy/testing/config.py:420: 'test/sql/test_from_linter.py::TestLinterRoundTrip_sqlite+pysqlite_3_44_0::test_warn_dml[True-True-delete] (call)' : Backend does not support DELETE..USING or equivalent and Backend does not support DELETE..USING or equivalent and Backend does not support DELETE..USING or equivalent and Backend does not support DELETE..USING or equivalent
  257. SKIPPED [45] lib/sqlalchemy/testing/config.py:420: 'test.ext.test_horizontal_shard.MultipleDialectShardTest' unsupported on any DB implementation 'sqlite(3.44.0)+pysqlite'
  258. SKIPPED [15] lib/sqlalchemy/testing/config.py:420: 'test.sql.test_identity_column.IdentityDDL' unsupported on any DB implementation 'sqlite(3.44.0)+pysqlite'not postgresql >= (10,) and not oracle >= (12,) and not mssql
  259. SKIPPED [3] lib/sqlalchemy/testing/config.py:420: 'test.ext.test_indexable.IndexPropertyArrayTest' unsupported on any DB implementation 'sqlite(3.44.0)+pysqlite'custom function
  260. SKIPPED [7] lib/sqlalchemy/testing/config.py:420: 'test.ext.test_indexable.IndexPropertyJsonTest' unsupported on any DB implementation 'sqlite(3.44.0)+pysqlite'
  261. SKIPPED [1] lib/sqlalchemy/testing/config.py:420: 'test/sql/test_insert_exec.py::IMVSentinelTest_sqlite+pysqlite_3_44_0::test_fixture_downgraded[downgrade] (call)' : not postgresql >= (13,)
  262. SKIPPED [1] lib/sqlalchemy/testing/config.py:420: 'test/sql/test_insert_exec.py::IMVSentinelTest_sqlite+pysqlite_3_44_0::test_fixture_downgraded[not_downgrade] (call)' : not postgresql >= (13,)
  263. SKIPPED [1] lib/sqlalchemy/testing/config.py:420: 'test/sql/test_insert_exec.py::IMVSentinelTest_sqlite+pysqlite_3_44_0::test_inserts_w_all_nulls[not_sort_by_parameter_order-datatype2-_exclusions_02] (call)' : custom function
  264. SKIPPED [1] lib/sqlalchemy/testing/config.py:420: 'test/sql/test_insert_exec.py::IMVSentinelTest_sqlite+pysqlite_3_44_0::test_inserts_w_all_nulls[sort_by_parameter_order-datatype2-_exclusions_02] (call)' : custom function
  265. SKIPPED [1] lib/sqlalchemy/testing/config.py:420: 'test/sql/test_insert_exec.py::IMVSentinelTest_sqlite+pysqlite_3_44_0::test_invalid_identities[not_warn_for_downgrades-not_randomize_returning-not_sort_by_parameter_order-explicit_sentinel-implicit-identity] (call)' : not postgresql >= (10,) and not oracle >= (12,) and not mssql
  266. SKIPPED [1] lib/sqlalchemy/testing/config.py:420: 'test/sql/test_insert_exec.py::IMVSentinelTest_sqlite+pysqlite_3_44_0::test_invalid_identities[not_warn_for_downgrades-not_randomize_returning-not_sort_by_parameter_order-explicit_sentinel-implicit-sequence] (call)' : no sequence support
  267. SKIPPED [1] lib/sqlalchemy/testing/config.py:420: 'test/sql/test_insert_exec.py::IMVSentinelTest_sqlite+pysqlite_3_44_0::test_invalid_identities[not_warn_for_downgrades-not_randomize_returning-not_sort_by_parameter_order-explicit_sentinel-negative-identity] (call)' : not postgresql >= (10,) and not oracle >= (12,) and not mssql
  268. SKIPPED [1] lib/sqlalchemy/testing/config.py:420: 'test/sql/test_insert_exec.py::IMVSentinelTest_sqlite+pysqlite_3_44_0::test_invalid_identities[not_warn_for_downgrades-not_randomize_returning-not_sort_by_parameter_order-explicit_sentinel-negative-sequence] (call)' : no sequence support
  269. SKIPPED [1] lib/sqlalchemy/testing/config.py:420: 'test/sql/test_insert_exec.py::IMVSentinelTest_sqlite+pysqlite_3_44_0::test_invalid_identities[not_warn_for_downgrades-not_randomize_returning-not_sort_by_parameter_order-explicit_sentinel-positive-identity] (call)' : not postgresql >= (10,) and not oracle >= (12,) and not mssql
  270. SKIPPED [1] lib/sqlalchemy/testing/config.py:420: 'test/sql/test_insert_exec.py::IMVSentinelTest_sqlite+pysqlite_3_44_0::test_invalid_identities[not_warn_for_downgrades-not_randomize_returning-not_sort_by_parameter_order-explicit_sentinel-positive-sequence] (call)' : no sequence support
  271. SKIPPED [1] lib/sqlalchemy/testing/config.py:420: 'test/sql/test_insert_exec.py::IMVSentinelTest_sqlite+pysqlite_3_44_0::test_invalid_identities[not_warn_for_downgrades-not_randomize_returning-not_sort_by_parameter_order-not_explicit_sentinel-implicit-identity] (call)' : not postgresql >= (10,) and not oracle >= (12,) and not mssql
  272. SKIPPED [1] lib/sqlalchemy/testing/config.py:420: 'test/sql/test_insert_exec.py::IMVSentinelTest_sqlite+pysqlite_3_44_0::test_invalid_identities[not_warn_for_downgrades-not_randomize_returning-not_sort_by_parameter_order-not_explicit_sentinel-implicit-sequence] (call)' : no sequence support
  273. SKIPPED [1] lib/sqlalchemy/testing/config.py:420: 'test/sql/test_insert_exec.py::IMVSentinelTest_sqlite+pysqlite_3_44_0::test_invalid_identities[not_warn_for_downgrades-not_randomize_returning-not_sort_by_parameter_order-not_explicit_sentinel-negative-identity] (call)' : not postgresql >= (10,) and not oracle >= (12,) and not mssql
  274. SKIPPED [1] lib/sqlalchemy/testing/config.py:420: 'test/sql/test_insert_exec.py::IMVSentinelTest_sqlite+pysqlite_3_44_0::test_invalid_identities[not_warn_for_downgrades-not_randomize_returning-not_sort_by_parameter_order-not_explicit_sentinel-negative-sequence] (call)' : no sequence support
  275. SKIPPED [1] lib/sqlalchemy/testing/config.py:420: 'test/sql/test_insert_exec.py::IMVSentinelTest_sqlite+pysqlite_3_44_0::test_invalid_identities[not_warn_for_downgrades-not_randomize_returning-not_sort_by_parameter_order-not_explicit_sentinel-positive-identity] (call)' : not postgresql >= (10,) and not oracle >= (12,) and not mssql
  276. SKIPPED [1] lib/sqlalchemy/testing/config.py:420: 'test/sql/test_insert_exec.py::IMVSentinelTest_sqlite+pysqlite_3_44_0::test_invalid_identities[not_warn_for_downgrades-not_randomize_returning-not_sort_by_parameter_order-not_explicit_sentinel-positive-sequence] (call)' : no sequence support
  277. SKIPPED [1] lib/sqlalchemy/testing/config.py:420: 'test/sql/test_insert_exec.py::IMVSentinelTest_sqlite+pysqlite_3_44_0::test_invalid_identities[not_warn_for_downgrades-not_randomize_returning-sort_by_parameter_order-explicit_sentinel-implicit-identity] (call)' : not postgresql >= (10,) and not oracle >= (12,) and not mssql
  278. SKIPPED [1] lib/sqlalchemy/testing/config.py:420: 'test/sql/test_insert_exec.py::IMVSentinelTest_sqlite+pysqlite_3_44_0::test_invalid_identities[not_warn_for_downgrades-not_randomize_returning-sort_by_parameter_order-explicit_sentinel-implicit-sequence] (call)' : no sequence support
  279. SKIPPED [1] lib/sqlalchemy/testing/config.py:420: 'test/sql/test_insert_exec.py::IMVSentinelTest_sqlite+pysqlite_3_44_0::test_invalid_identities[not_warn_for_downgrades-not_randomize_returning-sort_by_parameter_order-explicit_sentinel-negative-identity] (call)' : not postgresql >= (10,) and not oracle >= (12,) and not mssql
  280. SKIPPED [1] lib/sqlalchemy/testing/config.py:420: 'test/sql/test_insert_exec.py::IMVSentinelTest_sqlite+pysqlite_3_44_0::test_invalid_identities[not_warn_for_downgrades-not_randomize_returning-sort_by_parameter_order-explicit_sentinel-negative-sequence] (call)' : no sequence support
  281. SKIPPED [1] lib/sqlalchemy/testing/config.py:420: 'test/sql/test_insert_exec.py::IMVSentinelTest_sqlite+pysqlite_3_44_0::test_invalid_identities[not_warn_for_downgrades-not_randomize_returning-sort_by_parameter_order-explicit_sentinel-positive-identity] (call)' : not postgresql >= (10,) and not oracle >= (12,) and not mssql
  282. SKIPPED [1] lib/sqlalchemy/testing/config.py:420: 'test/sql/test_insert_exec.py::IMVSentinelTest_sqlite+pysqlite_3_44_0::test_invalid_identities[not_warn_for_downgrades-not_randomize_returning-sort_by_parameter_order-explicit_sentinel-positive-sequence] (call)' : no sequence support
  283. SKIPPED [1] lib/sqlalchemy/testing/config.py:420: 'test/sql/test_insert_exec.py::IMVSentinelTest_sqlite+pysqlite_3_44_0::test_invalid_identities[not_warn_for_downgrades-not_randomize_returning-sort_by_parameter_order-not_explicit_sentinel-implicit-identity] (call)' : not postgresql >= (10,) and not oracle >= (12,) and not mssql
  284. SKIPPED [1] lib/sqlalchemy/testing/config.py:420: 'test/sql/test_insert_exec.py::IMVSentinelTest_sqlite+pysqlite_3_44_0::test_invalid_identities[not_warn_for_downgrades-not_randomize_returning-sort_by_parameter_order-not_explicit_sentinel-implicit-sequence] (call)' : no sequence support
  285. SKIPPED [1] lib/sqlalchemy/testing/config.py:420: 'test/sql/test_insert_exec.py::IMVSentinelTest_sqlite+pysqlite_3_44_0::test_invalid_identities[not_warn_for_downgrades-not_randomize_returning-sort_by_parameter_order-not_explicit_sentinel-negative-identity] (call)' : not postgresql >= (10,) and not oracle >= (12,) and not mssql
  286. SKIPPED [1] lib/sqlalchemy/testing/config.py:420: 'test/sql/test_insert_exec.py::IMVSentinelTest_sqlite+pysqlite_3_44_0::test_invalid_identities[not_warn_for_downgrades-not_randomize_returning-sort_by_parameter_order-not_explicit_sentinel-negative-sequence] (call)' : no sequence support
  287. SKIPPED [1] lib/sqlalchemy/testing/config.py:420: 'test/sql/test_insert_exec.py::IMVSentinelTest_sqlite+pysqlite_3_44_0::test_invalid_identities[not_warn_for_downgrades-not_randomize_returning-sort_by_parameter_order-not_explicit_sentinel-positive-identity] (call)' : not postgresql >= (10,) and not oracle >= (12,) and not mssql
  288. SKIPPED [1] lib/sqlalchemy/testing/config.py:420: 'test/sql/test_insert_exec.py::IMVSentinelTest_sqlite+pysqlite_3_44_0::test_invalid_identities[not_warn_for_downgrades-not_randomize_returning-sort_by_parameter_order-not_explicit_sentinel-positive-sequence] (call)' : no sequence support
  289. SKIPPED [1] lib/sqlalchemy/testing/config.py:420: 'test/sql/test_insert_exec.py::IMVSentinelTest_sqlite+pysqlite_3_44_0::test_invalid_identities[not_warn_for_downgrades-randomize_returning-not_sort_by_parameter_order-explicit_sentinel-implicit-identity] (call)' : not postgresql >= (10,) and not oracle >= (12,) and not mssql
  290. SKIPPED [1] lib/sqlalchemy/testing/config.py:420: 'test/sql/test_insert_exec.py::IMVSentinelTest_sqlite+pysqlite_3_44_0::test_invalid_identities[not_warn_for_downgrades-randomize_returning-not_sort_by_parameter_order-explicit_sentinel-implicit-sequence] (call)' : no sequence support
  291. SKIPPED [1] lib/sqlalchemy/testing/config.py:420: 'test/sql/test_insert_exec.py::IMVSentinelTest_sqlite+pysqlite_3_44_0::test_invalid_identities[not_warn_for_downgrades-randomize_returning-not_sort_by_parameter_order-explicit_sentinel-negative-identity] (call)' : not postgresql >= (10,) and not oracle >= (12,) and not mssql
  292. SKIPPED [1] lib/sqlalchemy/testing/config.py:420: 'test/sql/test_insert_exec.py::IMVSentinelTest_sqlite+pysqlite_3_44_0::test_invalid_identities[not_warn_for_downgrades-randomize_returning-not_sort_by_parameter_order-explicit_sentinel-negative-sequence] (call)' : no sequence support
  293. SKIPPED [1] lib/sqlalchemy/testing/config.py:420: 'test/sql/test_insert_exec.py::IMVSentinelTest_sqlite+pysqlite_3_44_0::test_invalid_identities[not_warn_for_downgrades-randomize_returning-not_sort_by_parameter_order-explicit_sentinel-positive-identity] (call)' : not postgresql >= (10,) and not oracle >= (12,) and not mssql
  294. SKIPPED [1] lib/sqlalchemy/testing/config.py:420: 'test/sql/test_insert_exec.py::IMVSentinelTest_sqlite+pysqlite_3_44_0::test_invalid_identities[not_warn_for_downgrades-randomize_returning-not_sort_by_parameter_order-explicit_sentinel-positive-sequence] (call)' : no sequence support
  295. SKIPPED [1] lib/sqlalchemy/testing/config.py:420: 'test/sql/test_insert_exec.py::IMVSentinelTest_sqlite+pysqlite_3_44_0::test_invalid_identities[not_warn_for_downgrades-randomize_returning-not_sort_by_parameter_order-not_explicit_sentinel-implicit-identity] (call)' : not postgresql >= (10,) and not oracle >= (12,) and not mssql
  296. SKIPPED [1] lib/sqlalchemy/testing/config.py:420: 'test/sql/test_insert_exec.py::IMVSentinelTest_sqlite+pysqlite_3_44_0::test_invalid_identities[not_warn_for_downgrades-randomize_returning-not_sort_by_parameter_order-not_explicit_sentinel-implicit-sequence] (call)' : no sequence support
  297. SKIPPED [1] lib/sqlalchemy/testing/config.py:420: 'test/sql/test_insert_exec.py::IMVSentinelTest_sqlite+pysqlite_3_44_0::test_invalid_identities[not_warn_for_downgrades-randomize_returning-not_sort_by_parameter_order-not_explicit_sentinel-negative-identity] (call)' : not postgresql >= (10,) and not oracle >= (12,) and not mssql
  298. SKIPPED [1] lib/sqlalchemy/testing/config.py:420: 'test/sql/test_insert_exec.py::IMVSentinelTest_sqlite+pysqlite_3_44_0::test_invalid_identities[not_warn_for_downgrades-randomize_returning-not_sort_by_parameter_order-not_explicit_sentinel-negative-sequence] (call)' : no sequence support
  299. SKIPPED [1] lib/sqlalchemy/testing/config.py:420: 'test/sql/test_insert_exec.py::IMVSentinelTest_sqlite+pysqlite_3_44_0::test_invalid_identities[not_warn_for_downgrades-randomize_returning-not_sort_by_parameter_order-not_explicit_sentinel-positive-identity] (call)' : not postgresql >= (10,) and not oracle >= (12,) and not mssql
  300. SKIPPED [1] lib/sqlalchemy/testing/config.py:420: 'test/sql/test_insert_exec.py::IMVSentinelTest_sqlite+pysqlite_3_44_0::test_invalid_identities[not_warn_for_downgrades-randomize_returning-not_sort_by_parameter_order-not_explicit_sentinel-positive-sequence] (call)' : no sequence support
  301. SKIPPED [1] lib/sqlalchemy/testing/config.py:420: 'test/sql/test_insert_exec.py::IMVSentinelTest_sqlite+pysqlite_3_44_0::test_invalid_identities[not_warn_for_downgrades-randomize_returning-sort_by_parameter_order-explicit_sentinel-implicit-identity] (call)' : not postgresql >= (10,) and not oracle >= (12,) and not mssql
  302. SKIPPED [1] lib/sqlalchemy/testing/config.py:420: 'test/sql/test_insert_exec.py::IMVSentinelTest_sqlite+pysqlite_3_44_0::test_invalid_identities[not_warn_for_downgrades-randomize_returning-sort_by_parameter_order-explicit_sentinel-implicit-sequence] (call)' : no sequence support
  303. SKIPPED [1] lib/sqlalchemy/testing/config.py:420: 'test/sql/test_insert_exec.py::IMVSentinelTest_sqlite+pysqlite_3_44_0::test_invalid_identities[not_warn_for_downgrades-randomize_returning-sort_by_parameter_order-explicit_sentinel-negative-identity] (call)' : not postgresql >= (10,) and not oracle >= (12,) and not mssql
  304. SKIPPED [1] lib/sqlalchemy/testing/config.py:420: 'test/sql/test_insert_exec.py::IMVSentinelTest_sqlite+pysqlite_3_44_0::test_invalid_identities[not_warn_for_downgrades-randomize_returning-sort_by_parameter_order-explicit_sentinel-negative-sequence] (call)' : no sequence support
  305. SKIPPED [1] lib/sqlalchemy/testing/config.py:420: 'test/sql/test_insert_exec.py::IMVSentinelTest_sqlite+pysqlite_3_44_0::test_invalid_identities[not_warn_for_downgrades-randomize_returning-sort_by_parameter_order-explicit_sentinel-positive-identity] (call)' : not postgresql >= (10,) and not oracle >= (12,) and not mssql
  306. SKIPPED [1] lib/sqlalchemy/testing/config.py:420: 'test/sql/test_insert_exec.py::IMVSentinelTest_sqlite+pysqlite_3_44_0::test_invalid_identities[not_warn_for_downgrades-randomize_returning-sort_by_parameter_order-explicit_sentinel-positive-sequence] (call)' : no sequence support
  307. SKIPPED [1] lib/sqlalchemy/testing/config.py:420: 'test/sql/test_insert_exec.py::IMVSentinelTest_sqlite+pysqlite_3_44_0::test_invalid_identities[not_warn_for_downgrades-randomize_returning-sort_by_parameter_order-not_explicit_sentinel-implicit-identity] (call)' : not postgresql >= (10,) and not oracle >= (12,) and not mssql
  308. SKIPPED [1] lib/sqlalchemy/testing/config.py:420: 'test/sql/test_insert_exec.py::IMVSentinelTest_sqlite+pysqlite_3_44_0::test_invalid_identities[not_warn_for_downgrades-randomize_returning-sort_by_parameter_order-not_explicit_sentinel-implicit-sequence] (call)' : no sequence support
  309. SKIPPED [1] lib/sqlalchemy/testing/config.py:420: 'test/sql/test_insert_exec.py::IMVSentinelTest_sqlite+pysqlite_3_44_0::test_invalid_identities[not_warn_for_downgrades-randomize_returning-sort_by_parameter_order-not_explicit_sentinel-negative-identity] (call)' : not postgresql >= (10,) and not oracle >= (12,) and not mssql
  310. SKIPPED [1] lib/sqlalchemy/testing/config.py:420: 'test/sql/test_insert_exec.py::IMVSentinelTest_sqlite+pysqlite_3_44_0::test_invalid_identities[not_warn_for_downgrades-randomize_returning-sort_by_parameter_order-not_explicit_sentinel-negative-sequence] (call)' : no sequence support
  311. SKIPPED [1] lib/sqlalchemy/testing/config.py:420: 'test/sql/test_insert_exec.py::IMVSentinelTest_sqlite+pysqlite_3_44_0::test_invalid_identities[not_warn_for_downgrades-randomize_returning-sort_by_parameter_order-not_explicit_sentinel-positive-identity] (call)' : not postgresql >= (10,) and not oracle >= (12,) and not mssql
  312. SKIPPED [1] lib/sqlalchemy/testing/config.py:420: 'test/sql/test_insert_exec.py::IMVSentinelTest_sqlite+pysqlite_3_44_0::test_invalid_identities[not_warn_for_downgrades-randomize_returning-sort_by_parameter_order-not_explicit_sentinel-positive-sequence] (call)' : no sequence support
  313. SKIPPED [1] lib/sqlalchemy/testing/config.py:420: 'test/sql/test_insert_exec.py::IMVSentinelTest_sqlite+pysqlite_3_44_0::test_invalid_identities[warn_for_downgrades-not_randomize_returning-not_sort_by_parameter_order-explicit_sentinel-implicit-identity] (call)' : not postgresql >= (10,) and not oracle >= (12,) and not mssql
  314. SKIPPED [1] lib/sqlalchemy/testing/config.py:420: 'test/sql/test_insert_exec.py::IMVSentinelTest_sqlite+pysqlite_3_44_0::test_invalid_identities[warn_for_downgrades-not_randomize_returning-not_sort_by_parameter_order-explicit_sentinel-implicit-sequence] (call)' : no sequence support
  315. SKIPPED [1] lib/sqlalchemy/testing/config.py:420: 'test/sql/test_insert_exec.py::IMVSentinelTest_sqlite+pysqlite_3_44_0::test_invalid_identities[warn_for_downgrades-not_randomize_returning-not_sort_by_parameter_order-explicit_sentinel-negative-identity] (call)' : not postgresql >= (10,) and not oracle >= (12,) and not mssql
  316. SKIPPED [1] lib/sqlalchemy/testing/config.py:420: 'test/sql/test_insert_exec.py::IMVSentinelTest_sqlite+pysqlite_3_44_0::test_invalid_identities[warn_for_downgrades-not_randomize_returning-not_sort_by_parameter_order-explicit_sentinel-negative-sequence] (call)' : no sequence support
  317. SKIPPED [1] lib/sqlalchemy/testing/config.py:420: 'test/sql/test_insert_exec.py::IMVSentinelTest_sqlite+pysqlite_3_44_0::test_invalid_identities[warn_for_downgrades-not_randomize_returning-not_sort_by_parameter_order-explicit_sentinel-positive-identity] (call)' : not postgresql >= (10,) and not oracle >= (12,) and not mssql
  318. SKIPPED [1] lib/sqlalchemy/testing/config.py:420: 'test/sql/test_insert_exec.py::IMVSentinelTest_sqlite+pysqlite_3_44_0::test_invalid_identities[warn_for_downgrades-not_randomize_returning-not_sort_by_parameter_order-explicit_sentinel-positive-sequence] (call)' : no sequence support
  319. SKIPPED [1] lib/sqlalchemy/testing/config.py:420: 'test/sql/test_insert_exec.py::IMVSentinelTest_sqlite+pysqlite_3_44_0::test_invalid_identities[warn_for_downgrades-not_randomize_returning-not_sort_by_parameter_order-not_explicit_sentinel-implicit-identity] (call)' : not postgresql >= (10,) and not oracle >= (12,) and not mssql
  320. SKIPPED [1] lib/sqlalchemy/testing/config.py:420: 'test/sql/test_insert_exec.py::IMVSentinelTest_sqlite+pysqlite_3_44_0::test_invalid_identities[warn_for_downgrades-not_randomize_returning-not_sort_by_parameter_order-not_explicit_sentinel-implicit-sequence] (call)' : no sequence support
  321. SKIPPED [1] lib/sqlalchemy/testing/config.py:420: 'test/sql/test_insert_exec.py::IMVSentinelTest_sqlite+pysqlite_3_44_0::test_invalid_identities[warn_for_downgrades-not_randomize_returning-not_sort_by_parameter_order-not_explicit_sentinel-negative-identity] (call)' : not postgresql >= (10,) and not oracle >= (12,) and not mssql
  322. SKIPPED [1] lib/sqlalchemy/testing/config.py:420: 'test/sql/test_insert_exec.py::IMVSentinelTest_sqlite+pysqlite_3_44_0::test_invalid_identities[warn_for_downgrades-not_randomize_returning-not_sort_by_parameter_order-not_explicit_sentinel-negative-sequence] (call)' : no sequence support
  323. SKIPPED [1] lib/sqlalchemy/testing/config.py:420: 'test/sql/test_insert_exec.py::IMVSentinelTest_sqlite+pysqlite_3_44_0::test_invalid_identities[warn_for_downgrades-not_randomize_returning-not_sort_by_parameter_order-not_explicit_sentinel-positive-identity] (call)' : not postgresql >= (10,) and not oracle >= (12,) and not mssql
  324. SKIPPED [1] lib/sqlalchemy/testing/config.py:420: 'test/sql/test_insert_exec.py::IMVSentinelTest_sqlite+pysqlite_3_44_0::test_invalid_identities[warn_for_downgrades-not_randomize_returning-not_sort_by_parameter_order-not_explicit_sentinel-positive-sequence] (call)' : no sequence support
  325. SKIPPED [1] lib/sqlalchemy/testing/config.py:420: 'test/sql/test_insert_exec.py::IMVSentinelTest_sqlite+pysqlite_3_44_0::test_invalid_identities[warn_for_downgrades-not_randomize_returning-sort_by_parameter_order-explicit_sentinel-implicit-identity] (call)' : not postgresql >= (10,) and not oracle >= (12,) and not mssql
  326. SKIPPED [1] lib/sqlalchemy/testing/config.py:420: 'test/sql/test_insert_exec.py::IMVSentinelTest_sqlite+pysqlite_3_44_0::test_invalid_identities[warn_for_downgrades-not_randomize_returning-sort_by_parameter_order-explicit_sentinel-implicit-sequence] (call)' : no sequence support
  327. SKIPPED [1] lib/sqlalchemy/testing/config.py:420: 'test/sql/test_insert_exec.py::IMVSentinelTest_sqlite+pysqlite_3_44_0::test_invalid_identities[warn_for_downgrades-not_randomize_returning-sort_by_parameter_order-explicit_sentinel-negative-identity] (call)' : not postgresql >= (10,) and not oracle >= (12,) and not mssql
  328. SKIPPED [1] lib/sqlalchemy/testing/config.py:420: 'test/sql/test_insert_exec.py::IMVSentinelTest_sqlite+pysqlite_3_44_0::test_invalid_identities[warn_for_downgrades-not_randomize_returning-sort_by_parameter_order-explicit_sentinel-negative-sequence] (call)' : no sequence support
  329. SKIPPED [1] lib/sqlalchemy/testing/config.py:420: 'test/sql/test_insert_exec.py::IMVSentinelTest_sqlite+pysqlite_3_44_0::test_invalid_identities[warn_for_downgrades-not_randomize_returning-sort_by_parameter_order-explicit_sentinel-positive-identity] (call)' : not postgresql >= (10,) and not oracle >= (12,) and not mssql
  330. SKIPPED [1] lib/sqlalchemy/testing/config.py:420: 'test/sql/test_insert_exec.py::IMVSentinelTest_sqlite+pysqlite_3_44_0::test_invalid_identities[warn_for_downgrades-not_randomize_returning-sort_by_parameter_order-explicit_sentinel-positive-sequence] (call)' : no sequence support
  331. SKIPPED [1] lib/sqlalchemy/testing/config.py:420: 'test/sql/test_insert_exec.py::IMVSentinelTest_sqlite+pysqlite_3_44_0::test_invalid_identities[warn_for_downgrades-not_randomize_returning-sort_by_parameter_order-not_explicit_sentinel-implicit-identity] (call)' : not postgresql >= (10,) and not oracle >= (12,) and not mssql
  332. SKIPPED [1] lib/sqlalchemy/testing/config.py:420: 'test/sql/test_insert_exec.py::IMVSentinelTest_sqlite+pysqlite_3_44_0::test_invalid_identities[warn_for_downgrades-not_randomize_returning-sort_by_parameter_order-not_explicit_sentinel-implicit-sequence] (call)' : no sequence support
  333. SKIPPED [1] lib/sqlalchemy/testing/config.py:420: 'test/sql/test_insert_exec.py::IMVSentinelTest_sqlite+pysqlite_3_44_0::test_invalid_identities[warn_for_downgrades-not_randomize_returning-sort_by_parameter_order-not_explicit_sentinel-negative-identity] (call)' : not postgresql >= (10,) and not oracle >= (12,) and not mssql
  334. SKIPPED [1] lib/sqlalchemy/testing/config.py:420: 'test/sql/test_insert_exec.py::IMVSentinelTest_sqlite+pysqlite_3_44_0::test_invalid_identities[warn_for_downgrades-not_randomize_returning-sort_by_parameter_order-not_explicit_sentinel-negative-sequence] (call)' : no sequence support
  335. SKIPPED [1] lib/sqlalchemy/testing/config.py:420: 'test/sql/test_insert_exec.py::IMVSentinelTest_sqlite+pysqlite_3_44_0::test_invalid_identities[warn_for_downgrades-not_randomize_returning-sort_by_parameter_order-not_explicit_sentinel-positive-identity] (call)' : not postgresql >= (10,) and not oracle >= (12,) and not mssql
  336. SKIPPED [1] lib/sqlalchemy/testing/config.py:420: 'test/sql/test_insert_exec.py::IMVSentinelTest_sqlite+pysqlite_3_44_0::test_invalid_identities[warn_for_downgrades-not_randomize_returning-sort_by_parameter_order-not_explicit_sentinel-positive-sequence] (call)' : no sequence support
  337. SKIPPED [1] lib/sqlalchemy/testing/config.py:420: 'test/sql/test_insert_exec.py::IMVSentinelTest_sqlite+pysqlite_3_44_0::test_invalid_identities[warn_for_downgrades-randomize_returning-not_sort_by_parameter_order-explicit_sentinel-implicit-identity] (call)' : not postgresql >= (10,) and not oracle >= (12,) and not mssql
  338. SKIPPED [1] lib/sqlalchemy/testing/config.py:420: 'test/sql/test_insert_exec.py::IMVSentinelTest_sqlite+pysqlite_3_44_0::test_invalid_identities[warn_for_downgrades-randomize_returning-not_sort_by_parameter_order-explicit_sentinel-implicit-sequence] (call)' : no sequence support
  339. SKIPPED [1] lib/sqlalchemy/testing/config.py:420: 'test/sql/test_insert_exec.py::IMVSentinelTest_sqlite+pysqlite_3_44_0::test_invalid_identities[warn_for_downgrades-randomize_returning-not_sort_by_parameter_order-explicit_sentinel-negative-identity] (call)' : not postgresql >= (10,) and not oracle >= (12,) and not mssql
  340. SKIPPED [1] lib/sqlalchemy/testing/config.py:420: 'test/sql/test_insert_exec.py::IMVSentinelTest_sqlite+pysqlite_3_44_0::test_invalid_identities[warn_for_downgrades-randomize_returning-not_sort_by_parameter_order-explicit_sentinel-negative-sequence] (call)' : no sequence support
  341. SKIPPED [1] lib/sqlalchemy/testing/config.py:420: 'test/sql/test_insert_exec.py::IMVSentinelTest_sqlite+pysqlite_3_44_0::test_invalid_identities[warn_for_downgrades-randomize_returning-not_sort_by_parameter_order-explicit_sentinel-positive-identity] (call)' : not postgresql >= (10,) and not oracle >= (12,) and not mssql
  342. SKIPPED [1] lib/sqlalchemy/testing/config.py:420: 'test/sql/test_insert_exec.py::IMVSentinelTest_sqlite+pysqlite_3_44_0::test_invalid_identities[warn_for_downgrades-randomize_returning-not_sort_by_parameter_order-explicit_sentinel-positive-sequence] (call)' : no sequence support
  343. SKIPPED [1] lib/sqlalchemy/testing/config.py:420: 'test/sql/test_insert_exec.py::IMVSentinelTest_sqlite+pysqlite_3_44_0::test_invalid_identities[warn_for_downgrades-randomize_returning-not_sort_by_parameter_order-not_explicit_sentinel-implicit-identity] (call)' : not postgresql >= (10,) and not oracle >= (12,) and not mssql
  344. SKIPPED [1] lib/sqlalchemy/testing/config.py:420: 'test/sql/test_insert_exec.py::IMVSentinelTest_sqlite+pysqlite_3_44_0::test_invalid_identities[warn_for_downgrades-randomize_returning-not_sort_by_parameter_order-not_explicit_sentinel-implicit-sequence] (call)' : no sequence support
  345. SKIPPED [1] lib/sqlalchemy/testing/config.py:420: 'test/sql/test_insert_exec.py::IMVSentinelTest_sqlite+pysqlite_3_44_0::test_invalid_identities[warn_for_downgrades-randomize_returning-not_sort_by_parameter_order-not_explicit_sentinel-negative-identity] (call)' : not postgresql >= (10,) and not oracle >= (12,) and not mssql
  346. SKIPPED [1] lib/sqlalchemy/testing/config.py:420: 'test/sql/test_insert_exec.py::IMVSentinelTest_sqlite+pysqlite_3_44_0::test_invalid_identities[warn_for_downgrades-randomize_returning-not_sort_by_parameter_order-not_explicit_sentinel-negative-sequence] (call)' : no sequence support
  347. SKIPPED [1] lib/sqlalchemy/testing/config.py:420: 'test/sql/test_insert_exec.py::IMVSentinelTest_sqlite+pysqlite_3_44_0::test_invalid_identities[warn_for_downgrades-randomize_returning-not_sort_by_parameter_order-not_explicit_sentinel-positive-identity] (call)' : not postgresql >= (10,) and not oracle >= (12,) and not mssql
  348. SKIPPED [1] lib/sqlalchemy/testing/config.py:420: 'test/sql/test_insert_exec.py::IMVSentinelTest_sqlite+pysqlite_3_44_0::test_invalid_identities[warn_for_downgrades-randomize_returning-not_sort_by_parameter_order-not_explicit_sentinel-positive-sequence] (call)' : no sequence support
  349. SKIPPED [1] lib/sqlalchemy/testing/config.py:420: 'test/sql/test_insert_exec.py::IMVSentinelTest_sqlite+pysqlite_3_44_0::test_invalid_identities[warn_for_downgrades-randomize_returning-sort_by_parameter_order-explicit_sentinel-implicit-identity] (call)' : not postgresql >= (10,) and not oracle >= (12,) and not mssql
  350. SKIPPED [1] lib/sqlalchemy/testing/config.py:420: 'test/sql/test_insert_exec.py::IMVSentinelTest_sqlite+pysqlite_3_44_0::test_invalid_identities[warn_for_downgrades-randomize_returning-sort_by_parameter_order-explicit_sentinel-implicit-sequence] (call)' : no sequence support
  351. SKIPPED [1] lib/sqlalchemy/testing/config.py:420: 'test/sql/test_insert_exec.py::IMVSentinelTest_sqlite+pysqlite_3_44_0::test_invalid_identities[warn_for_downgrades-randomize_returning-sort_by_parameter_order-explicit_sentinel-negative-identity] (call)' : not postgresql >= (10,) and not oracle >= (12,) and not mssql
  352. SKIPPED [1] lib/sqlalchemy/testing/config.py:420: 'test/sql/test_insert_exec.py::IMVSentinelTest_sqlite+pysqlite_3_44_0::test_invalid_identities[warn_for_downgrades-randomize_returning-sort_by_parameter_order-explicit_sentinel-negative-sequence] (call)' : no sequence support
  353. SKIPPED [1] lib/sqlalchemy/testing/config.py:420: 'test/sql/test_insert_exec.py::IMVSentinelTest_sqlite+pysqlite_3_44_0::test_invalid_identities[warn_for_downgrades-randomize_returning-sort_by_parameter_order-explicit_sentinel-positive-identity] (call)' : not postgresql >= (10,) and not oracle >= (12,) and not mssql
  354. SKIPPED [1] lib/sqlalchemy/testing/config.py:420: 'test/sql/test_insert_exec.py::IMVSentinelTest_sqlite+pysqlite_3_44_0::test_invalid_identities[warn_for_downgrades-randomize_returning-sort_by_parameter_order-explicit_sentinel-positive-sequence] (call)' : no sequence support
  355. SKIPPED [1] lib/sqlalchemy/testing/config.py:420: 'test/sql/test_insert_exec.py::IMVSentinelTest_sqlite+pysqlite_3_44_0::test_invalid_identities[warn_for_downgrades-randomize_returning-sort_by_parameter_order-not_explicit_sentinel-implicit-identity] (call)' : not postgresql >= (10,) and not oracle >= (12,) and not mssql
  356. SKIPPED [1] lib/sqlalchemy/testing/config.py:420: 'test/sql/test_insert_exec.py::IMVSentinelTest_sqlite+pysqlite_3_44_0::test_invalid_identities[warn_for_downgrades-randomize_returning-sort_by_parameter_order-not_explicit_sentinel-implicit-sequence] (call)' : no sequence support
  357. SKIPPED [1] lib/sqlalchemy/testing/config.py:420: 'test/sql/test_insert_exec.py::IMVSentinelTest_sqlite+pysqlite_3_44_0::test_invalid_identities[warn_for_downgrades-randomize_returning-sort_by_parameter_order-not_explicit_sentinel-negative-identity] (call)' : not postgresql >= (10,) and not oracle >= (12,) and not mssql
  358. SKIPPED [1] lib/sqlalchemy/testing/config.py:420: 'test/sql/test_insert_exec.py::IMVSentinelTest_sqlite+pysqlite_3_44_0::test_invalid_identities[warn_for_downgrades-randomize_returning-sort_by_parameter_order-not_explicit_sentinel-negative-sequence] (call)' : no sequence support
  359. SKIPPED [1] lib/sqlalchemy/testing/config.py:420: 'test/sql/test_insert_exec.py::IMVSentinelTest_sqlite+pysqlite_3_44_0::test_invalid_identities[warn_for_downgrades-randomize_returning-sort_by_parameter_order-not_explicit_sentinel-positive-identity] (call)' : not postgresql >= (10,) and not oracle >= (12,) and not mssql
  360. SKIPPED [1] lib/sqlalchemy/testing/config.py:420: 'test/sql/test_insert_exec.py::IMVSentinelTest_sqlite+pysqlite_3_44_0::test_invalid_identities[warn_for_downgrades-randomize_returning-sort_by_parameter_order-not_explicit_sentinel-positive-sequence] (call)' : no sequence support
  361. SKIPPED [1] lib/sqlalchemy/testing/config.py:420: 'test/sql/test_insert_exec.py::IMVSentinelTest_sqlite+pysqlite_3_44_0::test_no_pk[not_randomize_returning-not_sort_by_parameter_order-not_warn_for_downgrades-set_identity-add_sentinel] (call)' : not postgresql >= (10,) and not oracle >= (12,) and not mssql
  362. SKIPPED [1] lib/sqlalchemy/testing/config.py:420: 'test/sql/test_insert_exec.py::IMVSentinelTest_sqlite+pysqlite_3_44_0::test_no_pk[not_randomize_returning-not_sort_by_parameter_order-not_warn_for_downgrades-set_identity-not_add_sentinel] (call)' : not postgresql >= (10,) and not oracle >= (12,) and not mssql
  363. SKIPPED [1] lib/sqlalchemy/testing/config.py:420: 'test/sql/test_insert_exec.py::IMVSentinelTest_sqlite+pysqlite_3_44_0::test_no_pk[not_randomize_returning-not_sort_by_parameter_order-warn_for_downgrades-set_identity-add_sentinel] (call)' : not postgresql >= (10,) and not oracle >= (12,) and not mssql
  364. SKIPPED [1] lib/sqlalchemy/testing/config.py:420: 'test/sql/test_insert_exec.py::IMVSentinelTest_sqlite+pysqlite_3_44_0::test_no_pk[not_randomize_returning-not_sort_by_parameter_order-warn_for_downgrades-set_identity-not_add_sentinel] (call)' : not postgresql >= (10,) and not oracle >= (12,) and not mssql
  365. SKIPPED [1] lib/sqlalchemy/testing/config.py:420: 'test/sql/test_insert_exec.py::IMVSentinelTest_sqlite+pysqlite_3_44_0::test_no_pk[not_randomize_returning-sort_by_parameter_order-not_warn_for_downgrades-set_identity-add_sentinel] (call)' : not postgresql >= (10,) and not oracle >= (12,) and not mssql
  366. SKIPPED [1] lib/sqlalchemy/testing/config.py:420: 'test/sql/test_insert_exec.py::IMVSentinelTest_sqlite+pysqlite_3_44_0::test_no_pk[not_randomize_returning-sort_by_parameter_order-not_warn_for_downgrades-set_identity-not_add_sentinel] (call)' : not postgresql >= (10,) and not oracle >= (12,) and not mssql
  367. SKIPPED [1] lib/sqlalchemy/testing/config.py:420: 'test/sql/test_insert_exec.py::IMVSentinelTest_sqlite+pysqlite_3_44_0::test_no_pk[not_randomize_returning-sort_by_parameter_order-warn_for_downgrades-set_identity-add_sentinel] (call)' : not postgresql >= (10,) and not oracle >= (12,) and not mssql
  368. SKIPPED [1] lib/sqlalchemy/testing/config.py:420: 'test/sql/test_insert_exec.py::IMVSentinelTest_sqlite+pysqlite_3_44_0::test_no_pk[not_randomize_returning-sort_by_parameter_order-warn_for_downgrades-set_identity-not_add_sentinel] (call)' : not postgresql >= (10,) and not oracle >= (12,) and not mssql
  369. SKIPPED [1] lib/sqlalchemy/testing/config.py:420: 'test/sql/test_insert_exec.py::IMVSentinelTest_sqlite+pysqlite_3_44_0::test_no_pk[randomize_returning-not_sort_by_parameter_order-not_warn_for_downgrades-set_identity-add_sentinel] (call)' : not postgresql >= (10,) and not oracle >= (12,) and not mssql
  370. SKIPPED [1] lib/sqlalchemy/testing/config.py:420: 'test/sql/test_insert_exec.py::IMVSentinelTest_sqlite+pysqlite_3_44_0::test_no_pk[randomize_returning-not_sort_by_parameter_order-not_warn_for_downgrades-set_identity-not_add_sentinel] (call)' : not postgresql >= (10,) and not oracle >= (12,) and not mssql
  371. SKIPPED [1] lib/sqlalchemy/testing/config.py:420: 'test/sql/test_insert_exec.py::IMVSentinelTest_sqlite+pysqlite_3_44_0::test_no_pk[randomize_returning-not_sort_by_parameter_order-warn_for_downgrades-set_identity-add_sentinel] (call)' : not postgresql >= (10,) and not oracle >= (12,) and not mssql
  372. SKIPPED [1] lib/sqlalchemy/testing/config.py:420: 'test/sql/test_insert_exec.py::IMVSentinelTest_sqlite+pysqlite_3_44_0::test_no_pk[randomize_returning-not_sort_by_parameter_order-warn_for_downgrades-set_identity-not_add_sentinel] (call)' : not postgresql >= (10,) and not oracle >= (12,) and not mssql
  373. SKIPPED [1] lib/sqlalchemy/testing/config.py:420: 'test/sql/test_insert_exec.py::IMVSentinelTest_sqlite+pysqlite_3_44_0::test_no_pk[randomize_returning-sort_by_parameter_order-not_warn_for_downgrades-set_identity-add_sentinel] (call)' : not postgresql >= (10,) and not oracle >= (12,) and not mssql
  374. SKIPPED [1] lib/sqlalchemy/testing/config.py:420: 'test/sql/test_insert_exec.py::IMVSentinelTest_sqlite+pysqlite_3_44_0::test_no_pk[randomize_returning-sort_by_parameter_order-not_warn_for_downgrades-set_identity-not_add_sentinel] (call)' : not postgresql >= (10,) and not oracle >= (12,) and not mssql
  375. SKIPPED [1] lib/sqlalchemy/testing/config.py:420: 'test/sql/test_insert_exec.py::IMVSentinelTest_sqlite+pysqlite_3_44_0::test_no_pk[randomize_returning-sort_by_parameter_order-warn_for_downgrades-set_identity-add_sentinel] (call)' : not postgresql >= (10,) and not oracle >= (12,) and not mssql
  376. SKIPPED [1] lib/sqlalchemy/testing/config.py:420: 'test/sql/test_insert_exec.py::IMVSentinelTest_sqlite+pysqlite_3_44_0::test_no_pk[randomize_returning-sort_by_parameter_order-warn_for_downgrades-set_identity-not_add_sentinel] (call)' : not postgresql >= (10,) and not oracle >= (12,) and not mssql
  377. SKIPPED [1] lib/sqlalchemy/testing/config.py:420: 'test/sql/test_insert_exec.py::IMVSentinelTest_sqlite+pysqlite_3_44_0::test_no_sentinel_on_non_int_ss_function[not_sort_by_parameter_order-add_insert_sentinel-client_side] (call)' : not postgresql >= (13,)
  378. SKIPPED [1] lib/sqlalchemy/testing/config.py:420: 'test/sql/test_insert_exec.py::IMVSentinelTest_sqlite+pysqlite_3_44_0::test_no_sentinel_on_non_int_ss_function[not_sort_by_parameter_order-add_insert_sentinel-server_side] (call)' : not postgresql >= (13,)
  379. SKIPPED [1] lib/sqlalchemy/testing/config.py:420: 'test/sql/test_insert_exec.py::IMVSentinelTest_sqlite+pysqlite_3_44_0::test_no_sentinel_on_non_int_ss_function[not_sort_by_parameter_order-not_add_insert_sentinel-client_side] (call)' : not postgresql >= (13,)
  380. SKIPPED [1] lib/sqlalchemy/testing/config.py:420: 'test/sql/test_insert_exec.py::IMVSentinelTest_sqlite+pysqlite_3_44_0::test_no_sentinel_on_non_int_ss_function[not_sort_by_parameter_order-not_add_insert_sentinel-server_side] (call)' : not postgresql >= (13,)
  381. SKIPPED [1] lib/sqlalchemy/testing/config.py:420: 'test/sql/test_insert_exec.py::IMVSentinelTest_sqlite+pysqlite_3_44_0::test_no_sentinel_on_non_int_ss_function[sort_by_parameter_order-add_insert_sentinel-client_side] (call)' : not postgresql >= (13,)
  382. SKIPPED [1] lib/sqlalchemy/testing/config.py:420: 'test/sql/test_insert_exec.py::IMVSentinelTest_sqlite+pysqlite_3_44_0::test_no_sentinel_on_non_int_ss_function[sort_by_parameter_order-add_insert_sentinel-server_side] (call)' : not postgresql >= (13,)
  383. SKIPPED [1] lib/sqlalchemy/testing/config.py:420: 'test/sql/test_insert_exec.py::IMVSentinelTest_sqlite+pysqlite_3_44_0::test_no_sentinel_on_non_int_ss_function[sort_by_parameter_order-not_add_insert_sentinel-client_side] (call)' : not postgresql >= (13,)
  384. SKIPPED [1] lib/sqlalchemy/testing/config.py:420: 'test/sql/test_insert_exec.py::IMVSentinelTest_sqlite+pysqlite_3_44_0::test_no_sentinel_on_non_int_ss_function[sort_by_parameter_order-not_add_insert_sentinel-server_side] (call)' : not postgresql >= (13,)
  385. SKIPPED [1] lib/sqlalchemy/testing/config.py:420: 'test/sql/test_insert_exec.py::IMVSentinelTest_sqlite+pysqlite_3_44_0::test_sentinel_col_configurations[not_sort_by_parameter_order-not_randomize_returning-default_string_uuid-identity] (call)' : not postgresql >= (10,) and not oracle >= (12,) and not mssql
  386. SKIPPED [1] lib/sqlalchemy/testing/config.py:420: 'test/sql/test_insert_exec.py::IMVSentinelTest_sqlite+pysqlite_3_44_0::test_sentinel_col_configurations[not_sort_by_parameter_order-not_randomize_returning-default_string_uuid-sequence] (call)' : no sequence support
  387. SKIPPED [1] lib/sqlalchemy/testing/config.py:420: 'test/sql/test_insert_exec.py::IMVSentinelTest_sqlite+pysqlite_3_44_0::test_sentinel_col_configurations[not_sort_by_parameter_order-not_randomize_returning-default_uuid-identity] (call)' : not postgresql >= (10,) and not oracle >= (12,) and not mssql
  388. SKIPPED [1] lib/sqlalchemy/testing/config.py:420: 'test/sql/test_insert_exec.py::IMVSentinelTest_sqlite+pysqlite_3_44_0::test_sentinel_col_configurations[not_sort_by_parameter_order-not_randomize_returning-default_uuid-sequence] (call)' : no sequence support
  389. SKIPPED [1] lib/sqlalchemy/testing/config.py:420: 'test/sql/test_insert_exec.py::IMVSentinelTest_sqlite+pysqlite_3_44_0::test_sentinel_col_configurations[not_sort_by_parameter_order-not_randomize_returning-explicit-identity] (call)' : not postgresql >= (10,) and not oracle >= (12,) and not mssql
  390. SKIPPED [1] lib/sqlalchemy/testing/config.py:420: 'test/sql/test_insert_exec.py::IMVSentinelTest_sqlite+pysqlite_3_44_0::test_sentinel_col_configurations[not_sort_by_parameter_order-not_randomize_returning-explicit-sequence] (call)' : no sequence support
  391. SKIPPED [1] lib/sqlalchemy/testing/config.py:420: 'test/sql/test_insert_exec.py::IMVSentinelTest_sqlite+pysqlite_3_44_0::test_sentinel_col_configurations[not_sort_by_parameter_order-not_randomize_returning-explicit_but_nullable-identity] (call)' : not postgresql >= (10,) and not oracle >= (12,) and not mssql
  392. SKIPPED [1] lib/sqlalchemy/testing/config.py:420: 'test/sql/test_insert_exec.py::IMVSentinelTest_sqlite+pysqlite_3_44_0::test_sentinel_col_configurations[not_sort_by_parameter_order-not_randomize_returning-explicit_but_nullable-sequence] (call)' : no sequence support
  393. SKIPPED [1] lib/sqlalchemy/testing/config.py:420: 'test/sql/test_insert_exec.py::IMVSentinelTest_sqlite+pysqlite_3_44_0::test_sentinel_col_configurations[not_sort_by_parameter_order-not_randomize_returning-identity-identity] (call)' : not postgresql >= (10,) and not oracle >= (12,) and not mssql
  394. SKIPPED [1] lib/sqlalchemy/testing/config.py:420: 'test/sql/test_insert_exec.py::IMVSentinelTest_sqlite+pysqlite_3_44_0::test_sentinel_col_configurations[not_sort_by_parameter_order-not_randomize_returning-identity-plain_autoinc] (call)' : not postgresql >= (10,)
  395. SKIPPED [1] lib/sqlalchemy/testing/config.py:420: 'test/sql/test_insert_exec.py::IMVSentinelTest_sqlite+pysqlite_3_44_0::test_sentinel_col_configurations[not_sort_by_parameter_order-not_randomize_returning-identity-sequence] (call)' : no sequence support
  396. SKIPPED [1] lib/sqlalchemy/testing/config.py:420: 'test/sql/test_insert_exec.py::IMVSentinelTest_sqlite+pysqlite_3_44_0::test_sentinel_col_configurations[not_sort_by_parameter_order-not_randomize_returning-implicit_not_omitted-identity] (call)' : not postgresql >= (10,) and not oracle >= (12,) and not mssql
  397. SKIPPED [1] lib/sqlalchemy/testing/config.py:420: 'test/sql/test_insert_exec.py::IMVSentinelTest_sqlite+pysqlite_3_44_0::test_sentinel_col_configurations[not_sort_by_parameter_order-not_randomize_returning-implicit_not_omitted-sequence] (call)' : no sequence support
  398. SKIPPED [1] lib/sqlalchemy/testing/config.py:420: 'test/sql/test_insert_exec.py::IMVSentinelTest_sqlite+pysqlite_3_44_0::test_sentinel_col_configurations[not_sort_by_parameter_order-not_randomize_returning-implicit_omitted-identity] (call)' : not postgresql >= (10,) and not oracle >= (12,) and not mssql
  399. SKIPPED [1] lib/sqlalchemy/testing/config.py:420: 'test/sql/test_insert_exec.py::IMVSentinelTest_sqlite+pysqlite_3_44_0::test_sentinel_col_configurations[not_sort_by_parameter_order-not_randomize_returning-implicit_omitted-sequence] (call)' : no sequence support
  400. SKIPPED [1] lib/sqlalchemy/testing/config.py:420: 'test/sql/test_insert_exec.py::IMVSentinelTest_sqlite+pysqlite_3_44_0::test_sentinel_col_configurations[not_sort_by_parameter_order-not_randomize_returning-none-identity] (call)' : not postgresql >= (10,) and not oracle >= (12,) and not mssql
  401. SKIPPED [1] lib/sqlalchemy/testing/config.py:420: 'test/sql/test_insert_exec.py::IMVSentinelTest_sqlite+pysqlite_3_44_0::test_sentinel_col_configurations[not_sort_by_parameter_order-not_randomize_returning-none-sequence] (call)' : no sequence support
  402. SKIPPED [1] lib/sqlalchemy/testing/config.py:420: 'test/sql/test_insert_exec.py::IMVSentinelTest_sqlite+pysqlite_3_44_0::test_sentinel_col_configurations[not_sort_by_parameter_order-not_randomize_returning-sequence-identity] (call)' : not postgresql >= (10,) and not oracle >= (12,) and not mssql
  403. SKIPPED [1] lib/sqlalchemy/testing/config.py:420: 'test/sql/test_insert_exec.py::IMVSentinelTest_sqlite+pysqlite_3_44_0::test_sentinel_col_configurations[not_sort_by_parameter_order-not_randomize_returning-sequence-plain_autoinc] (call)' : no sequence support
  404. SKIPPED [1] lib/sqlalchemy/testing/config.py:420: 'test/sql/test_insert_exec.py::IMVSentinelTest_sqlite+pysqlite_3_44_0::test_sentinel_col_configurations[not_sort_by_parameter_order-not_randomize_returning-sequence-sequence] (call)' : no sequence support
  405. SKIPPED [1] lib/sqlalchemy/testing/config.py:420: 'test/sql/test_insert_exec.py::IMVSentinelTest_sqlite+pysqlite_3_44_0::test_sentinel_col_configurations[not_sort_by_parameter_order-randomize_returning-default_string_uuid-identity] (call)' : not postgresql >= (10,) and not oracle >= (12,) and not mssql
  406. SKIPPED [1] lib/sqlalchemy/testing/config.py:420: 'test/sql/test_insert_exec.py::IMVSentinelTest_sqlite+pysqlite_3_44_0::test_sentinel_col_configurations[not_sort_by_parameter_order-randomize_returning-default_string_uuid-sequence] (call)' : no sequence support
  407. SKIPPED [1] lib/sqlalchemy/testing/config.py:420: 'test/sql/test_insert_exec.py::IMVSentinelTest_sqlite+pysqlite_3_44_0::test_sentinel_col_configurations[not_sort_by_parameter_order-randomize_returning-default_uuid-identity] (call)' : not postgresql >= (10,) and not oracle >= (12,) and not mssql
  408. SKIPPED [1] lib/sqlalchemy/testing/config.py:420: 'test/sql/test_insert_exec.py::IMVSentinelTest_sqlite+pysqlite_3_44_0::test_sentinel_col_configurations[not_sort_by_parameter_order-randomize_returning-default_uuid-sequence] (call)' : no sequence support
  409. SKIPPED [1] lib/sqlalchemy/testing/config.py:420: 'test/sql/test_insert_exec.py::IMVSentinelTest_sqlite+pysqlite_3_44_0::test_sentinel_col_configurations[not_sort_by_parameter_order-randomize_returning-explicit-identity] (call)' : not postgresql >= (10,) and not oracle >= (12,) and not mssql
  410. SKIPPED [1] lib/sqlalchemy/testing/config.py:420: 'test/sql/test_insert_exec.py::IMVSentinelTest_sqlite+pysqlite_3_44_0::test_sentinel_col_configurations[not_sort_by_parameter_order-randomize_returning-explicit-sequence] (call)' : no sequence support
  411. SKIPPED [1] lib/sqlalchemy/testing/config.py:420: 'test/sql/test_insert_exec.py::IMVSentinelTest_sqlite+pysqlite_3_44_0::test_sentinel_col_configurations[not_sort_by_parameter_order-randomize_returning-explicit_but_nullable-identity] (call)' : not postgresql >= (10,) and not oracle >= (12,) and not mssql
  412. SKIPPED [1] lib/sqlalchemy/testing/config.py:420: 'test/sql/test_insert_exec.py::IMVSentinelTest_sqlite+pysqlite_3_44_0::test_sentinel_col_configurations[not_sort_by_parameter_order-randomize_returning-explicit_but_nullable-sequence] (call)' : no sequence support
  413. SKIPPED [1] lib/sqlalchemy/testing/config.py:420: 'test/sql/test_insert_exec.py::IMVSentinelTest_sqlite+pysqlite_3_44_0::test_sentinel_col_configurations[not_sort_by_parameter_order-randomize_returning-identity-identity] (call)' : not postgresql >= (10,) and not oracle >= (12,) and not mssql
  414. SKIPPED [1] lib/sqlalchemy/testing/config.py:420: 'test/sql/test_insert_exec.py::IMVSentinelTest_sqlite+pysqlite_3_44_0::test_sentinel_col_configurations[not_sort_by_parameter_order-randomize_returning-identity-plain_autoinc] (call)' : not postgresql >= (10,)
  415. SKIPPED [1] lib/sqlalchemy/testing/config.py:420: 'test/sql/test_insert_exec.py::IMVSentinelTest_sqlite+pysqlite_3_44_0::test_sentinel_col_configurations[not_sort_by_parameter_order-randomize_returning-identity-sequence] (call)' : no sequence support
  416. SKIPPED [1] lib/sqlalchemy/testing/config.py:420: 'test/sql/test_insert_exec.py::IMVSentinelTest_sqlite+pysqlite_3_44_0::test_sentinel_col_configurations[not_sort_by_parameter_order-randomize_returning-implicit_not_omitted-identity] (call)' : not postgresql >= (10,) and not oracle >= (12,) and not mssql
  417. SKIPPED [1] lib/sqlalchemy/testing/config.py:420: 'test/sql/test_insert_exec.py::IMVSentinelTest_sqlite+pysqlite_3_44_0::test_sentinel_col_configurations[not_sort_by_parameter_order-randomize_returning-implicit_not_omitted-sequence] (call)' : no sequence support
  418. SKIPPED [1] lib/sqlalchemy/testing/config.py:420: 'test/sql/test_insert_exec.py::IMVSentinelTest_sqlite+pysqlite_3_44_0::test_sentinel_col_configurations[not_sort_by_parameter_order-randomize_returning-implicit_omitted-identity] (call)' : not postgresql >= (10,) and not oracle >= (12,) and not mssql
  419. SKIPPED [1] lib/sqlalchemy/testing/config.py:420: 'test/sql/test_insert_exec.py::IMVSentinelTest_sqlite+pysqlite_3_44_0::test_sentinel_col_configurations[not_sort_by_parameter_order-randomize_returning-implicit_omitted-sequence] (call)' : no sequence support
  420. SKIPPED [1] lib/sqlalchemy/testing/config.py:420: 'test/sql/test_insert_exec.py::IMVSentinelTest_sqlite+pysqlite_3_44_0::test_sentinel_col_configurations[not_sort_by_parameter_order-randomize_returning-none-identity] (call)' : not postgresql >= (10,) and not oracle >= (12,) and not mssql
  421. SKIPPED [1] lib/sqlalchemy/testing/config.py:420: 'test/sql/test_insert_exec.py::IMVSentinelTest_sqlite+pysqlite_3_44_0::test_sentinel_col_configurations[not_sort_by_parameter_order-randomize_returning-none-sequence] (call)' : no sequence support
  422. SKIPPED [1] lib/sqlalchemy/testing/config.py:420: 'test/sql/test_insert_exec.py::IMVSentinelTest_sqlite+pysqlite_3_44_0::test_sentinel_col_configurations[not_sort_by_parameter_order-randomize_returning-sequence-identity] (call)' : not postgresql >= (10,) and not oracle >= (12,) and not mssql
  423. SKIPPED [1] lib/sqlalchemy/testing/config.py:420: 'test/sql/test_insert_exec.py::IMVSentinelTest_sqlite+pysqlite_3_44_0::test_sentinel_col_configurations[not_sort_by_parameter_order-randomize_returning-sequence-plain_autoinc] (call)' : no sequence support
  424. SKIPPED [1] lib/sqlalchemy/testing/config.py:420: 'test/sql/test_insert_exec.py::IMVSentinelTest_sqlite+pysqlite_3_44_0::test_sentinel_col_configurations[not_sort_by_parameter_order-randomize_returning-sequence-sequence] (call)' : no sequence support
  425. SKIPPED [1] lib/sqlalchemy/testing/config.py:420: 'test/sql/test_insert_exec.py::IMVSentinelTest_sqlite+pysqlite_3_44_0::test_sentinel_col_configurations[sort_by_parameter_order-not_randomize_returning-default_string_uuid-identity] (call)' : not postgresql >= (10,) and not oracle >= (12,) and not mssql
  426. SKIPPED [1] lib/sqlalchemy/testing/config.py:420: 'test/sql/test_insert_exec.py::IMVSentinelTest_sqlite+pysqlite_3_44_0::test_sentinel_col_configurations[sort_by_parameter_order-not_randomize_returning-default_string_uuid-sequence] (call)' : no sequence support
  427. SKIPPED [1] lib/sqlalchemy/testing/config.py:420: 'test/sql/test_insert_exec.py::IMVSentinelTest_sqlite+pysqlite_3_44_0::test_sentinel_col_configurations[sort_by_parameter_order-not_randomize_returning-default_uuid-identity] (call)' : not postgresql >= (10,) and not oracle >= (12,) and not mssql
  428. SKIPPED [1] lib/sqlalchemy/testing/config.py:420: 'test/sql/test_insert_exec.py::IMVSentinelTest_sqlite+pysqlite_3_44_0::test_sentinel_col_configurations[sort_by_parameter_order-not_randomize_returning-default_uuid-sequence] (call)' : no sequence support
  429. SKIPPED [1] lib/sqlalchemy/testing/config.py:420: 'test/sql/test_insert_exec.py::IMVSentinelTest_sqlite+pysqlite_3_44_0::test_sentinel_col_configurations[sort_by_parameter_order-not_randomize_returning-explicit-identity] (call)' : not postgresql >= (10,) and not oracle >= (12,) and not mssql
  430. SKIPPED [1] lib/sqlalchemy/testing/config.py:420: 'test/sql/test_insert_exec.py::IMVSentinelTest_sqlite+pysqlite_3_44_0::test_sentinel_col_configurations[sort_by_parameter_order-not_randomize_returning-explicit-sequence] (call)' : no sequence support
  431. SKIPPED [1] lib/sqlalchemy/testing/config.py:420: 'test/sql/test_insert_exec.py::IMVSentinelTest_sqlite+pysqlite_3_44_0::test_sentinel_col_configurations[sort_by_parameter_order-not_randomize_returning-explicit_but_nullable-identity] (call)' : not postgresql >= (10,) and not oracle >= (12,) and not mssql
  432. SKIPPED [1] lib/sqlalchemy/testing/config.py:420: 'test/sql/test_insert_exec.py::IMVSentinelTest_sqlite+pysqlite_3_44_0::test_sentinel_col_configurations[sort_by_parameter_order-not_randomize_returning-explicit_but_nullable-sequence] (call)' : no sequence support
  433. SKIPPED [1] lib/sqlalchemy/testing/config.py:420: 'test/sql/test_insert_exec.py::IMVSentinelTest_sqlite+pysqlite_3_44_0::test_sentinel_col_configurations[sort_by_parameter_order-not_randomize_returning-identity-identity] (call)' : not postgresql >= (10,) and not oracle >= (12,) and not mssql
  434. SKIPPED [1] lib/sqlalchemy/testing/config.py:420: 'test/sql/test_insert_exec.py::IMVSentinelTest_sqlite+pysqlite_3_44_0::test_sentinel_col_configurations[sort_by_parameter_order-not_randomize_returning-identity-plain_autoinc] (call)' : not postgresql >= (10,)
  435. SKIPPED [1] lib/sqlalchemy/testing/config.py:420: 'test/sql/test_insert_exec.py::IMVSentinelTest_sqlite+pysqlite_3_44_0::test_sentinel_col_configurations[sort_by_parameter_order-not_randomize_returning-identity-sequence] (call)' : no sequence support
  436. SKIPPED [1] lib/sqlalchemy/testing/config.py:420: 'test/sql/test_insert_exec.py::IMVSentinelTest_sqlite+pysqlite_3_44_0::test_sentinel_col_configurations[sort_by_parameter_order-not_randomize_returning-implicit_not_omitted-identity] (call)' : not postgresql >= (10,) and not oracle >= (12,) and not mssql
  437. SKIPPED [1] lib/sqlalchemy/testing/config.py:420: 'test/sql/test_insert_exec.py::IMVSentinelTest_sqlite+pysqlite_3_44_0::test_sentinel_col_configurations[sort_by_parameter_order-not_randomize_returning-implicit_not_omitted-sequence] (call)' : no sequence support
  438. SKIPPED [1] lib/sqlalchemy/testing/config.py:420: 'test/sql/test_insert_exec.py::IMVSentinelTest_sqlite+pysqlite_3_44_0::test_sentinel_col_configurations[sort_by_parameter_order-not_randomize_returning-implicit_omitted-identity] (call)' : not postgresql >= (10,) and not oracle >= (12,) and not mssql
  439. SKIPPED [1] lib/sqlalchemy/testing/config.py:420: 'test/sql/test_insert_exec.py::IMVSentinelTest_sqlite+pysqlite_3_44_0::test_sentinel_col_configurations[sort_by_parameter_order-not_randomize_returning-implicit_omitted-sequence] (call)' : no sequence support
  440. SKIPPED [1] lib/sqlalchemy/testing/config.py:420: 'test/sql/test_insert_exec.py::IMVSentinelTest_sqlite+pysqlite_3_44_0::test_sentinel_col_configurations[sort_by_parameter_order-not_randomize_returning-none-identity] (call)' : not postgresql >= (10,) and not oracle >= (12,) and not mssql
  441. SKIPPED [1] lib/sqlalchemy/testing/config.py:420: 'test/sql/test_insert_exec.py::IMVSentinelTest_sqlite+pysqlite_3_44_0::test_sentinel_col_configurations[sort_by_parameter_order-not_randomize_returning-none-sequence] (call)' : no sequence support
  442. SKIPPED [1] lib/sqlalchemy/testing/config.py:420: 'test/sql/test_insert_exec.py::IMVSentinelTest_sqlite+pysqlite_3_44_0::test_sentinel_col_configurations[sort_by_parameter_order-not_randomize_returning-sequence-identity] (call)' : not postgresql >= (10,) and not oracle >= (12,) and not mssql
  443. SKIPPED [1] lib/sqlalchemy/testing/config.py:420: 'test/sql/test_insert_exec.py::IMVSentinelTest_sqlite+pysqlite_3_44_0::test_sentinel_col_configurations[sort_by_parameter_order-not_randomize_returning-sequence-plain_autoinc] (call)' : no sequence support
  444. SKIPPED [1] lib/sqlalchemy/testing/config.py:420: 'test/sql/test_insert_exec.py::IMVSentinelTest_sqlite+pysqlite_3_44_0::test_sentinel_col_configurations[sort_by_parameter_order-not_randomize_returning-sequence-sequence] (call)' : no sequence support
  445. SKIPPED [1] lib/sqlalchemy/testing/config.py:420: 'test/sql/test_insert_exec.py::IMVSentinelTest_sqlite+pysqlite_3_44_0::test_sentinel_col_configurations[sort_by_parameter_order-randomize_returning-default_string_uuid-identity] (call)' : not postgresql >= (10,) and not oracle >= (12,) and not mssql
  446. SKIPPED [1] lib/sqlalchemy/testing/config.py:420: 'test/sql/test_insert_exec.py::IMVSentinelTest_sqlite+pysqlite_3_44_0::test_sentinel_col_configurations[sort_by_parameter_order-randomize_returning-default_string_uuid-sequence] (call)' : no sequence support
  447. SKIPPED [1] lib/sqlalchemy/testing/config.py:420: 'test/sql/test_insert_exec.py::IMVSentinelTest_sqlite+pysqlite_3_44_0::test_sentinel_col_configurations[sort_by_parameter_order-randomize_returning-default_uuid-identity] (call)' : not postgresql >= (10,) and not oracle >= (12,) and not mssql
  448. SKIPPED [1] lib/sqlalchemy/testing/config.py:420: 'test/sql/test_insert_exec.py::IMVSentinelTest_sqlite+pysqlite_3_44_0::test_sentinel_col_configurations[sort_by_parameter_order-randomize_returning-default_uuid-sequence] (call)' : no sequence support
  449. SKIPPED [1] lib/sqlalchemy/testing/config.py:420: 'test/sql/test_insert_exec.py::IMVSentinelTest_sqlite+pysqlite_3_44_0::test_sentinel_col_configurations[sort_by_parameter_order-randomize_returning-explicit-identity] (call)' : not postgresql >= (10,) and not oracle >= (12,) and not mssql
  450. SKIPPED [1] lib/sqlalchemy/testing/config.py:420: 'test/sql/test_insert_exec.py::IMVSentinelTest_sqlite+pysqlite_3_44_0::test_sentinel_col_configurations[sort_by_parameter_order-randomize_returning-explicit-sequence] (call)' : no sequence support
  451. SKIPPED [1] lib/sqlalchemy/testing/config.py:420: 'test/sql/test_insert_exec.py::IMVSentinelTest_sqlite+pysqlite_3_44_0::test_sentinel_col_configurations[sort_by_parameter_order-randomize_returning-explicit_but_nullable-identity] (call)' : not postgresql >= (10,) and not oracle >= (12,) and not mssql
  452. SKIPPED [1] lib/sqlalchemy/testing/config.py:420: 'test/sql/test_insert_exec.py::IMVSentinelTest_sqlite+pysqlite_3_44_0::test_sentinel_col_configurations[sort_by_parameter_order-randomize_returning-explicit_but_nullable-sequence] (call)' : no sequence support
  453. SKIPPED [1] lib/sqlalchemy/testing/config.py:420: 'test/sql/test_insert_exec.py::IMVSentinelTest_sqlite+pysqlite_3_44_0::test_sentinel_col_configurations[sort_by_parameter_order-randomize_returning-identity-identity] (call)' : not postgresql >= (10,) and not oracle >= (12,) and not mssql
  454. SKIPPED [1] lib/sqlalchemy/testing/config.py:420: 'test/sql/test_insert_exec.py::IMVSentinelTest_sqlite+pysqlite_3_44_0::test_sentinel_col_configurations[sort_by_parameter_order-randomize_returning-identity-plain_autoinc] (call)' : not postgresql >= (10,)
  455. SKIPPED [1] lib/sqlalchemy/testing/config.py:420: 'test/sql/test_insert_exec.py::IMVSentinelTest_sqlite+pysqlite_3_44_0::test_sentinel_col_configurations[sort_by_parameter_order-randomize_returning-identity-sequence] (call)' : no sequence support
  456. SKIPPED [1] lib/sqlalchemy/testing/config.py:420: 'test/sql/test_insert_exec.py::IMVSentinelTest_sqlite+pysqlite_3_44_0::test_sentinel_col_configurations[sort_by_parameter_order-randomize_returning-implicit_not_omitted-identity] (call)' : not postgresql >= (10,) and not oracle >= (12,) and not mssql
  457. SKIPPED [1] lib/sqlalchemy/testing/config.py:420: 'test/sql/test_insert_exec.py::IMVSentinelTest_sqlite+pysqlite_3_44_0::test_sentinel_col_configurations[sort_by_parameter_order-randomize_returning-implicit_not_omitted-sequence] (call)' : no sequence support
  458. SKIPPED [1] lib/sqlalchemy/testing/config.py:420: 'test/sql/test_insert_exec.py::IMVSentinelTest_sqlite+pysqlite_3_44_0::test_sentinel_col_configurations[sort_by_parameter_order-randomize_returning-implicit_omitted-identity] (call)' : not postgresql >= (10,) and not oracle >= (12,) and not mssql
  459. SKIPPED [1] lib/sqlalchemy/testing/config.py:420: 'test/sql/test_insert_exec.py::IMVSentinelTest_sqlite+pysqlite_3_44_0::test_sentinel_col_configurations[sort_by_parameter_order-randomize_returning-implicit_omitted-sequence] (call)' : no sequence support
  460. SKIPPED [1] lib/sqlalchemy/testing/config.py:420: 'test/sql/test_insert_exec.py::IMVSentinelTest_sqlite+pysqlite_3_44_0::test_sentinel_col_configurations[sort_by_parameter_order-randomize_returning-none-identity] (call)' : not postgresql >= (10,) and not oracle >= (12,) and not mssql
  461. SKIPPED [1] lib/sqlalchemy/testing/config.py:420: 'test/sql/test_insert_exec.py::IMVSentinelTest_sqlite+pysqlite_3_44_0::test_sentinel_col_configurations[sort_by_parameter_order-randomize_returning-none-sequence] (call)' : no sequence support
  462. SKIPPED [1] lib/sqlalchemy/testing/config.py:420: 'test/sql/test_insert_exec.py::IMVSentinelTest_sqlite+pysqlite_3_44_0::test_sentinel_col_configurations[sort_by_parameter_order-randomize_returning-sequence-identity] (call)' : not postgresql >= (10,) and not oracle >= (12,) and not mssql
  463. SKIPPED [1] lib/sqlalchemy/testing/config.py:420: 'test/sql/test_insert_exec.py::IMVSentinelTest_sqlite+pysqlite_3_44_0::test_sentinel_col_configurations[sort_by_parameter_order-randomize_returning-sequence-plain_autoinc] (call)' : no sequence support
  464. SKIPPED [1] lib/sqlalchemy/testing/config.py:420: 'test/sql/test_insert_exec.py::IMVSentinelTest_sqlite+pysqlite_3_44_0::test_sentinel_col_configurations[sort_by_parameter_order-randomize_returning-sequence-sequence] (call)' : no sequence support
  465. SKIPPED [1] lib/sqlalchemy/testing/config.py:420: 'test/sql/test_insert_exec.py::IMVSentinelTest_sqlite+pysqlite_3_44_0::test_upsert_downgrades[not_sort_by_parameter_order-not_randomize_returning-not_warn_for_downgrades-use_pk_explicit-clientside] (call)' : sqlite
  466. SKIPPED [1] lib/sqlalchemy/testing/config.py:420: 'test/sql/test_insert_exec.py::IMVSentinelTest_sqlite+pysqlite_3_44_0::test_upsert_downgrades[not_sort_by_parameter_order-not_randomize_returning-not_warn_for_downgrades-use_pk_explicit-serverside] (call)' : sqlite
  467. SKIPPED [1] lib/sqlalchemy/testing/config.py:420: 'test/sql/test_insert_exec.py::IMVSentinelTest_sqlite+pysqlite_3_44_0::test_upsert_downgrades[not_sort_by_parameter_order-not_randomize_returning-warn_for_downgrades-separate_sentinel-clientside] (call)' : sqlite
  468. SKIPPED [1] lib/sqlalchemy/testing/config.py:420: 'test/sql/test_insert_exec.py::IMVSentinelTest_sqlite+pysqlite_3_44_0::test_upsert_downgrades[not_sort_by_parameter_order-not_randomize_returning-warn_for_downgrades-separate_sentinel-serverside] (call)' : sqlite
  469. SKIPPED [1] lib/sqlalchemy/testing/config.py:420: 'test/sql/test_insert_exec.py::IMVSentinelTest_sqlite+pysqlite_3_44_0::test_upsert_downgrades[not_sort_by_parameter_order-not_randomize_returning-warn_for_downgrades-separate_uuid-clientside] (call)' : sqlite
  470. SKIPPED [1] lib/sqlalchemy/testing/config.py:420: 'test/sql/test_insert_exec.py::IMVSentinelTest_sqlite+pysqlite_3_44_0::test_upsert_downgrades[not_sort_by_parameter_order-not_randomize_returning-warn_for_downgrades-separate_uuid-serverside] (call)' : sqlite
  471. SKIPPED [1] lib/sqlalchemy/testing/config.py:420: 'test/sql/test_insert_exec.py::IMVSentinelTest_sqlite+pysqlite_3_44_0::test_upsert_downgrades[not_sort_by_parameter_order-not_randomize_returning-warn_for_downgrades-use_pk-clientside] (call)' : sqlite
  472. SKIPPED [1] lib/sqlalchemy/testing/config.py:420: 'test/sql/test_insert_exec.py::IMVSentinelTest_sqlite+pysqlite_3_44_0::test_upsert_downgrades[not_sort_by_parameter_order-not_randomize_returning-warn_for_downgrades-use_pk-serverside] (call)' : sqlite
  473. SKIPPED [1] lib/sqlalchemy/testing/config.py:420: 'test/sql/test_insert_exec.py::IMVSentinelTest_sqlite+pysqlite_3_44_0::test_upsert_downgrades[not_sort_by_parameter_order-not_randomize_returning-warn_for_downgrades-use_pk_explicit-clientside] (call)' : sqlite
  474. SKIPPED [1] lib/sqlalchemy/testing/config.py:420: 'test/sql/test_insert_exec.py::IMVSentinelTest_sqlite+pysqlite_3_44_0::test_upsert_downgrades[not_sort_by_parameter_order-not_randomize_returning-warn_for_downgrades-use_pk_explicit-serverside] (call)' : sqlite
  475. SKIPPED [1] lib/sqlalchemy/testing/config.py:420: 'test/sql/test_insert_exec.py::IMVSentinelTest_sqlite+pysqlite_3_44_0::test_upsert_downgrades[not_sort_by_parameter_order-randomize_returning-not_warn_for_downgrades-separate_sentinel-clientside] (call)' : sqlite
  476. SKIPPED [1] lib/sqlalchemy/testing/config.py:420: 'test/sql/test_insert_exec.py::IMVSentinelTest_sqlite+pysqlite_3_44_0::test_upsert_downgrades[not_sort_by_parameter_order-randomize_returning-not_warn_for_downgrades-separate_sentinel-serverside] (call)' : sqlite
  477. SKIPPED [1] lib/sqlalchemy/testing/config.py:420: 'test/sql/test_insert_exec.py::IMVSentinelTest_sqlite+pysqlite_3_44_0::test_upsert_downgrades[not_sort_by_parameter_order-randomize_returning-not_warn_for_downgrades-separate_uuid-clientside] (call)' : sqlite
  478. SKIPPED [1] lib/sqlalchemy/testing/config.py:420: 'test/sql/test_insert_exec.py::IMVSentinelTest_sqlite+pysqlite_3_44_0::test_upsert_downgrades[not_sort_by_parameter_order-randomize_returning-not_warn_for_downgrades-separate_uuid-serverside] (call)' : sqlite
  479. SKIPPED [1] lib/sqlalchemy/testing/config.py:420: 'test/sql/test_insert_exec.py::IMVSentinelTest_sqlite+pysqlite_3_44_0::test_upsert_downgrades[not_sort_by_parameter_order-randomize_returning-not_warn_for_downgrades-use_pk-clientside] (call)' : sqlite
  480. SKIPPED [1] lib/sqlalchemy/testing/config.py:420: 'test/sql/test_insert_exec.py::IMVSentinelTest_sqlite+pysqlite_3_44_0::test_upsert_downgrades[not_sort_by_parameter_order-randomize_returning-not_warn_for_downgrades-use_pk-serverside] (call)' : sqlite
  481. SKIPPED [1] lib/sqlalchemy/testing/config.py:420: 'test/sql/test_insert_exec.py::IMVSentinelTest_sqlite+pysqlite_3_44_0::test_upsert_downgrades[not_sort_by_parameter_order-randomize_returning-not_warn_for_downgrades-use_pk_explicit-clientside] (call)' : sqlite
  482. SKIPPED [1] lib/sqlalchemy/testing/config.py:420: 'test/sql/test_insert_exec.py::IMVSentinelTest_sqlite+pysqlite_3_44_0::test_upsert_downgrades[not_sort_by_parameter_order-randomize_returning-not_warn_for_downgrades-use_pk_explicit-serverside] (call)' : sqlite
  483. SKIPPED [1] lib/sqlalchemy/testing/config.py:420: 'test/sql/test_insert_exec.py::IMVSentinelTest_sqlite+pysqlite_3_44_0::test_upsert_downgrades[not_sort_by_parameter_order-randomize_returning-warn_for_downgrades-separate_sentinel-clientside] (call)' : sqlite
  484. SKIPPED [1] lib/sqlalchemy/testing/config.py:420: 'test/sql/test_insert_exec.py::IMVSentinelTest_sqlite+pysqlite_3_44_0::test_upsert_downgrades[not_sort_by_parameter_order-randomize_returning-warn_for_downgrades-separate_sentinel-serverside] (call)' : sqlite
  485. SKIPPED [1] lib/sqlalchemy/testing/config.py:420: 'test/sql/test_insert_exec.py::IMVSentinelTest_sqlite+pysqlite_3_44_0::test_upsert_downgrades[not_sort_by_parameter_order-randomize_returning-warn_for_downgrades-separate_uuid-clientside] (call)' : sqlite
  486. SKIPPED [1] lib/sqlalchemy/testing/config.py:420: 'test/sql/test_insert_exec.py::IMVSentinelTest_sqlite+pysqlite_3_44_0::test_upsert_downgrades[not_sort_by_parameter_order-randomize_returning-warn_for_downgrades-separate_uuid-serverside] (call)' : sqlite
  487. SKIPPED [1] lib/sqlalchemy/testing/config.py:420: 'test/sql/test_insert_exec.py::IMVSentinelTest_sqlite+pysqlite_3_44_0::test_upsert_downgrades[not_sort_by_parameter_order-randomize_returning-warn_for_downgrades-use_pk-clientside] (call)' : sqlite
  488. SKIPPED [1] lib/sqlalchemy/testing/config.py:420: 'test/sql/test_insert_exec.py::IMVSentinelTest_sqlite+pysqlite_3_44_0::test_upsert_downgrades[not_sort_by_parameter_order-randomize_returning-warn_for_downgrades-use_pk-serverside] (call)' : sqlite
  489. SKIPPED [1] lib/sqlalchemy/testing/config.py:420: 'test/sql/test_insert_exec.py::IMVSentinelTest_sqlite+pysqlite_3_44_0::test_upsert_downgrades[not_sort_by_parameter_order-randomize_returning-warn_for_downgrades-use_pk_explicit-clientside] (call)' : sqlite
  490. SKIPPED [1] lib/sqlalchemy/testing/config.py:420: 'test/sql/test_insert_exec.py::IMVSentinelTest_sqlite+pysqlite_3_44_0::test_upsert_downgrades[not_sort_by_parameter_order-randomize_returning-warn_for_downgrades-use_pk_explicit-serverside] (call)' : sqlite
  491. SKIPPED [1] lib/sqlalchemy/testing/config.py:420: 'test/sql/test_insert_exec.py::IMVSentinelTest_sqlite+pysqlite_3_44_0::test_upsert_downgrades[sort_by_parameter_order-not_randomize_returning-not_warn_for_downgrades-separate_sentinel-clientside] (call)' : sqlite
  492. SKIPPED [1] lib/sqlalchemy/testing/config.py:420: 'test/sql/test_insert_exec.py::IMVSentinelTest_sqlite+pysqlite_3_44_0::test_upsert_downgrades[sort_by_parameter_order-not_randomize_returning-not_warn_for_downgrades-separate_sentinel-serverside] (call)' : sqlite
  493. SKIPPED [1] lib/sqlalchemy/testing/config.py:420: 'test/sql/test_insert_exec.py::IMVSentinelTest_sqlite+pysqlite_3_44_0::test_upsert_downgrades[sort_by_parameter_order-not_randomize_returning-not_warn_for_downgrades-separate_uuid-clientside] (call)' : sqlite
  494. SKIPPED [1] lib/sqlalchemy/testing/config.py:420: 'test/sql/test_insert_exec.py::IMVSentinelTest_sqlite+pysqlite_3_44_0::test_upsert_downgrades[sort_by_parameter_order-not_randomize_returning-not_warn_for_downgrades-separate_uuid-serverside] (call)' : sqlite
  495. SKIPPED [1] lib/sqlalchemy/testing/config.py:420: 'test/sql/test_insert_exec.py::IMVSentinelTest_sqlite+pysqlite_3_44_0::test_upsert_downgrades[sort_by_parameter_order-not_randomize_returning-not_warn_for_downgrades-use_pk-clientside] (call)' : sqlite
  496. SKIPPED [1] lib/sqlalchemy/testing/config.py:420: 'test/sql/test_insert_exec.py::IMVSentinelTest_sqlite+pysqlite_3_44_0::test_upsert_downgrades[sort_by_parameter_order-not_randomize_returning-not_warn_for_downgrades-use_pk-serverside] (call)' : sqlite
  497. SKIPPED [1] lib/sqlalchemy/testing/config.py:420: 'test/sql/test_insert_exec.py::IMVSentinelTest_sqlite+pysqlite_3_44_0::test_upsert_downgrades[sort_by_parameter_order-not_randomize_returning-not_warn_for_downgrades-use_pk_explicit-clientside] (call)' : sqlite
  498. SKIPPED [1] lib/sqlalchemy/testing/config.py:420: 'test/sql/test_insert_exec.py::IMVSentinelTest_sqlite+pysqlite_3_44_0::test_upsert_downgrades[sort_by_parameter_order-not_randomize_returning-not_warn_for_downgrades-use_pk_explicit-serverside] (call)' : sqlite
  499. SKIPPED [1] lib/sqlalchemy/testing/config.py:420: 'test/sql/test_insert_exec.py::IMVSentinelTest_sqlite+pysqlite_3_44_0::test_upsert_downgrades[sort_by_parameter_order-not_randomize_returning-warn_for_downgrades-separate_sentinel-clientside] (call)' : sqlite
  500. SKIPPED [1] lib/sqlalchemy/testing/config.py:420: 'test/sql/test_insert_exec.py::IMVSentinelTest_sqlite+pysqlite_3_44_0::test_upsert_downgrades[sort_by_parameter_order-not_randomize_returning-warn_for_downgrades-separate_sentinel-serverside] (call)' : sqlite
  501. SKIPPED [1] lib/sqlalchemy/testing/config.py:420: 'test/sql/test_insert_exec.py::IMVSentinelTest_sqlite+pysqlite_3_44_0::test_upsert_downgrades[sort_by_parameter_order-not_randomize_returning-warn_for_downgrades-separate_uuid-clientside] (call)' : sqlite
  502. SKIPPED [1] lib/sqlalchemy/testing/config.py:420: 'test/sql/test_insert_exec.py::IMVSentinelTest_sqlite+pysqlite_3_44_0::test_upsert_downgrades[sort_by_parameter_order-not_randomize_returning-warn_for_downgrades-separate_uuid-serverside] (call)' : sqlite
  503. SKIPPED [1] lib/sqlalchemy/testing/config.py:420: 'test/sql/test_insert_exec.py::IMVSentinelTest_sqlite+pysqlite_3_44_0::test_upsert_downgrades[sort_by_parameter_order-not_randomize_returning-warn_for_downgrades-use_pk-clientside] (call)' : sqlite
  504. SKIPPED [1] lib/sqlalchemy/testing/config.py:420: 'test/sql/test_insert_exec.py::IMVSentinelTest_sqlite+pysqlite_3_44_0::test_upsert_downgrades[sort_by_parameter_order-not_randomize_returning-warn_for_downgrades-use_pk-serverside] (call)' : sqlite
  505. SKIPPED [1] lib/sqlalchemy/testing/config.py:420: 'test/sql/test_insert_exec.py::IMVSentinelTest_sqlite+pysqlite_3_44_0::test_upsert_downgrades[sort_by_parameter_order-not_randomize_returning-warn_for_downgrades-use_pk_explicit-clientside] (call)' : sqlite
  506. SKIPPED [1] lib/sqlalchemy/testing/config.py:420: 'test/sql/test_insert_exec.py::IMVSentinelTest_sqlite+pysqlite_3_44_0::test_upsert_downgrades[sort_by_parameter_order-not_randomize_returning-warn_for_downgrades-use_pk_explicit-serverside] (call)' : sqlite
  507. SKIPPED [1] lib/sqlalchemy/testing/config.py:420: 'test/sql/test_insert_exec.py::IMVSentinelTest_sqlite+pysqlite_3_44_0::test_upsert_downgrades[sort_by_parameter_order-randomize_returning-not_warn_for_downgrades-separate_sentinel-clientside] (call)' : sqlite
  508. SKIPPED [1] lib/sqlalchemy/testing/config.py:420: 'test/sql/test_insert_exec.py::IMVSentinelTest_sqlite+pysqlite_3_44_0::test_upsert_downgrades[sort_by_parameter_order-randomize_returning-not_warn_for_downgrades-separate_sentinel-serverside] (call)' : sqlite
  509. SKIPPED [1] lib/sqlalchemy/testing/config.py:420: 'test/sql/test_insert_exec.py::IMVSentinelTest_sqlite+pysqlite_3_44_0::test_upsert_downgrades[sort_by_parameter_order-randomize_returning-not_warn_for_downgrades-separate_uuid-clientside] (call)' : sqlite
  510. SKIPPED [1] lib/sqlalchemy/testing/config.py:420: 'test/sql/test_insert_exec.py::IMVSentinelTest_sqlite+pysqlite_3_44_0::test_upsert_downgrades[sort_by_parameter_order-randomize_returning-not_warn_for_downgrades-separate_uuid-serverside] (call)' : sqlite
  511. SKIPPED [1] lib/sqlalchemy/testing/config.py:420: 'test/sql/test_insert_exec.py::IMVSentinelTest_sqlite+pysqlite_3_44_0::test_upsert_downgrades[sort_by_parameter_order-randomize_returning-not_warn_for_downgrades-use_pk-clientside] (call)' : sqlite
  512. SKIPPED [1] lib/sqlalchemy/testing/config.py:420: 'test/sql/test_insert_exec.py::IMVSentinelTest_sqlite+pysqlite_3_44_0::test_upsert_downgrades[sort_by_parameter_order-randomize_returning-not_warn_for_downgrades-use_pk-serverside] (call)' : sqlite
  513. SKIPPED [1] lib/sqlalchemy/testing/config.py:420: 'test/sql/test_insert_exec.py::IMVSentinelTest_sqlite+pysqlite_3_44_0::test_upsert_downgrades[sort_by_parameter_order-randomize_returning-not_warn_for_downgrades-use_pk_explicit-clientside] (call)' : sqlite
  514. SKIPPED [1] lib/sqlalchemy/testing/config.py:420: 'test/sql/test_insert_exec.py::IMVSentinelTest_sqlite+pysqlite_3_44_0::test_upsert_downgrades[sort_by_parameter_order-randomize_returning-not_warn_for_downgrades-use_pk_explicit-serverside] (call)' : sqlite
  515. SKIPPED [1] lib/sqlalchemy/testing/config.py:420: 'test/sql/test_insert_exec.py::IMVSentinelTest_sqlite+pysqlite_3_44_0::test_upsert_downgrades[sort_by_parameter_order-randomize_returning-warn_for_downgrades-separate_sentinel-clientside] (call)' : sqlite
  516. SKIPPED [1] lib/sqlalchemy/testing/config.py:420: 'test/sql/test_insert_exec.py::IMVSentinelTest_sqlite+pysqlite_3_44_0::test_upsert_downgrades[sort_by_parameter_order-randomize_returning-warn_for_downgrades-separate_sentinel-serverside] (call)' : sqlite
  517. SKIPPED [1] lib/sqlalchemy/testing/config.py:420: 'test/sql/test_insert_exec.py::IMVSentinelTest_sqlite+pysqlite_3_44_0::test_upsert_downgrades[sort_by_parameter_order-randomize_returning-warn_for_downgrades-separate_uuid-clientside] (call)' : sqlite
  518. SKIPPED [1] lib/sqlalchemy/testing/config.py:420: 'test/sql/test_insert_exec.py::IMVSentinelTest_sqlite+pysqlite_3_44_0::test_upsert_downgrades[sort_by_parameter_order-randomize_returning-warn_for_downgrades-separate_uuid-serverside] (call)' : sqlite
  519. SKIPPED [1] lib/sqlalchemy/testing/config.py:420: 'test/sql/test_insert_exec.py::IMVSentinelTest_sqlite+pysqlite_3_44_0::test_upsert_downgrades[sort_by_parameter_order-randomize_returning-warn_for_downgrades-use_pk-clientside] (call)' : sqlite
  520. SKIPPED [1] lib/sqlalchemy/testing/config.py:420: 'test/sql/test_insert_exec.py::IMVSentinelTest_sqlite+pysqlite_3_44_0::test_upsert_downgrades[sort_by_parameter_order-randomize_returning-warn_for_downgrades-use_pk-serverside] (call)' : sqlite
  521. SKIPPED [1] lib/sqlalchemy/testing/config.py:420: 'test/sql/test_insert_exec.py::IMVSentinelTest_sqlite+pysqlite_3_44_0::test_upsert_downgrades[sort_by_parameter_order-randomize_returning-warn_for_downgrades-use_pk_explicit-clientside] (call)' : sqlite
  522. SKIPPED [1] lib/sqlalchemy/testing/config.py:420: 'test/sql/test_insert_exec.py::IMVSentinelTest_sqlite+pysqlite_3_44_0::test_upsert_downgrades[sort_by_parameter_order-randomize_returning-warn_for_downgrades-use_pk_explicit-serverside] (call)' : sqlite
  523. SKIPPED [1] lib/sqlalchemy/testing/config.py:420: 'test/sql/test_insert_exec.py::InsertExecTest_sqlite+pysqlite_3_44_0::test_lastrow_accessor_four[False-_exclusions_01] (call)' : no sequence support
  524. SKIPPED [1] lib/sqlalchemy/testing/config.py:420: 'test/sql/test_insert_exec.py::InsertExecTest_sqlite+pysqlite_3_44_0::test_lastrow_accessor_four[True-_exclusions_00] (call)' : no sequence support
  525. SKIPPED [1] lib/sqlalchemy/testing/config.py:420: 'test/sql/test_insert_exec.py::InsertExecTest_sqlite+pysqlite_3_44_0::test_lastrow_accessor_four_a[False-_exclusions_01] (call)' : no sequence support
  526. SKIPPED [1] lib/sqlalchemy/testing/config.py:420: 'test/sql/test_insert_exec.py::InsertExecTest_sqlite+pysqlite_3_44_0::test_lastrow_accessor_four_a[True-_exclusions_00] (call)' : no sequence support
  527. SKIPPED [1] lib/sqlalchemy/testing/config.py:420: 'test/sql/test_insert_exec.py::InsertManyValuesTest_sqlite+pysqlite_3_44_0::test_insert_w_bindparam_in_nested_insert[add_expr_returning] (call)' : not postgresql
  528. SKIPPED [1] lib/sqlalchemy/testing/config.py:420: 'test/sql/test_insert_exec.py::InsertManyValuesTest_sqlite+pysqlite_3_44_0::test_insert_w_bindparam_in_nested_insert[not_add_expr_returning] (call)' : not postgresql
  529. SKIPPED [1] lib/sqlalchemy/testing/config.py:420: 'test/sql/test_insert_exec.py::TableInsertTest_sqlite+pysqlite_3_44_0::test_explicit_sequence (call)' : no sequence support
  530. SKIPPED [1] lib/sqlalchemy/testing/config.py:420: 'test.sql.test_lambdas.ConcurrencyTest' unsupported on any DB implementation 'sqlite(3.44.0)+pysqlite'custom function or +aiosqlite
  531. SKIPPED [1] lib/sqlalchemy/testing/config.py:420: 'test/aaa_profiling/test_memusage.py::MemUsageTest::test_DecimalResultProcessor_init (call)' : Cython extensions not installed
  532. SKIPPED [1] lib/sqlalchemy/testing/config.py:420: 'test/aaa_profiling/test_memusage.py::MemUsageTest::test_DecimalResultProcessor_process (call)' : Cython extensions not installed
  533. SKIPPED [1] lib/sqlalchemy/testing/config.py:420: 'test/aaa_profiling/test_memusage.py::MemUsageTest::test_cycles_in_row (call)' : Cython extensions not installed
  534. SKIPPED [1] lib/sqlalchemy/testing/config.py:420: 'test/aaa_profiling/test_memusage.py::MemUsageWBackendTest_sqlite+pysqlite_3_44_0::test_orm_many_engines (call)' : :memory: connection not suitable here
  535. SKIPPED [1] lib/sqlalchemy/testing/config.py:420: 'test/aaa_profiling/test_memusage.py::MemUsageWBackendTest_sqlite+pysqlite_3_44_0::test_savepoints (call)' : savepoints not supported
  536. SKIPPED [21] lib/sqlalchemy/testing/config.py:420: 'test.ext.test_mutable.MutableColumnCopyArrayTest' unsupported on any DB implementation 'sqlite(3.44.0)+pysqlite'custom function
  537. SKIPPED [1] lib/sqlalchemy/testing/config.py:420: 'test/orm/test_naturalpks.py::CascadeToFKPKTest_sqlite+pysqlite_3_44_0::test_change_m2o_passive (call)' : target backend doesn't support ON UPDATE CASCADE
  538. SKIPPED [1] lib/sqlalchemy/testing/config.py:420: 'test/orm/test_naturalpks.py::CascadeToFKPKTest_sqlite+pysqlite_3_44_0::test_change_m2o_passive_uselist (call)' : target backend doesn't support ON UPDATE CASCADE
  539. SKIPPED [1] lib/sqlalchemy/testing/config.py:420: 'test/orm/test_naturalpks.py::CascadeToFKPKTest_sqlite+pysqlite_3_44_0::test_onetomany_passive (call)' : target backend doesn't support ON UPDATE CASCADE
  540. SKIPPED [1] lib/sqlalchemy/testing/config.py:420: 'test/orm/test_naturalpks.py::JoinedInheritancePKOnFKTest_sqlite+pysqlite_3_44_0::test_pk_passive (call)' : target backend doesn't support ON UPDATE CASCADE
  541. SKIPPED [1] lib/sqlalchemy/testing/config.py:420: 'test/orm/test_naturalpks.py::JoinedInheritanceTest_sqlite+pysqlite_3_44_0::test_fk_passive (call)' : target backend doesn't support ON UPDATE CASCADE
  542. SKIPPED [1] lib/sqlalchemy/testing/config.py:420: 'test/orm/test_naturalpks.py::JoinedInheritanceTest_sqlite+pysqlite_3_44_0::test_fk_threelevel_passive (call)' : target backend doesn't support ON UPDATE CASCADE
  543. SKIPPED [1] lib/sqlalchemy/testing/config.py:420: 'test/orm/test_naturalpks.py::JoinedInheritanceTest_sqlite+pysqlite_3_44_0::test_pk_passive (call)' : target backend doesn't support ON UPDATE CASCADE
  544. SKIPPED [1] lib/sqlalchemy/testing/config.py:420: 'test/orm/test_naturalpks.py::JoinedInheritanceTest_sqlite+pysqlite_3_44_0::test_pk_threelevel_passive (call)' : target backend doesn't support ON UPDATE CASCADE
  545. SKIPPED [1] lib/sqlalchemy/testing/config.py:420: 'test/orm/test_naturalpks.py::NaturalPKTest_sqlite+pysqlite_3_44_0::test_bidirectional_passive (call)' : target backend doesn't support ON UPDATE CASCADE
  546. SKIPPED [1] lib/sqlalchemy/testing/config.py:420: 'test/orm/test_naturalpks.py::NaturalPKTest_sqlite+pysqlite_3_44_0::test_manytomany_passive (call)' : target backend doesn't support ON UPDATE CASCADE
  547. SKIPPED [1] lib/sqlalchemy/testing/config.py:420: 'test/orm/test_naturalpks.py::NaturalPKTest_sqlite+pysqlite_3_44_0::test_manytoone_passive (call)' : target backend doesn't support ON UPDATE CASCADE
  548. SKIPPED [1] lib/sqlalchemy/testing/config.py:420: 'test/orm/test_naturalpks.py::NaturalPKTest_sqlite+pysqlite_3_44_0::test_manytoone_passive_uselist (call)' : target backend doesn't support ON UPDATE CASCADE
  549. SKIPPED [1] lib/sqlalchemy/testing/config.py:420: 'test/orm/test_naturalpks.py::NaturalPKTest_sqlite+pysqlite_3_44_0::test_onetomany_passive (call)' : target backend doesn't support ON UPDATE CASCADE
  550. SKIPPED [1] lib/sqlalchemy/testing/config.py:420: 'test/orm/test_naturalpks.py::NaturalPKTest_sqlite+pysqlite_3_44_0::test_onetoone_passive (call)' : target backend doesn't support ON UPDATE CASCADE
  551. SKIPPED [2] lib/sqlalchemy/testing/config.py:420: 'test.orm.test_naturalpks.NonPKCascadeTest' unsupported on any DB implementation 'sqlite(3.44.0)+pysqlite'custom function
  552. SKIPPED [1] lib/sqlalchemy/testing/config.py:420: 'test/orm/test_naturalpks.py::ReversePKsTest_sqlite+pysqlite_3_44_0::test_reverse_savepoint (call)' : savepoints not supported
  553. SKIPPED [4] lib/sqlalchemy/testing/config.py:420: 'test.orm.test_naturalpks.SelfReferentialTest' unsupported on any DB implementation 'sqlite(3.44.0)+pysqlite'custom function
  554. SKIPPED [26] lib/sqlalchemy/testing/config.py:420: 'test.dialect.postgresql.test_on_conflict.OnConflictTest' unsupported on any DB implementation 'sqlite(3.44.0)+pysqlite'
  555. SKIPPED [7] lib/sqlalchemy/testing/config.py:420: 'test.dialect.mysql.test_on_duplicate.OnDuplicateTest' unsupported on any DB implementation 'sqlite(3.44.0)+pysqlite'
  556. SKIPPED [1] lib/sqlalchemy/testing/config.py:420: 'test/orm/inheritance/test_polymorphic_rel.py::PolymorphicAliasedJoinsTest_sqlite+pysqlite_3_44_0::test_lazyload_related_w_cache_check (call)' : join condition doesn't work w/ this mapping
  557. SKIPPED [1] lib/sqlalchemy/testing/config.py:420: 'test/orm/inheritance/test_polymorphic_rel.py::PolymorphicUnionsTest_sqlite+pysqlite_3_44_0::test_lazyload_related_w_cache_check (call)' : join condition doesn't work w/ this mapping
  558. SKIPPED [1] lib/sqlalchemy/testing/config.py:420: 'test/engine/test_pool.py::PoolEventsTest::test_checkin_event_gc[invalidate_conn_rec-has_terminate-is_asyncio] (call)' : custom function
  559. SKIPPED [1] lib/sqlalchemy/testing/config.py:420: 'test/engine/test_pool.py::PoolEventsTest::test_checkin_event_gc[invalidate_conn_rec-not_has_terminate-is_asyncio] (call)' : custom function
  560. SKIPPED [1] lib/sqlalchemy/testing/config.py:420: 'test/engine/test_pool.py::PoolEventsTest::test_checkin_event_gc[not_invalidate_conn_rec-has_terminate-is_asyncio] (call)' : custom function
  561. SKIPPED [1] lib/sqlalchemy/testing/config.py:420: 'test/engine/test_pool.py::PoolEventsTest::test_checkin_event_gc[not_invalidate_conn_rec-not_has_terminate-is_asyncio] (call)' : custom function
  562. SKIPPED [1] lib/sqlalchemy/testing/config.py:420: 'test/engine/test_pool.py::QueuePoolTest::test_userspace_disconnectionerror_weakref_finalizer[invalidate_conn_rec-detached_gc] (call)' : custom function
  563. SKIPPED [1] lib/sqlalchemy/testing/config.py:420: 'test/engine/test_pool.py::QueuePoolTest::test_userspace_disconnectionerror_weakref_finalizer[not_invalidate_conn_rec-detached_gc] (call)' : custom function
  564. SKIPPED [5] lib/sqlalchemy/testing/config.py:420: 'test.engine.test_processors.CyBooleanProcessorTest' unsupported on any DB implementation 'sqlite(3.44.0)+pysqlite'Cython extensions not installed
  565. SKIPPED [7] lib/sqlalchemy/testing/config.py:420: 'test.engine.test_processors.CyDateProcessorTest' unsupported on any DB implementation 'sqlite(3.44.0)+pysqlite'Cython extensions not installed
  566. SKIPPED [15] lib/sqlalchemy/testing/config.py:420: 'test.engine.test_processors.CyDistillArgsTest' unsupported on any DB implementation 'sqlite(3.44.0)+pysqlite'Cython extensions not installed
  567. SKIPPED [3] lib/sqlalchemy/testing/config.py:420: 'test.dialect.mysql.test_query.AnyAllTest' unsupported on any DB implementation 'sqlite(3.44.0)+pysqlite'
  568. SKIPPED [4] lib/sqlalchemy/testing/config.py:420: 'test.dialect.mysql.test_query.ComputedTest' unsupported on any DB implementation 'sqlite(3.44.0)+pysqlite'
  569. SKIPPED [15] lib/sqlalchemy/testing/config.py:420: 'test.dialect.postgresql.test_query.ExtractTest' unsupported on any DB implementation 'sqlite(3.44.0)+pysqlite'
  570. SKIPPED [2] lib/sqlalchemy/testing/config.py:420: 'test.dialect.postgresql.test_query.FunctionTypingTest' unsupported on any DB implementation 'sqlite(3.44.0)+pysqlite'
  571. SKIPPED [9] lib/sqlalchemy/testing/config.py:420: 'test.dialect.mssql.test_query.IdentityInsertTest' unsupported on any DB implementation 'sqlite(3.44.0)+pysqlite'
  572. SKIPPED [1] lib/sqlalchemy/testing/config.py:420: 'test.dialect.mysql.test_query.IdiosyncrasyTest' unsupported on any DB implementation 'sqlite(3.44.0)+pysqlite'
  573. SKIPPED [10] lib/sqlalchemy/testing/config.py:420: 'test.dialect.postgresql.test_query.InsertTest' unsupported on any DB implementation 'sqlite(3.44.0)+pysqlite'
  574. SKIPPED [8] lib/sqlalchemy/testing/config.py:420: 'MatchTest' skipped by full_text_search_missing
  575. SKIPPED [7] lib/sqlalchemy/testing/config.py:420: 'test.dialect.mysql.test_query.MatchTest' unsupported on any DB implementation 'sqlite(3.44.0)+pysqlite'
  576. SKIPPED [32] lib/sqlalchemy/testing/config.py:420: 'test.dialect.postgresql.test_query.MatchTest' unsupported on any DB implementation 'sqlite(3.44.0)+pysqlite'
  577. SKIPPED [8] lib/sqlalchemy/testing/config.py:420: 'test.dialect.mssql.test_query.QueryTest' unsupported on any DB implementation 'sqlite(3.44.0)+pysqlite'
  578. SKIPPED [1] lib/sqlalchemy/testing/config.py:420: 'test/orm/test_query.py::SessionBindTest::test_column_property_select (call)' : mssql or sqlite
  579. SKIPPED [21] lib/sqlalchemy/testing/config.py:420: 'test.dialect.postgresql.test_query.TableValuedRoundTripTest' unsupported on any DB implementation 'sqlite(3.44.0)+pysqlite'
  580. SKIPPED [5] lib/sqlalchemy/testing/config.py:420: 'test.dialect.mssql.test_query.TableValuedTest' unsupported on any DB implementation 'sqlite(3.44.0)+pysqlite'
  581. SKIPPED [1] lib/sqlalchemy/testing/config.py:420: 'test.dialect.postgresql.test_query.TupleTest' unsupported on any DB implementation 'sqlite(3.44.0)+pysqlite'
  582. SKIPPED [1] lib/sqlalchemy/testing/config.py:420: 'test/engine/test_reconnect.py::RealReconnectTest_sqlite+pysqlite_3_44_0::test_multiple_invalidate (call)' : sqlite
  583. SKIPPED [1] lib/sqlalchemy/testing/config.py:420: 'test/engine/test_reconnect.py::RealReconnectTest_sqlite+pysqlite_3_44_0::test_rollback_on_invalid_savepoint (call)' : savepoints not supported
  584. SKIPPED [1] lib/sqlalchemy/testing/config.py:420: 'test/engine/test_reconnect.py::RealReconnectTest_sqlite+pysqlite_3_44_0::test_rollback_on_invalid_twophase (call)' : two-phase xact not supported by drivers or two-phase xact not supported by database or max_prepared_transactions not available or zero
  585. SKIPPED [4] lib/sqlalchemy/testing/config.py:420: 'test.engine.test_reconnect.ReconnectRecipeTest' unsupported on any DB implementation 'sqlite(3.44.0)+pysqlite'
  586. SKIPPED [12] lib/sqlalchemy/testing/config.py:420: 'test.dialect.oracle.test_reflection.AdditionalReflectionTests' unsupported on any DB implementation 'sqlite(3.44.0)+pysqlite'
  587. SKIPPED [6] lib/sqlalchemy/testing/config.py:420: 'test.dialect.oracle.test_reflection.ConstraintTest' unsupported on any DB implementation 'sqlite(3.44.0)+pysqlite'
  588. SKIPPED [1] lib/sqlalchemy/testing/config.py:420: 'test.dialect.oracle.test_reflection.DBLinkReflectionTest' unsupported on any DB implementation 'sqlite(3.44.0)+pysqlite'
  589. SKIPPED [13] lib/sqlalchemy/testing/config.py:420: 'test.dialect.postgresql.test_reflection.DomainReflectionTest' unsupported on any DB implementation 'sqlite(3.44.0)+pysqlite'
  590. SKIPPED [1] lib/sqlalchemy/testing/config.py:420: 'test.dialect.oracle.test_reflection.DontReflectIOTTest' unsupported on any DB implementation 'sqlite(3.44.0)+pysqlite'
  591. SKIPPED [6] lib/sqlalchemy/testing/config.py:420: 'test.dialect.postgresql.test_reflection.ForeignTableReflectionTest' unsupported on any DB implementation 'sqlite(3.44.0)+pysqlite'
  592. SKIPPED [1] lib/sqlalchemy/testing/config.py:420: 'test.engine.test_reflection.IdentityColumnTest' unsupported on any DB implementation 'sqlite(3.44.0)+pysqlite'not postgresql >= (10,) and not oracle >= (12,) and not mssql
  593. SKIPPED [2] lib/sqlalchemy/testing/config.py:420: 'test.dialect.mssql.test_reflection.IdentityReflectionTest' unsupported on any DB implementation 'sqlite(3.44.0)+pysqlite'
  594. SKIPPED [1] lib/sqlalchemy/testing/config.py:420: 'test.dialect.oracle.test_reflection.IdentityReflectionTest' unsupported on any DB implementation 'sqlite(3.44.0)+pysqlite'
  595. SKIPPED [3] lib/sqlalchemy/testing/config.py:420: 'test.dialect.postgresql.test_reflection.IdentityReflectionTest' unsupported on any DB implementation 'sqlite(3.44.0)+pysqlite'
  596. SKIPPED [14] lib/sqlalchemy/testing/config.py:420: 'test.dialect.postgresql.test_reflection.IntervalReflectionTest' unsupported on any DB implementation 'sqlite(3.44.0)+pysqlite'
  597. SKIPPED [16] lib/sqlalchemy/testing/config.py:420: 'test.dialect.postgresql.test_reflection.MaterializedViewReflectionTest' unsupported on any DB implementation 'sqlite(3.44.0)+pysqlite'
  598. SKIPPED [10] lib/sqlalchemy/testing/config.py:420: 'test.dialect.oracle.test_reflection.MultiSchemaTest' unsupported on any DB implementation 'sqlite(3.44.0)+pysqlite'
  599. SKIPPED [5] lib/sqlalchemy/testing/config.py:420: 'test.dialect.postgresql.test_reflection.PartitionedReflectionTest' unsupported on any DB implementation 'sqlite(3.44.0)+pysqlite'
  600. SKIPPED [1] lib/sqlalchemy/testing/config.py:420: 'test.dialect.mssql.test_reflection.ReflectHugeViewTest' unsupported on any DB implementation 'sqlite(3.44.0)+pysqlite'
  601. SKIPPED [49] lib/sqlalchemy/testing/config.py:420: 'test.dialect.postgresql.test_reflection.ReflectionTest' unsupported on any DB implementation 'sqlite(3.44.0)+pysqlite'
  602. SKIPPED [45] lib/sqlalchemy/testing/config.py:420: 'test.dialect.mssql.test_reflection.ReflectionTest' unsupported on any DB implementation 'sqlite(3.44.0)+pysqlite'
  603. SKIPPED [33] lib/sqlalchemy/testing/config.py:420: 'test.dialect.mysql.test_reflection.ReflectionTest' unsupported on any DB implementation 'sqlite(3.44.0)+pysqlite'
  604. SKIPPED [1] lib/sqlalchemy/testing/config.py:420: 'test/engine/test_reflection.py::ReflectionTest_sqlite+pysqlite_3_44_0::test_comment_reflection (call)' : not postgresql and not mysql and not mariadb and not oracle and not mssql
  605. SKIPPED [1] lib/sqlalchemy/testing/config.py:420: 'test/engine/test_reflection.py::ReflectionTest_sqlite+pysqlite_3_44_0::test_fk_options (call)' : not postgresql and not mysql
  606. SKIPPED [1] lib/sqlalchemy/testing/config.py:420: 'test/engine/test_reflection.py::ReflectionTest_sqlite+pysqlite_3_44_0::test_unknown_types (call)' : sqlite
  607. SKIPPED [1] test/engine/test_reflection.py:2036: 'test/engine/test_reflection.py::ReverseCasingReflectTest_sqlite+pysqlite_3_44_0::test_direct_quoting (setup)' : Backend does not require denormalized names.
  608. SKIPPED [6] lib/sqlalchemy/testing/config.py:420: 'test.dialect.oracle.test_reflection.RoundTripIndexTest' unsupported on any DB implementation 'sqlite(3.44.0)+pysqlite'
  609. SKIPPED [1] lib/sqlalchemy/testing/config.py:420: 'test/engine/test_reflection.py::SchemaTest_sqlite+pysqlite_3_44_0::test_blank_schema_arg (call)' : not postgresql
  610. SKIPPED [1] lib/sqlalchemy/testing/config.py:420: 'test/engine/test_reflection.py::SchemaTest_sqlite+pysqlite_3_44_0::test_reflect_all_schemas_default_overlap (call)' : not postgresql
  611. SKIPPED [4] lib/sqlalchemy/testing/config.py:420: 'test.dialect.oracle.test_reflection.SystemTableTablenamesTest' unsupported on any DB implementation 'sqlite(3.44.0)+pysqlite'
  612. SKIPPED [3] lib/sqlalchemy/testing/config.py:420: 'test.dialect.oracle.test_reflection.TableReflectionTest' unsupported on any DB implementation 'sqlite(3.44.0)+pysqlite'
  613. SKIPPED [2] lib/sqlalchemy/testing/config.py:420: 'test.dialect.postgresql.test_reflection.TestReflectDifficultColTypes' unsupported on any DB implementation 'sqlite(3.44.0)+pysqlite'
  614. SKIPPED [7] lib/sqlalchemy/testing/config.py:420: 'test.dialect.mysql.test_reflection.TypeReflectionTest' unsupported on any DB implementation 'sqlite(3.44.0)+pysqlite'
  615. SKIPPED [6] lib/sqlalchemy/testing/config.py:420: 'test.dialect.oracle.test_reflection.TypeReflectionTest' unsupported on any DB implementation 'sqlite(3.44.0)+pysqlite'
  616. SKIPPED [7] lib/sqlalchemy/testing/config.py:420: 'test.dialect.oracle.test_reflection.ViewReflectionTest' unsupported on any DB implementation 'sqlite(3.44.0)+pysqlite'
  617. SKIPPED [1] lib/sqlalchemy/testing/config.py:420: 'test/base/test_result.py::ResultTupleTest::test_serialize_cy_py_cy[cy_to_py] (call)' : Cython extensions not installed
  618. SKIPPED [1] lib/sqlalchemy/testing/config.py:420: 'test/base/test_result.py::ResultTupleTest::test_serialize_cy_py_cy[py_to_cy] (call)' : Cython extensions not installed
  619. SKIPPED [1] lib/sqlalchemy/testing/config.py:420: 'test/sql/test_resultset.py::CursorResultTest_sqlite+pysqlite_3_44_0::test_row_c_sequence_check (call)' : Cython extensions not installed
  620. SKIPPED [1] lib/sqlalchemy/testing/config.py:420: 'test.sql.test_returning.SequenceReturningTest' unsupported on any DB implementation 'sqlite(3.44.0)+pysqlite'no sequence support
  621. SKIPPED [1] lib/sqlalchemy/testing/config.py:420: 'test.ext.asyncio.test_scoping_py3k.AsyncScopedSessionTest' unsupported on any DB implementation 'sqlite(3.44.0)+pysqlite'Async dialect required, custom function
  622. SKIPPED [1] lib/sqlalchemy/testing/config.py:420: 'test.ext.asyncio.test_scoping_py3k.AsyncScopedSessionTest' unsupported on any DB implementation 'sqlite(3.44.0)+pysqlite'custom function, Async dialect required
  623. SKIPPED [3] lib/sqlalchemy/testing/config.py:420: 'test.dialect.mssql.test_sequence.SequenceTest' unsupported on any DB implementation 'sqlite(3.44.0)+pysqlite'
  624. SKIPPED [4] lib/sqlalchemy/testing/config.py:420: 'test.sql.test_sequences.SequenceAsServerDefaultTest' unsupported on any DB implementation 'sqlite(3.44.0)+pysqlite'no sequence support, doesn't support sequences as a server side default. and doesn't support sequences as a server side default. and doesn't support sequences as a server side default.
  625. SKIPPED [2] lib/sqlalchemy/testing/config.py:420: 'test.sql.test_sequences.SequenceAsServerDefaultTest' unsupported on any DB implementation 'sqlite(3.44.0)+pysqlite'doesn't support sequences as a server side default. and doesn't support sequences as a server side default. and doesn't support sequences as a server side default., no sequence support
  626. SKIPPED [20] lib/sqlalchemy/testing/config.py:420: 'test.sql.test_sequences.SequenceExecTest' unsupported on any DB implementation 'sqlite(3.44.0)+pysqlite'no sequence support
  627. SKIPPED [11] lib/sqlalchemy/testing/config.py:420: 'test.sql.test_sequences.SequenceTest' unsupported on any DB implementation 'sqlite(3.44.0)+pysqlite'no sequence support
  628. SKIPPED [4] lib/sqlalchemy/testing/config.py:420: 'test.sql.test_sequences.TableBoundSequenceTest' unsupported on any DB implementation 'sqlite(3.44.0)+pysqlite'no sequence support
  629. SKIPPED [1] lib/sqlalchemy/testing/config.py:420: 'test/orm/test_session.py::ExecutionTest_sqlite+pysqlite_3_44_0::test_sequence_execute[False-False] (call)' : no sequence support
  630. SKIPPED [1] lib/sqlalchemy/testing/config.py:420: 'test/orm/test_session.py::ExecutionTest_sqlite+pysqlite_3_44_0::test_sequence_execute[False-True] (call)' : no sequence support
  631. SKIPPED [1] lib/sqlalchemy/testing/config.py:420: 'test/orm/test_session.py::ExecutionTest_sqlite+pysqlite_3_44_0::test_sequence_execute[True-False] (call)' : no sequence support
  632. SKIPPED [1] lib/sqlalchemy/testing/config.py:420: 'test/orm/test_session.py::ExecutionTest_sqlite+pysqlite_3_44_0::test_sequence_execute[True-True] (call)' : no sequence support
  633. SKIPPED [1] lib/sqlalchemy/testing/config.py:420: 'test/orm/test_session.py::SessionStateTest::test_autoflush (call)' : sqlite
  634. SKIPPED [1] lib/sqlalchemy/testing/config.py:420: 'test/orm/test_session.py::SessionStateTest::test_autoflush_unbound (call)' : sqlite
  635. SKIPPED [1] lib/sqlalchemy/testing/config.py:420: 'test/orm/test_session.py::TransScopingTest::test_transaction (call)' : sqlite
  636. SKIPPED [1] lib/sqlalchemy/testing/config.py:420: 'test.ext.asyncio.test_session_py3k.AsyncAttrsTest' unsupported on any DB implementation 'sqlite(3.44.0)+pysqlite'custom function, Async dialect required
  637. SKIPPED [2] lib/sqlalchemy/testing/config.py:420: 'test.ext.asyncio.test_session_py3k.AsyncAttrsTest' unsupported on any DB implementation 'sqlite(3.44.0)+pysqlite'Async dialect required, custom function
  638. SKIPPED [1] lib/sqlalchemy/testing/config.py:420: 'test.ext.asyncio.test_session_py3k.AsyncCascadesTest' unsupported on any DB implementation 'sqlite(3.44.0)+pysqlite'Async dialect required, custom function
  639. SKIPPED [1] lib/sqlalchemy/testing/config.py:420: 'test.ext.asyncio.test_session_py3k.AsyncEventTest' unsupported on any DB implementation 'sqlite(3.44.0)+pysqlite'custom function, Async dialect required
  640. SKIPPED [1] lib/sqlalchemy/testing/config.py:420: 'test.ext.asyncio.test_session_py3k.AsyncEventTest' unsupported on any DB implementation 'sqlite(3.44.0)+pysqlite'Async dialect required, custom function
  641. SKIPPED [2] lib/sqlalchemy/testing/config.py:420: 'test.ext.asyncio.test_session_py3k.AsyncORMBehaviorsTest' unsupported on any DB implementation 'sqlite(3.44.0)+pysqlite'custom function, Async dialect required
  642. SKIPPED [6] lib/sqlalchemy/testing/config.py:420: 'test.ext.asyncio.test_session_py3k.AsyncProxyTest' unsupported on any DB implementation 'sqlite(3.44.0)+pysqlite'Async dialect required, custom function
  643. SKIPPED [5] lib/sqlalchemy/testing/config.py:420: 'test.ext.asyncio.test_session_py3k.AsyncProxyTest' unsupported on any DB implementation 'sqlite(3.44.0)+pysqlite'custom function, Async dialect required
  644. SKIPPED [3] lib/sqlalchemy/testing/config.py:420: 'test.ext.asyncio.test_session_py3k.AsyncSessionQueryTest' unsupported on any DB implementation 'sqlite(3.44.0)+pysqlite'Async dialect required, custom function
  645. SKIPPED [11] lib/sqlalchemy/testing/config.py:420: 'test.ext.asyncio.test_session_py3k.AsyncSessionQueryTest' unsupported on any DB implementation 'sqlite(3.44.0)+pysqlite'custom function, Async dialect required
  646. SKIPPED [5] lib/sqlalchemy/testing/config.py:420: 'test.ext.asyncio.test_session_py3k.AsyncSessionTest' unsupported on any DB implementation 'sqlite(3.44.0)+pysqlite'custom function, Async dialect required
  647. SKIPPED [2] lib/sqlalchemy/testing/config.py:420: 'test.ext.asyncio.test_session_py3k.AsyncSessionTest' unsupported on any DB implementation 'sqlite(3.44.0)+pysqlite'Async dialect required, custom function
  648. SKIPPED [16] lib/sqlalchemy/testing/config.py:420: 'test.ext.asyncio.test_session_py3k.AsyncSessionTransactionTest' unsupported on any DB implementation 'sqlite(3.44.0)+pysqlite'Async dialect required, custom function
  649. SKIPPED [7] lib/sqlalchemy/testing/config.py:420: 'test.ext.asyncio.test_session_py3k.AsyncSessionTransactionTest' unsupported on any DB implementation 'sqlite(3.44.0)+pysqlite'custom function, Async dialect required
  650. SKIPPED [3] lib/sqlalchemy/testing/config.py:420: 'test.ext.asyncio.test_session_py3k.OverrideSyncSession' unsupported on any DB implementation 'sqlite(3.44.0)+pysqlite'custom function, Async dialect required
  651. SKIPPED [3] lib/sqlalchemy/testing/config.py:420: 'test.ext.asyncio.test_session_py3k.OverrideSyncSession' unsupported on any DB implementation 'sqlite(3.44.0)+pysqlite'Async dialect required, custom function
  652. SKIPPED [1] lib/sqlalchemy/testing/config.py:420: 'test/dialect/test_sqlite.py::DialectTest_sqlite+pysqlite_3_44_0::test_pysqlcipher_connects (call)' : not sqlite+pysqlcipher
  653. SKIPPED [3] lib/sqlalchemy/testing/config.py:420: 'sqlalchemy.testing.suite.test_types.ArrayTest' unsupported on any DB implementation 'sqlite(3.44.0)+pysqlite'custom function
  654. SKIPPED [1] lib/sqlalchemy/testing/config.py:420: 'test/dialect/test_suite.py::AutocommitIsolationTest_sqlite+pysqlite_3_44_0::test_dialect_autocommit_is_restored[not_use_dialect_setting] (call)' : custom function or +aiosqlite
  655. SKIPPED [1] lib/sqlalchemy/testing/config.py:420: 'test/dialect/test_suite.py::AutocommitIsolationTest_sqlite+pysqlite_3_44_0::test_dialect_autocommit_is_restored[use_dialect_setting] (call)' : custom function or +aiosqlite
  656. SKIPPED [1] lib/sqlalchemy/testing/config.py:420: 'test/dialect/test_suite.py::CTETest_sqlite+pysqlite_3_44_0::test_delete_from_round_trip (call)' : marked as skip
  657. SKIPPED [1] lib/sqlalchemy/testing/config.py:420: 'test/dialect/test_suite.py::CTETest_sqlite+pysqlite_3_44_0::test_delete_scalar_subq_round_trip (call)' : not postgresql and not mssql
  658. SKIPPED [1] lib/sqlalchemy/testing/config.py:420: 'test/dialect/test_suite.py::CTETest_sqlite+pysqlite_3_44_0::test_update_from_round_trip (call)' : not postgresql and not mssql
  659. SKIPPED [1] lib/sqlalchemy/testing/config.py:420: 'test/dialect/test_suite.py::ComponentReflectionTestExtra_sqlite+pysqlite_3_44_0::test_reflect_covering_index (call)' : not postgresql >= (11,) and not mssql
  660. SKIPPED [1] lib/sqlalchemy/testing/config.py:420: 'test/dialect/test_suite.py::ComponentReflectionTest_sqlite+pysqlite_3_44_0::test_comments_unicode (call)' : not postgresql and not mysql and not mariadb and not oracle and not mssql
  661. SKIPPED [1] lib/sqlalchemy/testing/config.py:420: 'test/dialect/test_suite.py::ComponentReflectionTest_sqlite+pysqlite_3_44_0::test_comments_unicode_full (call)' : not postgresql and not oracle and not mssql
  662. SKIPPED [1] lib/sqlalchemy/testing/config.py:420: 'test/dialect/test_suite.py::ComponentReflectionTest_sqlite+pysqlite_3_44_0::test_get_comments (call)' : not postgresql and not mysql and not mariadb and not oracle and not mssql
  663. SKIPPED [1] lib/sqlalchemy/testing/config.py:420: 'test/dialect/test_suite.py::ComponentReflectionTest_sqlite+pysqlite_3_44_0::test_get_comments_with_schema (call)' : not postgresql and not mysql and not mariadb and not oracle and not mssql
  664. SKIPPED [1] lib/sqlalchemy/testing/config.py:420: 'test/dialect/test_suite.py::ComponentReflectionTest_sqlite+pysqlite_3_44_0::test_get_inter_schema_foreign_keys (call)' : not postgresql and not mysql and not mariadb and not mssql
  665. SKIPPED [1] lib/sqlalchemy/testing/config.py:420: 'test/dialect/test_suite.py::ComponentReflectionTest_sqlite+pysqlite_3_44_0::test_get_multi_table_comment[False-ObjectKind.ANY-ObjectScope.ANY-<lambda>-_exclusions_01] (call)' : not postgresql and not mysql and not mariadb and not oracle and not mssql
  666. SKIPPED [1] lib/sqlalchemy/testing/config.py:420: 'test/dialect/test_suite.py::ComponentReflectionTest_sqlite+pysqlite_3_44_0::test_get_multi_table_comment[False-ObjectKind.ANY-ObjectScope.ANY-None-_exclusions_00] (call)' : not postgresql and not mysql and not mariadb and not oracle and not mssql
  667. SKIPPED [1] lib/sqlalchemy/testing/config.py:420: 'test/dialect/test_suite.py::ComponentReflectionTest_sqlite+pysqlite_3_44_0::test_get_multi_table_comment[False-ObjectKind.ANY-ObjectScope.DEFAULT-<lambda>-_exclusions_01] (call)' : not postgresql and not mysql and not mariadb and not oracle and not mssql
  668. SKIPPED [1] lib/sqlalchemy/testing/config.py:420: 'test/dialect/test_suite.py::ComponentReflectionTest_sqlite+pysqlite_3_44_0::test_get_multi_table_comment[False-ObjectKind.ANY-ObjectScope.DEFAULT-None-_exclusions_00] (call)' : not postgresql and not mysql and not mariadb and not oracle and not mssql
  669. SKIPPED [1] lib/sqlalchemy/testing/config.py:420: 'test/dialect/test_suite.py::ComponentReflectionTest_sqlite+pysqlite_3_44_0::test_get_multi_table_comment[False-ObjectKind.ANY-ObjectScope.TEMPORARY-<lambda>-_exclusions_01] (call)' : not postgresql and not mysql and not mariadb and not oracle and not mssql
  670. SKIPPED [1] lib/sqlalchemy/testing/config.py:420: 'test/dialect/test_suite.py::ComponentReflectionTest_sqlite+pysqlite_3_44_0::test_get_multi_table_comment[False-ObjectKind.ANY-ObjectScope.TEMPORARY-None-_exclusions_00] (call)' : not postgresql and not mysql and not mariadb and not oracle and not mssql
  671. SKIPPED [1] lib/sqlalchemy/testing/config.py:420: 'test/dialect/test_suite.py::ComponentReflectionTest_sqlite+pysqlite_3_44_0::test_get_multi_table_comment[False-ObjectKind.ANY_VIEW-ObjectScope.ANY-<lambda>-_exclusions_01] (call)' : not postgresql and not mysql and not mariadb and not oracle and not mssql
  672. SKIPPED [1] lib/sqlalchemy/testing/config.py:420: 'test/dialect/test_suite.py::ComponentReflectionTest_sqlite+pysqlite_3_44_0::test_get_multi_table_comment[False-ObjectKind.ANY_VIEW-ObjectScope.ANY-None-_exclusions_00] (call)' : not postgresql and not mysql and not mariadb and not oracle and not mssql
  673. SKIPPED [1] lib/sqlalchemy/testing/config.py:420: 'test/dialect/test_suite.py::ComponentReflectionTest_sqlite+pysqlite_3_44_0::test_get_multi_table_comment[False-ObjectKind.ANY_VIEW-ObjectScope.DEFAULT-<lambda>-_exclusions_01] (call)' : not postgresql and not mysql and not mariadb and not oracle and not mssql
  674. SKIPPED [1] lib/sqlalchemy/testing/config.py:420: 'test/dialect/test_suite.py::ComponentReflectionTest_sqlite+pysqlite_3_44_0::test_get_multi_table_comment[False-ObjectKind.ANY_VIEW-ObjectScope.DEFAULT-None-_exclusions_00] (call)' : not postgresql and not mysql and not mariadb and not oracle and not mssql
  675. SKIPPED [1] lib/sqlalchemy/testing/config.py:420: 'test/dialect/test_suite.py::ComponentReflectionTest_sqlite+pysqlite_3_44_0::test_get_multi_table_comment[False-ObjectKind.ANY_VIEW-ObjectScope.TEMPORARY-<lambda>-_exclusions_01] (call)' : not postgresql and not mysql and not mariadb and not oracle and not mssql
  676. SKIPPED [1] lib/sqlalchemy/testing/config.py:420: 'test/dialect/test_suite.py::ComponentReflectionTest_sqlite+pysqlite_3_44_0::test_get_multi_table_comment[False-ObjectKind.ANY_VIEW-ObjectScope.TEMPORARY-None-_exclusions_00] (call)' : not postgresql and not mysql and not mariadb and not oracle and not mssql
  677. SKIPPED [1] lib/sqlalchemy/testing/config.py:420: 'test/dialect/test_suite.py::ComponentReflectionTest_sqlite+pysqlite_3_44_0::test_get_multi_table_comment[False-ObjectKind.MATERIALIZED_VIEW-ObjectScope.ANY-<lambda>-_exclusions_01] (call)' : not postgresql and not mysql and not mariadb and not oracle and not mssql
  678. SKIPPED [1] lib/sqlalchemy/testing/config.py:420: 'test/dialect/test_suite.py::ComponentReflectionTest_sqlite+pysqlite_3_44_0::test_get_multi_table_comment[False-ObjectKind.MATERIALIZED_VIEW-ObjectScope.ANY-None-_exclusions_00] (call)' : not postgresql and not mysql and not mariadb and not oracle and not mssql
  679. SKIPPED [1] lib/sqlalchemy/testing/config.py:420: 'test/dialect/test_suite.py::ComponentReflectionTest_sqlite+pysqlite_3_44_0::test_get_multi_table_comment[False-ObjectKind.MATERIALIZED_VIEW-ObjectScope.DEFAULT-<lambda>-_exclusions_01] (call)' : not postgresql and not mysql and not mariadb and not oracle and not mssql
  680. SKIPPED [1] lib/sqlalchemy/testing/config.py:420: 'test/dialect/test_suite.py::ComponentReflectionTest_sqlite+pysqlite_3_44_0::test_get_multi_table_comment[False-ObjectKind.MATERIALIZED_VIEW-ObjectScope.DEFAULT-None-_exclusions_00] (call)' : not postgresql and not mysql and not mariadb and not oracle and not mssql
  681. SKIPPED [1] lib/sqlalchemy/testing/config.py:420: 'test/dialect/test_suite.py::ComponentReflectionTest_sqlite+pysqlite_3_44_0::test_get_multi_table_comment[False-ObjectKind.MATERIALIZED_VIEW-ObjectScope.TEMPORARY-<lambda>-_exclusions_01] (call)' : not postgresql and not mysql and not mariadb and not oracle and not mssql
  682. SKIPPED [1] lib/sqlalchemy/testing/config.py:420: 'test/dialect/test_suite.py::ComponentReflectionTest_sqlite+pysqlite_3_44_0::test_get_multi_table_comment[False-ObjectKind.MATERIALIZED_VIEW-ObjectScope.TEMPORARY-None-_exclusions_00] (call)' : not postgresql and not mysql and not mariadb and not oracle and not mssql
  683. SKIPPED [1] lib/sqlalchemy/testing/config.py:420: 'test/dialect/test_suite.py::ComponentReflectionTest_sqlite+pysqlite_3_44_0::test_get_multi_table_comment[False-ObjectKind.TABLE-ObjectScope.ANY-<lambda>-_exclusions_01] (call)' : not postgresql and not mysql and not mariadb and not oracle and not mssql
  684. SKIPPED [1] lib/sqlalchemy/testing/config.py:420: 'test/dialect/test_suite.py::ComponentReflectionTest_sqlite+pysqlite_3_44_0::test_get_multi_table_comment[False-ObjectKind.TABLE-ObjectScope.ANY-None-_exclusions_00] (call)' : not postgresql and not mysql and not mariadb and not oracle and not mssql
  685. SKIPPED [1] lib/sqlalchemy/testing/config.py:420: 'test/dialect/test_suite.py::ComponentReflectionTest_sqlite+pysqlite_3_44_0::test_get_multi_table_comment[False-ObjectKind.TABLE-ObjectScope.DEFAULT-<lambda>-_exclusions_01] (call)' : not postgresql and not mysql and not mariadb and not oracle and not mssql
  686. SKIPPED [1] lib/sqlalchemy/testing/config.py:420: 'test/dialect/test_suite.py::ComponentReflectionTest_sqlite+pysqlite_3_44_0::test_get_multi_table_comment[False-ObjectKind.TABLE-ObjectScope.DEFAULT-None-_exclusions_00] (call)' : not postgresql and not mysql and not mariadb and not oracle and not mssql
  687. SKIPPED [1] lib/sqlalchemy/testing/config.py:420: 'test/dialect/test_suite.py::ComponentReflectionTest_sqlite+pysqlite_3_44_0::test_get_multi_table_comment[False-ObjectKind.TABLE-ObjectScope.TEMPORARY-<lambda>-_exclusions_01] (call)' : not postgresql and not mysql and not mariadb and not oracle and not mssql
  688. SKIPPED [1] lib/sqlalchemy/testing/config.py:420: 'test/dialect/test_suite.py::ComponentReflectionTest_sqlite+pysqlite_3_44_0::test_get_multi_table_comment[False-ObjectKind.TABLE-ObjectScope.TEMPORARY-None-_exclusions_00] (call)' : not postgresql and not mysql and not mariadb and not oracle and not mssql
  689. SKIPPED [1] lib/sqlalchemy/testing/config.py:420: 'test/dialect/test_suite.py::ComponentReflectionTest_sqlite+pysqlite_3_44_0::test_get_multi_table_comment[False-ObjectKind.TABLE|MATERIALIZED_VIEW-ObjectScope.ANY-<lambda>-_exclusions_01] (call)' : not postgresql and not mysql and not mariadb and not oracle and not mssql
  690. SKIPPED [1] lib/sqlalchemy/testing/config.py:420: 'test/dialect/test_suite.py::ComponentReflectionTest_sqlite+pysqlite_3_44_0::test_get_multi_table_comment[False-ObjectKind.TABLE|MATERIALIZED_VIEW-ObjectScope.ANY-None-_exclusions_00] (call)' : not postgresql and not mysql and not mariadb and not oracle and not mssql
  691. SKIPPED [1] lib/sqlalchemy/testing/config.py:420: 'test/dialect/test_suite.py::ComponentReflectionTest_sqlite+pysqlite_3_44_0::test_get_multi_table_comment[False-ObjectKind.TABLE|MATERIALIZED_VIEW-ObjectScope.DEFAULT-<lambda>-_exclusions_01] (call)' : not postgresql and not mysql and not mariadb and not oracle and not mssql
  692. SKIPPED [1] lib/sqlalchemy/testing/config.py:420: 'test/dialect/test_suite.py::ComponentReflectionTest_sqlite+pysqlite_3_44_0::test_get_multi_table_comment[False-ObjectKind.TABLE|MATERIALIZED_VIEW-ObjectScope.DEFAULT-None-_exclusions_00] (call)' : not postgresql and not mysql and not mariadb and not oracle and not mssql
  693. SKIPPED [1] lib/sqlalchemy/testing/config.py:420: 'test/dialect/test_suite.py::ComponentReflectionTest_sqlite+pysqlite_3_44_0::test_get_multi_table_comment[False-ObjectKind.TABLE|MATERIALIZED_VIEW-ObjectScope.TEMPORARY-<lambda>-_exclusions_01] (call)' : not postgresql and not mysql and not mariadb and not oracle and not mssql
  694. SKIPPED [1] lib/sqlalchemy/testing/config.py:420: 'test/dialect/test_suite.py::ComponentReflectionTest_sqlite+pysqlite_3_44_0::test_get_multi_table_comment[False-ObjectKind.TABLE|MATERIALIZED_VIEW-ObjectScope.TEMPORARY-None-_exclusions_00] (call)' : not postgresql and not mysql and not mariadb and not oracle and not mssql
  695. SKIPPED [1] lib/sqlalchemy/testing/config.py:420: 'test/dialect/test_suite.py::ComponentReflectionTest_sqlite+pysqlite_3_44_0::test_get_multi_table_comment[False-ObjectKind.TABLE|VIEW-ObjectScope.ANY-<lambda>-_exclusions_01] (call)' : not postgresql and not mysql and not mariadb and not oracle and not mssql
  696. SKIPPED [1] lib/sqlalchemy/testing/config.py:420: 'test/dialect/test_suite.py::ComponentReflectionTest_sqlite+pysqlite_3_44_0::test_get_multi_table_comment[False-ObjectKind.TABLE|VIEW-ObjectScope.ANY-None-_exclusions_00] (call)' : not postgresql and not mysql and not mariadb and not oracle and not mssql
  697. SKIPPED [1] lib/sqlalchemy/testing/config.py:420: 'test/dialect/test_suite.py::ComponentReflectionTest_sqlite+pysqlite_3_44_0::test_get_multi_table_comment[False-ObjectKind.TABLE|VIEW-ObjectScope.DEFAULT-<lambda>-_exclusions_01] (call)' : not postgresql and not mysql and not mariadb and not oracle and not mssql
  698. SKIPPED [1] lib/sqlalchemy/testing/config.py:420: 'test/dialect/test_suite.py::ComponentReflectionTest_sqlite+pysqlite_3_44_0::test_get_multi_table_comment[False-ObjectKind.TABLE|VIEW-ObjectScope.DEFAULT-None-_exclusions_00] (call)' : not postgresql and not mysql and not mariadb and not oracle and not mssql
  699. SKIPPED [1] lib/sqlalchemy/testing/config.py:420: 'test/dialect/test_suite.py::ComponentReflectionTest_sqlite+pysqlite_3_44_0::test_get_multi_table_comment[False-ObjectKind.TABLE|VIEW-ObjectScope.TEMPORARY-<lambda>-_exclusions_01] (call)' : not postgresql and not mysql and not mariadb and not oracle and not mssql
  700. SKIPPED [1] lib/sqlalchemy/testing/config.py:420: 'test/dialect/test_suite.py::ComponentReflectionTest_sqlite+pysqlite_3_44_0::test_get_multi_table_comment[False-ObjectKind.TABLE|VIEW-ObjectScope.TEMPORARY-None-_exclusions_00] (call)' : not postgresql and not mysql and not mariadb and not oracle and not mssql
  701. SKIPPED [1] lib/sqlalchemy/testing/config.py:420: 'test/dialect/test_suite.py::ComponentReflectionTest_sqlite+pysqlite_3_44_0::test_get_multi_table_comment[False-ObjectKind.VIEW-ObjectScope.ANY-<lambda>-_exclusions_01] (call)' : not postgresql and not mysql and not mariadb and not oracle and not mssql
  702. SKIPPED [1] lib/sqlalchemy/testing/config.py:420: 'test/dialect/test_suite.py::ComponentReflectionTest_sqlite+pysqlite_3_44_0::test_get_multi_table_comment[False-ObjectKind.VIEW-ObjectScope.ANY-None-_exclusions_00] (call)' : not postgresql and not mysql and not mariadb and not oracle and not mssql
  703. SKIPPED [1] lib/sqlalchemy/testing/config.py:420: 'test/dialect/test_suite.py::ComponentReflectionTest_sqlite+pysqlite_3_44_0::test_get_multi_table_comment[False-ObjectKind.VIEW-ObjectScope.DEFAULT-<lambda>-_exclusions_01] (call)' : not postgresql and not mysql and not mariadb and not oracle and not mssql
  704. SKIPPED [1] lib/sqlalchemy/testing/config.py:420: 'test/dialect/test_suite.py::ComponentReflectionTest_sqlite+pysqlite_3_44_0::test_get_multi_table_comment[False-ObjectKind.VIEW-ObjectScope.DEFAULT-None-_exclusions_00] (call)' : not postgresql and not mysql and not mariadb and not oracle and not mssql
  705. SKIPPED [1] lib/sqlalchemy/testing/config.py:420: 'test/dialect/test_suite.py::ComponentReflectionTest_sqlite+pysqlite_3_44_0::test_get_multi_table_comment[False-ObjectKind.VIEW-ObjectScope.TEMPORARY-<lambda>-_exclusions_01] (call)' : not postgresql and not mysql and not mariadb and not oracle and not mssql
  706. SKIPPED [1] lib/sqlalchemy/testing/config.py:420: 'test/dialect/test_suite.py::ComponentReflectionTest_sqlite+pysqlite_3_44_0::test_get_multi_table_comment[False-ObjectKind.VIEW-ObjectScope.TEMPORARY-None-_exclusions_00] (call)' : not postgresql and not mysql and not mariadb and not oracle and not mssql
  707. SKIPPED [1] lib/sqlalchemy/testing/config.py:420: 'test/dialect/test_suite.py::ComponentReflectionTest_sqlite+pysqlite_3_44_0::test_get_multi_table_comment[True-ObjectKind.ANY-ObjectScope.ANY-<lambda>-_exclusions_01] (call)' : not postgresql and not mysql and not mariadb and not oracle and not mssql
  708. SKIPPED [1] lib/sqlalchemy/testing/config.py:420: 'test/dialect/test_suite.py::ComponentReflectionTest_sqlite+pysqlite_3_44_0::test_get_multi_table_comment[True-ObjectKind.ANY-ObjectScope.ANY-None-_exclusions_00] (call)' : not postgresql and not mysql and not mariadb and not oracle and not mssql
  709. SKIPPED [1] lib/sqlalchemy/testing/config.py:420: 'test/dialect/test_suite.py::ComponentReflectionTest_sqlite+pysqlite_3_44_0::test_get_multi_table_comment[True-ObjectKind.ANY-ObjectScope.DEFAULT-<lambda>-_exclusions_01] (call)' : not postgresql and not mysql and not mariadb and not oracle and not mssql
  710. SKIPPED [1] lib/sqlalchemy/testing/config.py:420: 'test/dialect/test_suite.py::ComponentReflectionTest_sqlite+pysqlite_3_44_0::test_get_multi_table_comment[True-ObjectKind.ANY-ObjectScope.DEFAULT-None-_exclusions_00] (call)' : not postgresql and not mysql and not mariadb and not oracle and not mssql
  711. SKIPPED [1] lib/sqlalchemy/testing/config.py:420: 'test/dialect/test_suite.py::ComponentReflectionTest_sqlite+pysqlite_3_44_0::test_get_multi_table_comment[True-ObjectKind.ANY-ObjectScope.TEMPORARY-<lambda>-_exclusions_01] (call)' : not postgresql and not mysql and not mariadb and not oracle and not mssql
  712. SKIPPED [1] lib/sqlalchemy/testing/config.py:420: 'test/dialect/test_suite.py::ComponentReflectionTest_sqlite+pysqlite_3_44_0::test_get_multi_table_comment[True-ObjectKind.ANY-ObjectScope.TEMPORARY-None-_exclusions_00] (call)' : not postgresql and not mysql and not mariadb and not oracle and not mssql
  713. SKIPPED [1] lib/sqlalchemy/testing/config.py:420: 'test/dialect/test_suite.py::ComponentReflectionTest_sqlite+pysqlite_3_44_0::test_get_multi_table_comment[True-ObjectKind.ANY_VIEW-ObjectScope.ANY-<lambda>-_exclusions_01] (call)' : not postgresql and not mysql and not mariadb and not oracle and not mssql
  714. SKIPPED [1] lib/sqlalchemy/testing/config.py:420: 'test/dialect/test_suite.py::ComponentReflectionTest_sqlite+pysqlite_3_44_0::test_get_multi_table_comment[True-ObjectKind.ANY_VIEW-ObjectScope.ANY-None-_exclusions_00] (call)' : not postgresql and not mysql and not mariadb and not oracle and not mssql
  715. SKIPPED [1] lib/sqlalchemy/testing/config.py:420: 'test/dialect/test_suite.py::ComponentReflectionTest_sqlite+pysqlite_3_44_0::test_get_multi_table_comment[True-ObjectKind.ANY_VIEW-ObjectScope.DEFAULT-<lambda>-_exclusions_01] (call)' : not postgresql and not mysql and not mariadb and not oracle and not mssql
  716. SKIPPED [1] lib/sqlalchemy/testing/config.py:420: 'test/dialect/test_suite.py::ComponentReflectionTest_sqlite+pysqlite_3_44_0::test_get_multi_table_comment[True-ObjectKind.ANY_VIEW-ObjectScope.DEFAULT-None-_exclusions_00] (call)' : not postgresql and not mysql and not mariadb and not oracle and not mssql
  717. SKIPPED [1] lib/sqlalchemy/testing/config.py:420: 'test/dialect/test_suite.py::ComponentReflectionTest_sqlite+pysqlite_3_44_0::test_get_multi_table_comment[True-ObjectKind.ANY_VIEW-ObjectScope.TEMPORARY-<lambda>-_exclusions_01] (call)' : not postgresql and not mysql and not mariadb and not oracle and not mssql
  718. SKIPPED [1] lib/sqlalchemy/testing/config.py:420: 'test/dialect/test_suite.py::ComponentReflectionTest_sqlite+pysqlite_3_44_0::test_get_multi_table_comment[True-ObjectKind.ANY_VIEW-ObjectScope.TEMPORARY-None-_exclusions_00] (call)' : not postgresql and not mysql and not mariadb and not oracle and not mssql
  719. SKIPPED [1] lib/sqlalchemy/testing/config.py:420: 'test/dialect/test_suite.py::ComponentReflectionTest_sqlite+pysqlite_3_44_0::test_get_multi_table_comment[True-ObjectKind.MATERIALIZED_VIEW-ObjectScope.ANY-<lambda>-_exclusions_01] (call)' : not postgresql and not mysql and not mariadb and not oracle and not mssql
  720. SKIPPED [1] lib/sqlalchemy/testing/config.py:420: 'test/dialect/test_suite.py::ComponentReflectionTest_sqlite+pysqlite_3_44_0::test_get_multi_table_comment[True-ObjectKind.MATERIALIZED_VIEW-ObjectScope.ANY-None-_exclusions_00] (call)' : not postgresql and not mysql and not mariadb and not oracle and not mssql
  721. SKIPPED [1] lib/sqlalchemy/testing/config.py:420: 'test/dialect/test_suite.py::ComponentReflectionTest_sqlite+pysqlite_3_44_0::test_get_multi_table_comment[True-ObjectKind.MATERIALIZED_VIEW-ObjectScope.DEFAULT-<lambda>-_exclusions_01] (call)' : not postgresql and not mysql and not mariadb and not oracle and not mssql
  722. SKIPPED [1] lib/sqlalchemy/testing/config.py:420: 'test/dialect/test_suite.py::ComponentReflectionTest_sqlite+pysqlite_3_44_0::test_get_multi_table_comment[True-ObjectKind.MATERIALIZED_VIEW-ObjectScope.DEFAULT-None-_exclusions_00] (call)' : not postgresql and not mysql and not mariadb and not oracle and not mssql
  723. SKIPPED [1] lib/sqlalchemy/testing/config.py:420: 'test/dialect/test_suite.py::ComponentReflectionTest_sqlite+pysqlite_3_44_0::test_get_multi_table_comment[True-ObjectKind.MATERIALIZED_VIEW-ObjectScope.TEMPORARY-<lambda>-_exclusions_01] (call)' : not postgresql and not mysql and not mariadb and not oracle and not mssql
  724. SKIPPED [1] lib/sqlalchemy/testing/config.py:420: 'test/dialect/test_suite.py::ComponentReflectionTest_sqlite+pysqlite_3_44_0::test_get_multi_table_comment[True-ObjectKind.MATERIALIZED_VIEW-ObjectScope.TEMPORARY-None-_exclusions_00] (call)' : not postgresql and not mysql and not mariadb and not oracle and not mssql
  725. SKIPPED [1] lib/sqlalchemy/testing/config.py:420: 'test/dialect/test_suite.py::ComponentReflectionTest_sqlite+pysqlite_3_44_0::test_get_multi_table_comment[True-ObjectKind.TABLE-ObjectScope.ANY-<lambda>-_exclusions_01] (call)' : not postgresql and not mysql and not mariadb and not oracle and not mssql
  726. SKIPPED [1] lib/sqlalchemy/testing/config.py:420: 'test/dialect/test_suite.py::ComponentReflectionTest_sqlite+pysqlite_3_44_0::test_get_multi_table_comment[True-ObjectKind.TABLE-ObjectScope.ANY-None-_exclusions_00] (call)' : not postgresql and not mysql and not mariadb and not oracle and not mssql
  727. SKIPPED [1] lib/sqlalchemy/testing/config.py:420: 'test/dialect/test_suite.py::ComponentReflectionTest_sqlite+pysqlite_3_44_0::test_get_multi_table_comment[True-ObjectKind.TABLE-ObjectScope.DEFAULT-<lambda>-_exclusions_01] (call)' : not postgresql and not mysql and not mariadb and not oracle and not mssql
  728. SKIPPED [1] lib/sqlalchemy/testing/config.py:420: 'test/dialect/test_suite.py::ComponentReflectionTest_sqlite+pysqlite_3_44_0::test_get_multi_table_comment[True-ObjectKind.TABLE-ObjectScope.DEFAULT-None-_exclusions_00] (call)' : not postgresql and not mysql and not mariadb and not oracle and not mssql
  729. SKIPPED [1] lib/sqlalchemy/testing/config.py:420: 'test/dialect/test_suite.py::ComponentReflectionTest_sqlite+pysqlite_3_44_0::test_get_multi_table_comment[True-ObjectKind.TABLE-ObjectScope.TEMPORARY-<lambda>-_exclusions_01] (call)' : not postgresql and not mysql and not mariadb and not oracle and not mssql
  730. SKIPPED [1] lib/sqlalchemy/testing/config.py:420: 'test/dialect/test_suite.py::ComponentReflectionTest_sqlite+pysqlite_3_44_0::test_get_multi_table_comment[True-ObjectKind.TABLE-ObjectScope.TEMPORARY-None-_exclusions_00] (call)' : not postgresql and not mysql and not mariadb and not oracle and not mssql
  731. SKIPPED [1] lib/sqlalchemy/testing/config.py:420: 'test/dialect/test_suite.py::ComponentReflectionTest_sqlite+pysqlite_3_44_0::test_get_multi_table_comment[True-ObjectKind.TABLE|MATERIALIZED_VIEW-ObjectScope.ANY-<lambda>-_exclusions_01] (call)' : not postgresql and not mysql and not mariadb and not oracle and not mssql
  732. SKIPPED [1] lib/sqlalchemy/testing/config.py:420: 'test/dialect/test_suite.py::ComponentReflectionTest_sqlite+pysqlite_3_44_0::test_get_multi_table_comment[True-ObjectKind.TABLE|MATERIALIZED_VIEW-ObjectScope.ANY-None-_exclusions_00] (call)' : not postgresql and not mysql and not mariadb and not oracle and not mssql
  733. SKIPPED [1] lib/sqlalchemy/testing/config.py:420: 'test/dialect/test_suite.py::ComponentReflectionTest_sqlite+pysqlite_3_44_0::test_get_multi_table_comment[True-ObjectKind.TABLE|MATERIALIZED_VIEW-ObjectScope.DEFAULT-<lambda>-_exclusions_01] (call)' : not postgresql and not mysql and not mariadb and not oracle and not mssql
  734. SKIPPED [1] lib/sqlalchemy/testing/config.py:420: 'test/dialect/test_suite.py::ComponentReflectionTest_sqlite+pysqlite_3_44_0::test_get_multi_table_comment[True-ObjectKind.TABLE|MATERIALIZED_VIEW-ObjectScope.DEFAULT-None-_exclusions_00] (call)' : not postgresql and not mysql and not mariadb and not oracle and not mssql
  735. SKIPPED [1] lib/sqlalchemy/testing/config.py:420: 'test/dialect/test_suite.py::ComponentReflectionTest_sqlite+pysqlite_3_44_0::test_get_multi_table_comment[True-ObjectKind.TABLE|MATERIALIZED_VIEW-ObjectScope.TEMPORARY-<lambda>-_exclusions_01] (call)' : not postgresql and not mysql and not mariadb and not oracle and not mssql
  736. SKIPPED [1] lib/sqlalchemy/testing/config.py:420: 'test/dialect/test_suite.py::ComponentReflectionTest_sqlite+pysqlite_3_44_0::test_get_multi_table_comment[True-ObjectKind.TABLE|MATERIALIZED_VIEW-ObjectScope.TEMPORARY-None-_exclusions_00] (call)' : not postgresql and not mysql and not mariadb and not oracle and not mssql
  737. SKIPPED [1] lib/sqlalchemy/testing/config.py:420: 'test/dialect/test_suite.py::ComponentReflectionTest_sqlite+pysqlite_3_44_0::test_get_multi_table_comment[True-ObjectKind.TABLE|VIEW-ObjectScope.ANY-<lambda>-_exclusions_01] (call)' : not postgresql and not mysql and not mariadb and not oracle and not mssql
  738. SKIPPED [1] lib/sqlalchemy/testing/config.py:420: 'test/dialect/test_suite.py::ComponentReflectionTest_sqlite+pysqlite_3_44_0::test_get_multi_table_comment[True-ObjectKind.TABLE|VIEW-ObjectScope.ANY-None-_exclusions_00] (call)' : not postgresql and not mysql and not mariadb and not oracle and not mssql
  739. SKIPPED [1] lib/sqlalchemy/testing/config.py:420: 'test/dialect/test_suite.py::ComponentReflectionTest_sqlite+pysqlite_3_44_0::test_get_multi_table_comment[True-ObjectKind.TABLE|VIEW-ObjectScope.DEFAULT-<lambda>-_exclusions_01] (call)' : not postgresql and not mysql and not mariadb and not oracle and not mssql
  740. SKIPPED [1] lib/sqlalchemy/testing/config.py:420: 'test/dialect/test_suite.py::ComponentReflectionTest_sqlite+pysqlite_3_44_0::test_get_multi_table_comment[True-ObjectKind.TABLE|VIEW-ObjectScope.DEFAULT-None-_exclusions_00] (call)' : not postgresql and not mysql and not mariadb and not oracle and not mssql
  741. SKIPPED [1] lib/sqlalchemy/testing/config.py:420: 'test/dialect/test_suite.py::ComponentReflectionTest_sqlite+pysqlite_3_44_0::test_get_multi_table_comment[True-ObjectKind.TABLE|VIEW-ObjectScope.TEMPORARY-<lambda>-_exclusions_01] (call)' : not postgresql and not mysql and not mariadb and not oracle and not mssql
  742. SKIPPED [1] lib/sqlalchemy/testing/config.py:420: 'test/dialect/test_suite.py::ComponentReflectionTest_sqlite+pysqlite_3_44_0::test_get_multi_table_comment[True-ObjectKind.TABLE|VIEW-ObjectScope.TEMPORARY-None-_exclusions_00] (call)' : not postgresql and not mysql and not mariadb and not oracle and not mssql
  743. SKIPPED [1] lib/sqlalchemy/testing/config.py:420: 'test/dialect/test_suite.py::ComponentReflectionTest_sqlite+pysqlite_3_44_0::test_get_multi_table_comment[True-ObjectKind.VIEW-ObjectScope.ANY-<lambda>-_exclusions_01] (call)' : not postgresql and not mysql and not mariadb and not oracle and not mssql
  744. SKIPPED [1] lib/sqlalchemy/testing/config.py:420: 'test/dialect/test_suite.py::ComponentReflectionTest_sqlite+pysqlite_3_44_0::test_get_multi_table_comment[True-ObjectKind.VIEW-ObjectScope.ANY-None-_exclusions_00] (call)' : not postgresql and not mysql and not mariadb and not oracle and not mssql
  745. SKIPPED [1] lib/sqlalchemy/testing/config.py:420: 'test/dialect/test_suite.py::ComponentReflectionTest_sqlite+pysqlite_3_44_0::test_get_multi_table_comment[True-ObjectKind.VIEW-ObjectScope.DEFAULT-<lambda>-_exclusions_01] (call)' : not postgresql and not mysql and not mariadb and not oracle and not mssql
  746. SKIPPED [1] lib/sqlalchemy/testing/config.py:420: 'test/dialect/test_suite.py::ComponentReflectionTest_sqlite+pysqlite_3_44_0::test_get_multi_table_comment[True-ObjectKind.VIEW-ObjectScope.DEFAULT-None-_exclusions_00] (call)' : not postgresql and not mysql and not mariadb and not oracle and not mssql
  747. SKIPPED [1] lib/sqlalchemy/testing/config.py:420: 'test/dialect/test_suite.py::ComponentReflectionTest_sqlite+pysqlite_3_44_0::test_get_multi_table_comment[True-ObjectKind.VIEW-ObjectScope.TEMPORARY-<lambda>-_exclusions_01] (call)' : not postgresql and not mysql and not mariadb and not oracle and not mssql
  748. SKIPPED [1] lib/sqlalchemy/testing/config.py:420: 'test/dialect/test_suite.py::ComponentReflectionTest_sqlite+pysqlite_3_44_0::test_get_multi_table_comment[True-ObjectKind.VIEW-ObjectScope.TEMPORARY-None-_exclusions_00] (call)' : not postgresql and not mysql and not mariadb and not oracle and not mssql
  749. SKIPPED [1] lib/sqlalchemy/testing/config.py:420: 'test/dialect/test_suite.py::ComponentReflectionTest_sqlite+pysqlite_3_44_0::test_multi_get_table_options_tables[False-ObjectKind.ANY-ObjectScope.ANY-<lambda>-_exclusions_01] (call)' : not mysql and not mariadb and not oracle
  750. SKIPPED [1] lib/sqlalchemy/testing/config.py:420: 'test/dialect/test_suite.py::ComponentReflectionTest_sqlite+pysqlite_3_44_0::test_multi_get_table_options_tables[False-ObjectKind.ANY-ObjectScope.ANY-None-_exclusions_00] (call)' : not mysql and not mariadb and not oracle
  751. SKIPPED [1] lib/sqlalchemy/testing/config.py:420: 'test/dialect/test_suite.py::ComponentReflectionTest_sqlite+pysqlite_3_44_0::test_multi_get_table_options_tables[False-ObjectKind.ANY-ObjectScope.DEFAULT-<lambda>-_exclusions_01] (call)' : not mysql and not mariadb and not oracle
  752. SKIPPED [1] lib/sqlalchemy/testing/config.py:420: 'test/dialect/test_suite.py::ComponentReflectionTest_sqlite+pysqlite_3_44_0::test_multi_get_table_options_tables[False-ObjectKind.ANY-ObjectScope.DEFAULT-None-_exclusions_00] (call)' : not mysql and not mariadb and not oracle
  753. SKIPPED [1] lib/sqlalchemy/testing/config.py:420: 'test/dialect/test_suite.py::ComponentReflectionTest_sqlite+pysqlite_3_44_0::test_multi_get_table_options_tables[False-ObjectKind.ANY-ObjectScope.TEMPORARY-<lambda>-_exclusions_01] (call)' : not mysql and not mariadb and not oracle
  754. SKIPPED [1] lib/sqlalchemy/testing/config.py:420: 'test/dialect/test_suite.py::ComponentReflectionTest_sqlite+pysqlite_3_44_0::test_multi_get_table_options_tables[False-ObjectKind.ANY-ObjectScope.TEMPORARY-None-_exclusions_00] (call)' : not mysql and not mariadb and not oracle
  755. SKIPPED [1] lib/sqlalchemy/testing/config.py:420: 'test/dialect/test_suite.py::ComponentReflectionTest_sqlite+pysqlite_3_44_0::test_multi_get_table_options_tables[False-ObjectKind.ANY_VIEW-ObjectScope.ANY-<lambda>-_exclusions_01] (call)' : not mysql and not mariadb and not oracle
  756. SKIPPED [1] lib/sqlalchemy/testing/config.py:420: 'test/dialect/test_suite.py::ComponentReflectionTest_sqlite+pysqlite_3_44_0::test_multi_get_table_options_tables[False-ObjectKind.ANY_VIEW-ObjectScope.ANY-None-_exclusions_00] (call)' : not mysql and not mariadb and not oracle
  757. SKIPPED [1] lib/sqlalchemy/testing/config.py:420: 'test/dialect/test_suite.py::ComponentReflectionTest_sqlite+pysqlite_3_44_0::test_multi_get_table_options_tables[False-ObjectKind.ANY_VIEW-ObjectScope.DEFAULT-<lambda>-_exclusions_01] (call)' : not mysql and not mariadb and not oracle
  758. SKIPPED [1] lib/sqlalchemy/testing/config.py:420: 'test/dialect/test_suite.py::ComponentReflectionTest_sqlite+pysqlite_3_44_0::test_multi_get_table_options_tables[False-ObjectKind.ANY_VIEW-ObjectScope.DEFAULT-None-_exclusions_00] (call)' : not mysql and not mariadb and not oracle
  759. SKIPPED [1] lib/sqlalchemy/testing/config.py:420: 'test/dialect/test_suite.py::ComponentReflectionTest_sqlite+pysqlite_3_44_0::test_multi_get_table_options_tables[False-ObjectKind.ANY_VIEW-ObjectScope.TEMPORARY-<lambda>-_exclusions_01] (call)' : not mysql and not mariadb and not oracle
  760. SKIPPED [1] lib/sqlalchemy/testing/config.py:420: 'test/dialect/test_suite.py::ComponentReflectionTest_sqlite+pysqlite_3_44_0::test_multi_get_table_options_tables[False-ObjectKind.ANY_VIEW-ObjectScope.TEMPORARY-None-_exclusions_00] (call)' : not mysql and not mariadb and not oracle
  761. SKIPPED [1] lib/sqlalchemy/testing/config.py:420: 'test/dialect/test_suite.py::ComponentReflectionTest_sqlite+pysqlite_3_44_0::test_multi_get_table_options_tables[False-ObjectKind.MATERIALIZED_VIEW-ObjectScope.ANY-<lambda>-_exclusions_01] (call)' : not mysql and not mariadb and not oracle
  762. SKIPPED [1] lib/sqlalchemy/testing/config.py:420: 'test/dialect/test_suite.py::ComponentReflectionTest_sqlite+pysqlite_3_44_0::test_multi_get_table_options_tables[False-ObjectKind.MATERIALIZED_VIEW-ObjectScope.ANY-None-_exclusions_00] (call)' : not mysql and not mariadb and not oracle
  763. SKIPPED [1] lib/sqlalchemy/testing/config.py:420: 'test/dialect/test_suite.py::ComponentReflectionTest_sqlite+pysqlite_3_44_0::test_multi_get_table_options_tables[False-ObjectKind.MATERIALIZED_VIEW-ObjectScope.DEFAULT-<lambda>-_exclusions_01] (call)' : not mysql and not mariadb and not oracle
  764. SKIPPED [1] lib/sqlalchemy/testing/config.py:420: 'test/dialect/test_suite.py::ComponentReflectionTest_sqlite+pysqlite_3_44_0::test_multi_get_table_options_tables[False-ObjectKind.MATERIALIZED_VIEW-ObjectScope.DEFAULT-None-_exclusions_00] (call)' : not mysql and not mariadb and not oracle
  765. SKIPPED [1] lib/sqlalchemy/testing/config.py:420: 'test/dialect/test_suite.py::ComponentReflectionTest_sqlite+pysqlite_3_44_0::test_multi_get_table_options_tables[False-ObjectKind.MATERIALIZED_VIEW-ObjectScope.TEMPORARY-<lambda>-_exclusions_01] (call)' : not mysql and not mariadb and not oracle
  766. SKIPPED [1] lib/sqlalchemy/testing/config.py:420: 'test/dialect/test_suite.py::ComponentReflectionTest_sqlite+pysqlite_3_44_0::test_multi_get_table_options_tables[False-ObjectKind.MATERIALIZED_VIEW-ObjectScope.TEMPORARY-None-_exclusions_00] (call)' : not mysql and not mariadb and not oracle
  767. SKIPPED [1] lib/sqlalchemy/testing/config.py:420: 'test/dialect/test_suite.py::ComponentReflectionTest_sqlite+pysqlite_3_44_0::test_multi_get_table_options_tables[False-ObjectKind.TABLE-ObjectScope.ANY-<lambda>-_exclusions_01] (call)' : not mysql and not mariadb and not oracle
  768. SKIPPED [1] lib/sqlalchemy/testing/config.py:420: 'test/dialect/test_suite.py::ComponentReflectionTest_sqlite+pysqlite_3_44_0::test_multi_get_table_options_tables[False-ObjectKind.TABLE-ObjectScope.ANY-None-_exclusions_00] (call)' : not mysql and not mariadb and not oracle
  769. SKIPPED [1] lib/sqlalchemy/testing/config.py:420: 'test/dialect/test_suite.py::ComponentReflectionTest_sqlite+pysqlite_3_44_0::test_multi_get_table_options_tables[False-ObjectKind.TABLE-ObjectScope.DEFAULT-<lambda>-_exclusions_01] (call)' : not mysql and not mariadb and not oracle
  770. SKIPPED [1] lib/sqlalchemy/testing/config.py:420: 'test/dialect/test_suite.py::ComponentReflectionTest_sqlite+pysqlite_3_44_0::test_multi_get_table_options_tables[False-ObjectKind.TABLE-ObjectScope.DEFAULT-None-_exclusions_00] (call)' : not mysql and not mariadb and not oracle
  771. SKIPPED [1] lib/sqlalchemy/testing/config.py:420: 'test/dialect/test_suite.py::ComponentReflectionTest_sqlite+pysqlite_3_44_0::test_multi_get_table_options_tables[False-ObjectKind.TABLE-ObjectScope.TEMPORARY-<lambda>-_exclusions_01] (call)' : not mysql and not mariadb and not oracle
  772. SKIPPED [1] lib/sqlalchemy/testing/config.py:420: 'test/dialect/test_suite.py::ComponentReflectionTest_sqlite+pysqlite_3_44_0::test_multi_get_table_options_tables[False-ObjectKind.TABLE-ObjectScope.TEMPORARY-None-_exclusions_00] (call)' : not mysql and not mariadb and not oracle
  773. SKIPPED [1] lib/sqlalchemy/testing/config.py:420: 'test/dialect/test_suite.py::ComponentReflectionTest_sqlite+pysqlite_3_44_0::test_multi_get_table_options_tables[False-ObjectKind.TABLE|MATERIALIZED_VIEW-ObjectScope.ANY-<lambda>-_exclusions_01] (call)' : not mysql and not mariadb and not oracle
  774. SKIPPED [1] lib/sqlalchemy/testing/config.py:420: 'test/dialect/test_suite.py::ComponentReflectionTest_sqlite+pysqlite_3_44_0::test_multi_get_table_options_tables[False-ObjectKind.TABLE|MATERIALIZED_VIEW-ObjectScope.ANY-None-_exclusions_00] (call)' : not mysql and not mariadb and not oracle
  775. SKIPPED [1] lib/sqlalchemy/testing/config.py:420: 'test/dialect/test_suite.py::ComponentReflectionTest_sqlite+pysqlite_3_44_0::test_multi_get_table_options_tables[False-ObjectKind.TABLE|MATERIALIZED_VIEW-ObjectScope.DEFAULT-<lambda>-_exclusions_01] (call)' : not mysql and not mariadb and not oracle
  776. SKIPPED [1] lib/sqlalchemy/testing/config.py:420: 'test/dialect/test_suite.py::ComponentReflectionTest_sqlite+pysqlite_3_44_0::test_multi_get_table_options_tables[False-ObjectKind.TABLE|MATERIALIZED_VIEW-ObjectScope.DEFAULT-None-_exclusions_00] (call)' : not mysql and not mariadb and not oracle
  777. SKIPPED [1] lib/sqlalchemy/testing/config.py:420: 'test/dialect/test_suite.py::ComponentReflectionTest_sqlite+pysqlite_3_44_0::test_multi_get_table_options_tables[False-ObjectKind.TABLE|MATERIALIZED_VIEW-ObjectScope.TEMPORARY-<lambda>-_exclusions_01] (call)' : not mysql and not mariadb and not oracle
  778. SKIPPED [1] lib/sqlalchemy/testing/config.py:420: 'test/dialect/test_suite.py::ComponentReflectionTest_sqlite+pysqlite_3_44_0::test_multi_get_table_options_tables[False-ObjectKind.TABLE|MATERIALIZED_VIEW-ObjectScope.TEMPORARY-None-_exclusions_00] (call)' : not mysql and not mariadb and not oracle
  779. SKIPPED [1] lib/sqlalchemy/testing/config.py:420: 'test/dialect/test_suite.py::ComponentReflectionTest_sqlite+pysqlite_3_44_0::test_multi_get_table_options_tables[False-ObjectKind.TABLE|VIEW-ObjectScope.ANY-<lambda>-_exclusions_01] (call)' : not mysql and not mariadb and not oracle
  780. SKIPPED [1] lib/sqlalchemy/testing/config.py:420: 'test/dialect/test_suite.py::ComponentReflectionTest_sqlite+pysqlite_3_44_0::test_multi_get_table_options_tables[False-ObjectKind.TABLE|VIEW-ObjectScope.ANY-None-_exclusions_00] (call)' : not mysql and not mariadb and not oracle
  781. SKIPPED [1] lib/sqlalchemy/testing/config.py:420: 'test/dialect/test_suite.py::ComponentReflectionTest_sqlite+pysqlite_3_44_0::test_multi_get_table_options_tables[False-ObjectKind.TABLE|VIEW-ObjectScope.DEFAULT-<lambda>-_exclusions_01] (call)' : not mysql and not mariadb and not oracle
  782. SKIPPED [1] lib/sqlalchemy/testing/config.py:420: 'test/dialect/test_suite.py::ComponentReflectionTest_sqlite+pysqlite_3_44_0::test_multi_get_table_options_tables[False-ObjectKind.TABLE|VIEW-ObjectScope.DEFAULT-None-_exclusions_00] (call)' : not mysql and not mariadb and not oracle
  783. SKIPPED [1] lib/sqlalchemy/testing/config.py:420: 'test/dialect/test_suite.py::ComponentReflectionTest_sqlite+pysqlite_3_44_0::test_multi_get_table_options_tables[False-ObjectKind.TABLE|VIEW-ObjectScope.TEMPORARY-<lambda>-_exclusions_01] (call)' : not mysql and not mariadb and not oracle
  784. SKIPPED [1] lib/sqlalchemy/testing/config.py:420: 'test/dialect/test_suite.py::ComponentReflectionTest_sqlite+pysqlite_3_44_0::test_multi_get_table_options_tables[False-ObjectKind.TABLE|VIEW-ObjectScope.TEMPORARY-None-_exclusions_00] (call)' : not mysql and not mariadb and not oracle
  785. SKIPPED [1] lib/sqlalchemy/testing/config.py:420: 'test/dialect/test_suite.py::ComponentReflectionTest_sqlite+pysqlite_3_44_0::test_multi_get_table_options_tables[False-ObjectKind.VIEW-ObjectScope.ANY-<lambda>-_exclusions_01] (call)' : not mysql and not mariadb and not oracle
  786. SKIPPED [1] lib/sqlalchemy/testing/config.py:420: 'test/dialect/test_suite.py::ComponentReflectionTest_sqlite+pysqlite_3_44_0::test_multi_get_table_options_tables[False-ObjectKind.VIEW-ObjectScope.ANY-None-_exclusions_00] (call)' : not mysql and not mariadb and not oracle
  787. SKIPPED [1] lib/sqlalchemy/testing/config.py:420: 'test/dialect/test_suite.py::ComponentReflectionTest_sqlite+pysqlite_3_44_0::test_multi_get_table_options_tables[False-ObjectKind.VIEW-ObjectScope.DEFAULT-<lambda>-_exclusions_01] (call)' : not mysql and not mariadb and not oracle
  788. SKIPPED [1] lib/sqlalchemy/testing/config.py:420: 'test/dialect/test_suite.py::ComponentReflectionTest_sqlite+pysqlite_3_44_0::test_multi_get_table_options_tables[False-ObjectKind.VIEW-ObjectScope.DEFAULT-None-_exclusions_00] (call)' : not mysql and not mariadb and not oracle
  789. SKIPPED [1] lib/sqlalchemy/testing/config.py:420: 'test/dialect/test_suite.py::ComponentReflectionTest_sqlite+pysqlite_3_44_0::test_multi_get_table_options_tables[False-ObjectKind.VIEW-ObjectScope.TEMPORARY-<lambda>-_exclusions_01] (call)' : not mysql and not mariadb and not oracle
  790. SKIPPED [1] lib/sqlalchemy/testing/config.py:420: 'test/dialect/test_suite.py::ComponentReflectionTest_sqlite+pysqlite_3_44_0::test_multi_get_table_options_tables[False-ObjectKind.VIEW-ObjectScope.TEMPORARY-None-_exclusions_00] (call)' : not mysql and not mariadb and not oracle
  791. SKIPPED [1] lib/sqlalchemy/testing/config.py:420: 'test/dialect/test_suite.py::ComponentReflectionTest_sqlite+pysqlite_3_44_0::test_multi_get_table_options_tables[True-ObjectKind.ANY-ObjectScope.ANY-<lambda>-_exclusions_01] (call)' : not mysql and not mariadb and not oracle
  792. SKIPPED [1] lib/sqlalchemy/testing/config.py:420: 'test/dialect/test_suite.py::ComponentReflectionTest_sqlite+pysqlite_3_44_0::test_multi_get_table_options_tables[True-ObjectKind.ANY-ObjectScope.ANY-None-_exclusions_00] (call)' : not mysql and not mariadb and not oracle
  793. SKIPPED [1] lib/sqlalchemy/testing/config.py:420: 'test/dialect/test_suite.py::ComponentReflectionTest_sqlite+pysqlite_3_44_0::test_multi_get_table_options_tables[True-ObjectKind.ANY-ObjectScope.DEFAULT-<lambda>-_exclusions_01] (call)' : not mysql and not mariadb and not oracle
  794. SKIPPED [1] lib/sqlalchemy/testing/config.py:420: 'test/dialect/test_suite.py::ComponentReflectionTest_sqlite+pysqlite_3_44_0::test_multi_get_table_options_tables[True-ObjectKind.ANY-ObjectScope.DEFAULT-None-_exclusions_00] (call)' : not mysql and not mariadb and not oracle
  795. SKIPPED [1] lib/sqlalchemy/testing/config.py:420: 'test/dialect/test_suite.py::ComponentReflectionTest_sqlite+pysqlite_3_44_0::test_multi_get_table_options_tables[True-ObjectKind.ANY-ObjectScope.TEMPORARY-<lambda>-_exclusions_01] (call)' : not mysql and not mariadb and not oracle
  796. SKIPPED [1] lib/sqlalchemy/testing/config.py:420: 'test/dialect/test_suite.py::ComponentReflectionTest_sqlite+pysqlite_3_44_0::test_multi_get_table_options_tables[True-ObjectKind.ANY-ObjectScope.TEMPORARY-None-_exclusions_00] (call)' : not mysql and not mariadb and not oracle
  797. SKIPPED [1] lib/sqlalchemy/testing/config.py:420: 'test/dialect/test_suite.py::ComponentReflectionTest_sqlite+pysqlite_3_44_0::test_multi_get_table_options_tables[True-ObjectKind.ANY_VIEW-ObjectScope.ANY-<lambda>-_exclusions_01] (call)' : not mysql and not mariadb and not oracle
  798. SKIPPED [1] lib/sqlalchemy/testing/config.py:420: 'test/dialect/test_suite.py::ComponentReflectionTest_sqlite+pysqlite_3_44_0::test_multi_get_table_options_tables[True-ObjectKind.ANY_VIEW-ObjectScope.ANY-None-_exclusions_00] (call)' : not mysql and not mariadb and not oracle
  799. SKIPPED [1] lib/sqlalchemy/testing/config.py:420: 'test/dialect/test_suite.py::ComponentReflectionTest_sqlite+pysqlite_3_44_0::test_multi_get_table_options_tables[True-ObjectKind.ANY_VIEW-ObjectScope.DEFAULT-<lambda>-_exclusions_01] (call)' : not mysql and not mariadb and not oracle
  800. SKIPPED [1] lib/sqlalchemy/testing/config.py:420: 'test/dialect/test_suite.py::ComponentReflectionTest_sqlite+pysqlite_3_44_0::test_multi_get_table_options_tables[True-ObjectKind.ANY_VIEW-ObjectScope.DEFAULT-None-_exclusions_00] (call)' : not mysql and not mariadb and not oracle
  801. SKIPPED [1] lib/sqlalchemy/testing/config.py:420: 'test/dialect/test_suite.py::ComponentReflectionTest_sqlite+pysqlite_3_44_0::test_multi_get_table_options_tables[True-ObjectKind.ANY_VIEW-ObjectScope.TEMPORARY-<lambda>-_exclusions_01] (call)' : not mysql and not mariadb and not oracle
  802. SKIPPED [1] lib/sqlalchemy/testing/config.py:420: 'test/dialect/test_suite.py::ComponentReflectionTest_sqlite+pysqlite_3_44_0::test_multi_get_table_options_tables[True-ObjectKind.ANY_VIEW-ObjectScope.TEMPORARY-None-_exclusions_00] (call)' : not mysql and not mariadb and not oracle
  803. SKIPPED [1] lib/sqlalchemy/testing/config.py:420: 'test/dialect/test_suite.py::ComponentReflectionTest_sqlite+pysqlite_3_44_0::test_multi_get_table_options_tables[True-ObjectKind.MATERIALIZED_VIEW-ObjectScope.ANY-<lambda>-_exclusions_01] (call)' : not mysql and not mariadb and not oracle
  804. SKIPPED [1] lib/sqlalchemy/testing/config.py:420: 'test/dialect/test_suite.py::ComponentReflectionTest_sqlite+pysqlite_3_44_0::test_multi_get_table_options_tables[True-ObjectKind.MATERIALIZED_VIEW-ObjectScope.ANY-None-_exclusions_00] (call)' : not mysql and not mariadb and not oracle
  805. SKIPPED [1] lib/sqlalchemy/testing/config.py:420: 'test/dialect/test_suite.py::ComponentReflectionTest_sqlite+pysqlite_3_44_0::test_multi_get_table_options_tables[True-ObjectKind.MATERIALIZED_VIEW-ObjectScope.DEFAULT-<lambda>-_exclusions_01] (call)' : not mysql and not mariadb and not oracle
  806. SKIPPED [1] lib/sqlalchemy/testing/config.py:420: 'test/dialect/test_suite.py::ComponentReflectionTest_sqlite+pysqlite_3_44_0::test_multi_get_table_options_tables[True-ObjectKind.MATERIALIZED_VIEW-ObjectScope.DEFAULT-None-_exclusions_00] (call)' : not mysql and not mariadb and not oracle
  807. SKIPPED [1] lib/sqlalchemy/testing/config.py:420: 'test/dialect/test_suite.py::ComponentReflectionTest_sqlite+pysqlite_3_44_0::test_multi_get_table_options_tables[True-ObjectKind.MATERIALIZED_VIEW-ObjectScope.TEMPORARY-<lambda>-_exclusions_01] (call)' : not mysql and not mariadb and not oracle
  808. SKIPPED [1] lib/sqlalchemy/testing/config.py:420: 'test/dialect/test_suite.py::ComponentReflectionTest_sqlite+pysqlite_3_44_0::test_multi_get_table_options_tables[True-ObjectKind.MATERIALIZED_VIEW-ObjectScope.TEMPORARY-None-_exclusions_00] (call)' : not mysql and not mariadb and not oracle
  809. SKIPPED [1] lib/sqlalchemy/testing/config.py:420: 'test/dialect/test_suite.py::ComponentReflectionTest_sqlite+pysqlite_3_44_0::test_multi_get_table_options_tables[True-ObjectKind.TABLE-ObjectScope.ANY-<lambda>-_exclusions_01] (call)' : not mysql and not mariadb and not oracle
  810. SKIPPED [1] lib/sqlalchemy/testing/config.py:420: 'test/dialect/test_suite.py::ComponentReflectionTest_sqlite+pysqlite_3_44_0::test_multi_get_table_options_tables[True-ObjectKind.TABLE-ObjectScope.ANY-None-_exclusions_00] (call)' : not mysql and not mariadb and not oracle
  811. SKIPPED [1] lib/sqlalchemy/testing/config.py:420: 'test/dialect/test_suite.py::ComponentReflectionTest_sqlite+pysqlite_3_44_0::test_multi_get_table_options_tables[True-ObjectKind.TABLE-ObjectScope.DEFAULT-<lambda>-_exclusions_01] (call)' : not mysql and not mariadb and not oracle
  812. SKIPPED [1] lib/sqlalchemy/testing/config.py:420: 'test/dialect/test_suite.py::ComponentReflectionTest_sqlite+pysqlite_3_44_0::test_multi_get_table_options_tables[True-ObjectKind.TABLE-ObjectScope.DEFAULT-None-_exclusions_00] (call)' : not mysql and not mariadb and not oracle
  813. SKIPPED [1] lib/sqlalchemy/testing/config.py:420: 'test/dialect/test_suite.py::ComponentReflectionTest_sqlite+pysqlite_3_44_0::test_multi_get_table_options_tables[True-ObjectKind.TABLE-ObjectScope.TEMPORARY-<lambda>-_exclusions_01] (call)' : not mysql and not mariadb and not oracle
  814. SKIPPED [1] lib/sqlalchemy/testing/config.py:420: 'test/dialect/test_suite.py::ComponentReflectionTest_sqlite+pysqlite_3_44_0::test_multi_get_table_options_tables[True-ObjectKind.TABLE-ObjectScope.TEMPORARY-None-_exclusions_00] (call)' : not mysql and not mariadb and not oracle
  815. SKIPPED [1] lib/sqlalchemy/testing/config.py:420: 'test/dialect/test_suite.py::ComponentReflectionTest_sqlite+pysqlite_3_44_0::test_multi_get_table_options_tables[True-ObjectKind.TABLE|MATERIALIZED_VIEW-ObjectScope.ANY-<lambda>-_exclusions_01] (call)' : not mysql and not mariadb and not oracle
  816. SKIPPED [1] lib/sqlalchemy/testing/config.py:420: 'test/dialect/test_suite.py::ComponentReflectionTest_sqlite+pysqlite_3_44_0::test_multi_get_table_options_tables[True-ObjectKind.TABLE|MATERIALIZED_VIEW-ObjectScope.ANY-None-_exclusions_00] (call)' : not mysql and not mariadb and not oracle
  817. SKIPPED [1] lib/sqlalchemy/testing/config.py:420: 'test/dialect/test_suite.py::ComponentReflectionTest_sqlite+pysqlite_3_44_0::test_multi_get_table_options_tables[True-ObjectKind.TABLE|MATERIALIZED_VIEW-ObjectScope.DEFAULT-<lambda>-_exclusions_01] (call)' : not mysql and not mariadb and not oracle
  818. SKIPPED [1] lib/sqlalchemy/testing/config.py:420: 'test/dialect/test_suite.py::ComponentReflectionTest_sqlite+pysqlite_3_44_0::test_multi_get_table_options_tables[True-ObjectKind.TABLE|MATERIALIZED_VIEW-ObjectScope.DEFAULT-None-_exclusions_00] (call)' : not mysql and not mariadb and not oracle
  819. SKIPPED [1] lib/sqlalchemy/testing/config.py:420: 'test/dialect/test_suite.py::ComponentReflectionTest_sqlite+pysqlite_3_44_0::test_multi_get_table_options_tables[True-ObjectKind.TABLE|MATERIALIZED_VIEW-ObjectScope.TEMPORARY-<lambda>-_exclusions_01] (call)' : not mysql and not mariadb and not oracle
  820. SKIPPED [1] lib/sqlalchemy/testing/config.py:420: 'test/dialect/test_suite.py::ComponentReflectionTest_sqlite+pysqlite_3_44_0::test_multi_get_table_options_tables[True-ObjectKind.TABLE|MATERIALIZED_VIEW-ObjectScope.TEMPORARY-None-_exclusions_00] (call)' : not mysql and not mariadb and not oracle
  821. SKIPPED [1] lib/sqlalchemy/testing/config.py:420: 'test/dialect/test_suite.py::ComponentReflectionTest_sqlite+pysqlite_3_44_0::test_multi_get_table_options_tables[True-ObjectKind.TABLE|VIEW-ObjectScope.ANY-<lambda>-_exclusions_01] (call)' : not mysql and not mariadb and not oracle
  822. SKIPPED [1] lib/sqlalchemy/testing/config.py:420: 'test/dialect/test_suite.py::ComponentReflectionTest_sqlite+pysqlite_3_44_0::test_multi_get_table_options_tables[True-ObjectKind.TABLE|VIEW-ObjectScope.ANY-None-_exclusions_00] (call)' : not mysql and not mariadb and not oracle
  823. SKIPPED [1] lib/sqlalchemy/testing/config.py:420: 'test/dialect/test_suite.py::ComponentReflectionTest_sqlite+pysqlite_3_44_0::test_multi_get_table_options_tables[True-ObjectKind.TABLE|VIEW-ObjectScope.DEFAULT-<lambda>-_exclusions_01] (call)' : not mysql and not mariadb and not oracle
  824. SKIPPED [1] lib/sqlalchemy/testing/config.py:420: 'test/dialect/test_suite.py::ComponentReflectionTest_sqlite+pysqlite_3_44_0::test_multi_get_table_options_tables[True-ObjectKind.TABLE|VIEW-ObjectScope.DEFAULT-None-_exclusions_00] (call)' : not mysql and not mariadb and not oracle
  825. SKIPPED [1] lib/sqlalchemy/testing/config.py:420: 'test/dialect/test_suite.py::ComponentReflectionTest_sqlite+pysqlite_3_44_0::test_multi_get_table_options_tables[True-ObjectKind.TABLE|VIEW-ObjectScope.TEMPORARY-<lambda>-_exclusions_01] (call)' : not mysql and not mariadb and not oracle
  826. SKIPPED [1] lib/sqlalchemy/testing/config.py:420: 'test/dialect/test_suite.py::ComponentReflectionTest_sqlite+pysqlite_3_44_0::test_multi_get_table_options_tables[True-ObjectKind.TABLE|VIEW-ObjectScope.TEMPORARY-None-_exclusions_00] (call)' : not mysql and not mariadb and not oracle
  827. SKIPPED [1] lib/sqlalchemy/testing/config.py:420: 'test/dialect/test_suite.py::ComponentReflectionTest_sqlite+pysqlite_3_44_0::test_multi_get_table_options_tables[True-ObjectKind.VIEW-ObjectScope.ANY-<lambda>-_exclusions_01] (call)' : not mysql and not mariadb and not oracle
  828. SKIPPED [1] lib/sqlalchemy/testing/config.py:420: 'test/dialect/test_suite.py::ComponentReflectionTest_sqlite+pysqlite_3_44_0::test_multi_get_table_options_tables[True-ObjectKind.VIEW-ObjectScope.ANY-None-_exclusions_00] (call)' : not mysql and not mariadb and not oracle
  829. SKIPPED [1] lib/sqlalchemy/testing/config.py:420: 'test/dialect/test_suite.py::ComponentReflectionTest_sqlite+pysqlite_3_44_0::test_multi_get_table_options_tables[True-ObjectKind.VIEW-ObjectScope.DEFAULT-<lambda>-_exclusions_01] (call)' : not mysql and not mariadb and not oracle
  830. SKIPPED [1] lib/sqlalchemy/testing/config.py:420: 'test/dialect/test_suite.py::ComponentReflectionTest_sqlite+pysqlite_3_44_0::test_multi_get_table_options_tables[True-ObjectKind.VIEW-ObjectScope.DEFAULT-None-_exclusions_00] (call)' : not mysql and not mariadb and not oracle
  831. SKIPPED [1] lib/sqlalchemy/testing/config.py:420: 'test/dialect/test_suite.py::ComponentReflectionTest_sqlite+pysqlite_3_44_0::test_multi_get_table_options_tables[True-ObjectKind.VIEW-ObjectScope.TEMPORARY-<lambda>-_exclusions_01] (call)' : not mysql and not mariadb and not oracle
  832. SKIPPED [1] lib/sqlalchemy/testing/config.py:420: 'test/dialect/test_suite.py::ComponentReflectionTest_sqlite+pysqlite_3_44_0::test_multi_get_table_options_tables[True-ObjectKind.VIEW-ObjectScope.TEMPORARY-None-_exclusions_00] (call)' : not mysql and not mariadb and not oracle
  833. SKIPPED [1] lib/sqlalchemy/testing/config.py:420: 'test/dialect/test_suite.py::ComponentReflectionTest_sqlite+pysqlite_3_44_0::test_not_existing_table[get_table_comment-_exclusions_07] (call)' : not postgresql and not mysql and not mariadb and not oracle and not mssql
  834. SKIPPED [1] lib/sqlalchemy/testing/config.py:420: 'test/dialect/test_suite.py::ComponentReflectionTest_sqlite+pysqlite_3_44_0::test_not_existing_table[get_table_options-_exclusions_00] (call)' : not mysql and not mariadb and not oracle
  835. SKIPPED [1] lib/sqlalchemy/testing/config.py:420: 'test/dialect/test_suite.py::ComponentReflectionTest_sqlite+pysqlite_3_44_0::test_schema_cache (call)' : sqlite or oracle
  836. SKIPPED [6] lib/sqlalchemy/testing/config.py:420: 'sqlalchemy.testing.suite.test_types.DateTimeTZTest' unsupported on any DB implementation 'sqlite(3.44.0)+pysqlite'not postgresql
  837. SKIPPED [1] lib/sqlalchemy/testing/config.py:420: 'test/dialect/test_suite.py::FetchLimitOffsetTest_sqlite+pysqlite_3_44_0::test_bound_fetch_offset (call)' : not postgresql and not mssql >= (11,) and not oracle >= (12,) and not mariadb >= (10, 6)
  838. SKIPPED [1] lib/sqlalchemy/testing/config.py:420: 'test/dialect/test_suite.py::FetchLimitOffsetTest_sqlite+pysqlite_3_44_0::test_expr_fetch_offset (call)' : not postgresql and not mssql >= (11,) and not oracle >= (12,) and not mariadb >= (10, 6)
  839. SKIPPED [1] lib/sqlalchemy/testing/config.py:420: 'test/dialect/test_suite.py::FetchLimitOffsetTest_sqlite+pysqlite_3_44_0::test_fetch_offset_no_order (call)' : not postgresql and not oracle >= (12,) and not mariadb >= (10, 6)
  840. SKIPPED [1] lib/sqlalchemy/testing/config.py:420: 'test/dialect/test_suite.py::FetchLimitOffsetTest_sqlite+pysqlite_3_44_0::test_fetch_offset_nobinds (call)' : not postgresql and not mssql >= (11,) and not oracle >= (12,) and not mariadb >= (10, 6)
  841. SKIPPED [1] lib/sqlalchemy/testing/config.py:420: 'test/dialect/test_suite.py::FetchLimitOffsetTest_sqlite+pysqlite_3_44_0::test_fetch_offset_percent (call)' : not mssql >= (11,) and not oracle >= (12,)
  842. SKIPPED [1] lib/sqlalchemy/testing/config.py:420: 'test/dialect/test_suite.py::FetchLimitOffsetTest_sqlite+pysqlite_3_44_0::test_fetch_offset_percent_ties (call)' : not mssql >= (11,) and not oracle >= (12,)
  843. SKIPPED [1] lib/sqlalchemy/testing/config.py:420: 'test/dialect/test_suite.py::FetchLimitOffsetTest_sqlite+pysqlite_3_44_0::test_fetch_offset_ties (call)' : not postgresql >= (13,) and not mssql >= (11,) and not oracle >= (12,) and not mariadb >= (10, 6)
  844. SKIPPED [1] lib/sqlalchemy/testing/config.py:420: 'test/dialect/test_suite.py::FetchLimitOffsetTest_sqlite+pysqlite_3_44_0::test_fetch_offset_ties_exact_number (call)' : not postgresql >= (13,) and not mssql >= (11,) and not oracle >= (12,) and not mariadb >= (10, 6)
  845. SKIPPED [1] lib/sqlalchemy/testing/config.py:420: 'test/dialect/test_suite.py::FetchLimitOffsetTest_sqlite+pysqlite_3_44_0::test_simple_fetch (call)' : not postgresql and not mssql >= (11,) and not oracle >= (12,) and not mariadb >= (10, 6)
  846. SKIPPED [1] lib/sqlalchemy/testing/config.py:420: 'test/dialect/test_suite.py::FetchLimitOffsetTest_sqlite+pysqlite_3_44_0::test_simple_fetch_offset (call)' : not postgresql and not mssql >= (11,) and not oracle >= (12,) and not mariadb >= (10, 6)
  847. SKIPPED [1] lib/sqlalchemy/testing/config.py:420: 'test/dialect/test_suite.py::FetchLimitOffsetTest_sqlite+pysqlite_3_44_0::test_simple_fetch_percent (call)' : not mssql >= (11,) and not oracle >= (12,)
  848. SKIPPED [1] lib/sqlalchemy/testing/config.py:420: 'test/dialect/test_suite.py::FetchLimitOffsetTest_sqlite+pysqlite_3_44_0::test_simple_fetch_percent_ties (call)' : not mssql >= (11,) and not oracle >= (12,)
  849. SKIPPED [1] lib/sqlalchemy/testing/config.py:420: 'test/dialect/test_suite.py::FetchLimitOffsetTest_sqlite+pysqlite_3_44_0::test_simple_fetch_ties (call)' : not postgresql >= (13,) and not mssql >= (11,) and not oracle >= (12,) and not mariadb >= (10, 6)
  850. SKIPPED [1] lib/sqlalchemy/testing/config.py:420: 'test/dialect/test_suite.py::FutureTableDDLTest_sqlite+pysqlite_3_44_0::test_add_table_comment (call)' : not postgresql and not mysql and not mariadb and not oracle and not mssql
  851. SKIPPED [1] lib/sqlalchemy/testing/config.py:420: 'test/dialect/test_suite.py::FutureTableDDLTest_sqlite+pysqlite_3_44_0::test_drop_table_comment (call)' : not postgresql and not mysql and not mariadb and not oracle and not mssql
  852. SKIPPED [4] lib/sqlalchemy/testing/config.py:420: 'sqlalchemy.testing.suite.test_dialect.FutureWeCanSetDefaultSchemaWEventsTest' unsupported on any DB implementation 'sqlite(3.44.0)+pysqlite'not postgresql and not oracle
  853. SKIPPED [11] lib/sqlalchemy/testing/config.py:420: 'sqlalchemy.testing.suite.test_sequence.HasSequenceTest' unsupported on any DB implementation 'sqlite(3.44.0)+pysqlite'no sequence support
  854. SKIPPED [1] lib/sqlalchemy/testing/config.py:420: 'sqlalchemy.testing.suite.test_sequence.HasSequenceTestEmpty' unsupported on any DB implementation 'sqlite(3.44.0)+pysqlite'no sequence support
  855. SKIPPED [3] lib/sqlalchemy/testing/config.py:420: 'sqlalchemy.testing.suite.test_select.IdentityColumnTest' unsupported on any DB implementation 'sqlite(3.44.0)+pysqlite'not postgresql >= (10,) and not oracle >= (12,) and not mssql
  856. SKIPPED [2] lib/sqlalchemy/testing/config.py:420: 'sqlalchemy.testing.suite.test_reflection.IdentityReflectionTest' unsupported on any DB implementation 'sqlite(3.44.0)+pysqlite'not postgresql >= (10,) and not oracle >= (12,) and not mssql
  857. SKIPPED [5] lib/sqlalchemy/testing/config.py:420: 'sqlalchemy.testing.suite.test_types.IntervalTest' unsupported on any DB implementation 'sqlite(3.44.0)+pysqlite'not oracle and not postgresql
  858. SKIPPED [1] lib/sqlalchemy/testing/config.py:420: 'test/dialect/test_suite.py::IsolationLevelTest_sqlite+pysqlite_3_44_0::test_dialect_user_setting_is_restored (call)' : custom function or +aiosqlite
  859. SKIPPED [1] lib/sqlalchemy/testing/config.py:420: 'test/dialect/test_suite.py::JSONTest_sqlite+pysqlite_3_44_0::test_index_typed_access[string3] (call)' : custom function or mariadb or sqlite
  860. SKIPPED [1] lib/sqlalchemy/testing/config.py:420: 'test/dialect/test_suite.py::JSONTest_sqlite+pysqlite_3_44_0::test_index_typed_comparison[string3] (call)' : custom function or mariadb or sqlite
  861. SKIPPED [1] lib/sqlalchemy/testing/config.py:420: 'test/dialect/test_suite.py::JSONTest_sqlite+pysqlite_3_44_0::test_path_typed_comparison[string3] (call)' : custom function or mariadb or sqlite
  862. SKIPPED [1] lib/sqlalchemy/testing/config.py:420: 'test/dialect/test_suite.py::LikeFunctionsTest_sqlite+pysqlite_3_44_0::test_regexp_replace (call)' : not postgresql and not mysql >= (8,) and not mariadb and not oracle
  863. SKIPPED [7] lib/sqlalchemy/testing/config.py:420: 'sqlalchemy.testing.suite.test_types.NativeUUIDTest' unsupported on any DB implementation 'sqlite(3.44.0)+pysqlite'not postgresql >= (8, 3) and not mariadb >= (10, 7, 0)
  864. SKIPPED [2] lib/sqlalchemy/testing/config.py:420: 'sqlalchemy.testing.suite.test_reflection.NormalizedNameTest' unsupported on any DB implementation 'sqlite(3.44.0)+pysqlite'Backend does not require denormalized names.
  865. SKIPPED [5] lib/sqlalchemy/testing/config.py:420: 'sqlalchemy.testing.suite.test_types.PrecisionIntervalTest' unsupported on any DB implementation 'sqlite(3.44.0)+pysqlite'not oracle and not postgresql
  866. SKIPPED [1] lib/sqlalchemy/testing/config.py:420: 'test/dialect/test_suite.py::QuotedNameArgumentTest_sqlite+pysqlite_3_44_0::test_get_table_comment[quote " two-_exclusions_01] (call)' : not postgresql and not mysql and not mariadb and not oracle and not mssql
  867. SKIPPED [1] lib/sqlalchemy/testing/config.py:420: 'test/dialect/test_suite.py::QuotedNameArgumentTest_sqlite+pysqlite_3_44_0::test_get_table_comment[quote ' one-_exclusions_00] (call)' : not postgresql and not mysql and not mariadb and not oracle and not mssql
  868. SKIPPED [1] lib/sqlalchemy/testing/config.py:420: 'test/dialect/test_suite.py::ReturningTest_sqlite+pysqlite_3_44_0::test_imv_returning_datatypes[multiple_rows-not_sort_by_parameter_order-UUID] (call)' : not postgresql >= (8, 3) and not mariadb >= (10, 7, 0)
  869. SKIPPED [1] lib/sqlalchemy/testing/config.py:420: 'test/dialect/test_suite.py::ReturningTest_sqlite+pysqlite_3_44_0::test_imv_returning_datatypes[multiple_rows-not_sort_by_parameter_order-generic_native_uuid] (call)' : not postgresql >= (8, 3) and not mariadb >= (10, 7, 0)
  870. SKIPPED [1] lib/sqlalchemy/testing/config.py:420: 'test/dialect/test_suite.py::ReturningTest_sqlite+pysqlite_3_44_0::test_imv_returning_datatypes[multiple_rows-not_sort_by_parameter_order-non_native_uuid] (call)' : not postgresql >= (8, 3) and not mariadb >= (10, 7, 0)
  871. SKIPPED [1] lib/sqlalchemy/testing/config.py:420: 'test/dialect/test_suite.py::ReturningTest_sqlite+pysqlite_3_44_0::test_imv_returning_datatypes[multiple_rows-not_sort_by_parameter_order-non_native_uuid_str] (call)' : not postgresql >= (8, 3) and not mariadb >= (10, 7, 0)
  872. SKIPPED [1] lib/sqlalchemy/testing/config.py:420: 'test/dialect/test_suite.py::ReturningTest_sqlite+pysqlite_3_44_0::test_imv_returning_datatypes[multiple_rows-sort_by_parameter_order-LargeBinary1] (call)' : not postgresql >= (8, 3) and not mariadb >= (10, 7, 0)
  873. SKIPPED [1] lib/sqlalchemy/testing/config.py:420: 'test/dialect/test_suite.py::ReturningTest_sqlite+pysqlite_3_44_0::test_imv_returning_datatypes[multiple_rows-sort_by_parameter_order-LargeBinary2] (call)' : not postgresql >= (8, 3) and not mariadb >= (10, 7, 0)
  874. SKIPPED [1] lib/sqlalchemy/testing/config.py:420: 'test/dialect/test_suite.py::ReturningTest_sqlite+pysqlite_3_44_0::test_imv_returning_datatypes[multiple_rows-sort_by_parameter_order-UUID] (call)' : not postgresql >= (8, 3) and not mariadb >= (10, 7, 0)
  875. SKIPPED [1] lib/sqlalchemy/testing/config.py:420: 'test/dialect/test_suite.py::ReturningTest_sqlite+pysqlite_3_44_0::test_imv_returning_datatypes[multiple_rows-sort_by_parameter_order-generic_native_uuid] (call)' : not postgresql >= (8, 3) and not mariadb >= (10, 7, 0)
  876. SKIPPED [1] lib/sqlalchemy/testing/config.py:420: 'test/dialect/test_suite.py::ReturningTest_sqlite+pysqlite_3_44_0::test_imv_returning_datatypes[multiple_rows-sort_by_parameter_order-non_native_uuid] (call)' : not postgresql >= (8, 3) and not mariadb >= (10, 7, 0)
  877. SKIPPED [1] lib/sqlalchemy/testing/config.py:420: 'test/dialect/test_suite.py::ReturningTest_sqlite+pysqlite_3_44_0::test_imv_returning_datatypes[multiple_rows-sort_by_parameter_order-non_native_uuid_str] (call)' : not postgresql >= (8, 3) and not mariadb >= (10, 7, 0)
  878. SKIPPED [1] lib/sqlalchemy/testing/config.py:420: 'test/dialect/test_suite.py::ReturningTest_sqlite+pysqlite_3_44_0::test_imv_returning_datatypes[not_multiple_rows-not_sort_by_parameter_order-LargeBinary1] (call)' : not postgresql >= (8, 3) and not mariadb >= (10, 7, 0)
  879. SKIPPED [1] lib/sqlalchemy/testing/config.py:420: 'test/dialect/test_suite.py::ReturningTest_sqlite+pysqlite_3_44_0::test_imv_returning_datatypes[not_multiple_rows-not_sort_by_parameter_order-LargeBinary2] (call)' : not postgresql >= (8, 3) and not mariadb >= (10, 7, 0)
  880. SKIPPED [1] lib/sqlalchemy/testing/config.py:420: 'test/dialect/test_suite.py::ReturningTest_sqlite+pysqlite_3_44_0::test_imv_returning_datatypes[not_multiple_rows-not_sort_by_parameter_order-UUID] (call)' : not postgresql >= (8, 3) and not mariadb >= (10, 7, 0)
  881. SKIPPED [1] lib/sqlalchemy/testing/config.py:420: 'test/dialect/test_suite.py::ReturningTest_sqlite+pysqlite_3_44_0::test_imv_returning_datatypes[not_multiple_rows-not_sort_by_parameter_order-generic_native_uuid] (call)' : not postgresql >= (8, 3) and not mariadb >= (10, 7, 0)
  882. SKIPPED [1] lib/sqlalchemy/testing/config.py:420: 'test/dialect/test_suite.py::ReturningTest_sqlite+pysqlite_3_44_0::test_imv_returning_datatypes[not_multiple_rows-not_sort_by_parameter_order-non_native_uuid] (call)' : not postgresql >= (8, 3) and not mariadb >= (10, 7, 0)
  883. SKIPPED [1] lib/sqlalchemy/testing/config.py:420: 'test/dialect/test_suite.py::ReturningTest_sqlite+pysqlite_3_44_0::test_imv_returning_datatypes[not_multiple_rows-not_sort_by_parameter_order-non_native_uuid_str] (call)' : not postgresql >= (8, 3) and not mariadb >= (10, 7, 0)
  884. SKIPPED [1] lib/sqlalchemy/testing/config.py:420: 'test/dialect/test_suite.py::ReturningTest_sqlite+pysqlite_3_44_0::test_imv_returning_datatypes[not_multiple_rows-sort_by_parameter_order-LargeBinary1] (call)' : not postgresql >= (8, 3) and not mariadb >= (10, 7, 0)
  885. SKIPPED [1] lib/sqlalchemy/testing/config.py:420: 'test/dialect/test_suite.py::ReturningTest_sqlite+pysqlite_3_44_0::test_imv_returning_datatypes[not_multiple_rows-sort_by_parameter_order-LargeBinary2] (call)' : not postgresql >= (8, 3) and not mariadb >= (10, 7, 0)
  886. SKIPPED [1] lib/sqlalchemy/testing/config.py:420: 'test/dialect/test_suite.py::ReturningTest_sqlite+pysqlite_3_44_0::test_imv_returning_datatypes[not_multiple_rows-sort_by_parameter_order-UUID] (call)' : not postgresql >= (8, 3) and not mariadb >= (10, 7, 0)
  887. SKIPPED [1] lib/sqlalchemy/testing/config.py:420: 'test/dialect/test_suite.py::ReturningTest_sqlite+pysqlite_3_44_0::test_imv_returning_datatypes[not_multiple_rows-sort_by_parameter_order-generic_native_uuid] (call)' : not postgresql >= (8, 3) and not mariadb >= (10, 7, 0)
  888. SKIPPED [1] lib/sqlalchemy/testing/config.py:420: 'test/dialect/test_suite.py::ReturningTest_sqlite+pysqlite_3_44_0::test_imv_returning_datatypes[not_multiple_rows-sort_by_parameter_order-non_native_uuid] (call)' : not postgresql >= (8, 3) and not mariadb >= (10, 7, 0)
  889. SKIPPED [1] lib/sqlalchemy/testing/config.py:420: 'test/dialect/test_suite.py::ReturningTest_sqlite+pysqlite_3_44_0::test_imv_returning_datatypes[not_multiple_rows-sort_by_parameter_order-non_native_uuid_str] (call)' : not postgresql >= (8, 3) and not mariadb >= (10, 7, 0)
  890. SKIPPED [1] lib/sqlalchemy/testing/config.py:420: 'sqlalchemy.testing.suite.test_sequence.SequenceCompilerTest' unsupported on any DB implementation 'sqlite(3.44.0)+pysqlite'no sequence support
  891. SKIPPED [8] lib/sqlalchemy/testing/config.py:420: 'sqlalchemy.testing.suite.test_sequence.SequenceTest' unsupported on any DB implementation 'sqlite(3.44.0)+pysqlite'no sequence support
  892. SKIPPED [15] lib/sqlalchemy/testing/config.py:420: 'sqlalchemy.testing.suite.test_results.ServerSideCursorsTest' unsupported on any DB implementation 'sqlite(3.44.0)+pysqlite'no server side cursors support
  893. SKIPPED [1] lib/sqlalchemy/testing/config.py:420: 'test/dialect/test_suite.py::TableDDLTest_sqlite+pysqlite_3_44_0::test_add_table_comment (call)' : not postgresql and not mysql and not mariadb and not oracle and not mssql
  894. SKIPPED [1] lib/sqlalchemy/testing/config.py:420: 'test/dialect/test_suite.py::TableDDLTest_sqlite+pysqlite_3_44_0::test_drop_table_comment (call)' : not postgresql and not mysql and not mariadb and not oracle and not mssql
  895. SKIPPED [5] lib/sqlalchemy/testing/config.py:420: 'sqlalchemy.testing.suite.test_reflection.TableNoColumnsTest' unsupported on any DB implementation 'sqlite(3.44.0)+pysqlite'not postgresql
  896. SKIPPED [6] lib/sqlalchemy/testing/config.py:420: 'sqlalchemy.testing.suite.test_types.TimeTZTest' unsupported on any DB implementation 'sqlite(3.44.0)+pysqlite'not postgresql
  897. SKIPPED [6] lib/sqlalchemy/testing/config.py:420: 'sqlalchemy.testing.suite.test_types.TimestampMicrosecondsTest' unsupported on any DB implementation 'sqlite(3.44.0)+pysqlite'not oracle
  898. SKIPPED [1] lib/sqlalchemy/testing/config.py:420: 'sqlalchemy.testing.suite.test_select.ValuesExpressionTest' unsupported on any DB implementation 'sqlite(3.44.0)+pysqlite'not postgresql and not mssql
  899. SKIPPED [4] lib/sqlalchemy/testing/config.py:420: 'sqlalchemy.testing.suite.test_dialect.WeCanSetDefaultSchemaWEventsTest' unsupported on any DB implementation 'sqlite(3.44.0)+pysqlite'not postgresql and not oracle
  900. SKIPPED [1] lib/sqlalchemy/testing/config.py:420: 'test/orm/test_transaction.py::CleanSavepointTest_sqlite+pysqlite_3_44_0::test_rollback_ignores_clean_on_savepoint (call)' : savepoints not supported
  901. SKIPPED [1] lib/sqlalchemy/testing/config.py:420: 'test/orm/test_transaction.py::CleanSavepointTest_sqlite+pysqlite_3_44_0::test_rollback_ignores_clean_on_savepoint_agg_upd_eval (call)' : savepoints not supported
  902. SKIPPED [1] lib/sqlalchemy/testing/config.py:420: 'test/orm/test_transaction.py::CleanSavepointTest_sqlite+pysqlite_3_44_0::test_rollback_ignores_clean_on_savepoint_agg_upd_fetch (call)' : savepoints not supported
  903. SKIPPED [1] lib/sqlalchemy/testing/config.py:420: 'test/orm/test_transaction.py::ContextManagerPlusFutureTest_sqlite+pysqlite_3_44_0::test_contextmanager_nested_rollback (call)' : savepoints not supported
  904. SKIPPED [24] lib/sqlalchemy/testing/config.py:420: savepoints not enabled
  905. SKIPPED [1] lib/sqlalchemy/testing/config.py:420: 'test/orm/test_transaction.py::ContextManagerPlusFutureTest_sqlite+pysqlite_3_44_0::test_rollback_is_global (call)' : savepoints not supported
  906. SKIPPED [1] lib/sqlalchemy/testing/config.py:420: 'test/orm/test_transaction.py::NaturalPKRollbackTest_sqlite+pysqlite_3_44_0::test_key_replaced_by_update_nested (call)' : savepoints not supported
  907. SKIPPED [1] lib/sqlalchemy/testing/config.py:420: 'test/engine/test_transaction.py::ResetAgentTest_sqlite+pysqlite_3_44_0::test_begin_begin_nested_close (call)' : savepoints not supported
  908. SKIPPED [1] lib/sqlalchemy/testing/config.py:420: 'test/engine/test_transaction.py::ResetAgentTest_sqlite+pysqlite_3_44_0::test_begin_begin_nested_rollback_commit (call)' : savepoints not supported
  909. SKIPPED [1] lib/sqlalchemy/testing/config.py:420: 'test/engine/test_transaction.py::ResetAgentTest_sqlite+pysqlite_3_44_0::test_begin_begin_nested_rollback_rollback (call)' : savepoints not supported
  910. SKIPPED [1] lib/sqlalchemy/testing/config.py:420: 'test/engine/test_transaction.py::ResetAgentTest_sqlite+pysqlite_3_44_0::test_begin_nested_close (call)' : savepoints not supported
  911. SKIPPED [1] lib/sqlalchemy/testing/config.py:420: 'test/engine/test_transaction.py::ResetAgentTest_sqlite+pysqlite_3_44_0::test_begin_nested_trans_close_one (call)' : savepoints not supported
  912. SKIPPED [1] lib/sqlalchemy/testing/config.py:420: 'test/engine/test_transaction.py::ResetAgentTest_sqlite+pysqlite_3_44_0::test_begin_nested_trans_close_two (call)' : savepoints not supported
  913. SKIPPED [1] lib/sqlalchemy/testing/config.py:420: 'test/engine/test_transaction.py::ResetAgentTest_sqlite+pysqlite_3_44_0::test_begin_nested_trans_rollback (call)' : savepoints not supported
  914. SKIPPED [1] lib/sqlalchemy/testing/config.py:420: 'test/engine/test_transaction.py::ResetAgentTest_sqlite+pysqlite_3_44_0::test_reset_via_agent_begin_twophase (call)' : two-phase xact not supported by drivers or two-phase xact not supported by database or max_prepared_transactions not available or zero
  915. SKIPPED [1] lib/sqlalchemy/testing/config.py:420: 'test/engine/test_transaction.py::ResetAgentTest_sqlite+pysqlite_3_44_0::test_reset_via_agent_begin_twophase_commit (call)' : two-phase xact not supported by drivers or two-phase xact not supported by database or max_prepared_transactions not available or zero
  916. SKIPPED [1] lib/sqlalchemy/testing/config.py:420: 'test/engine/test_transaction.py::ResetAgentTest_sqlite+pysqlite_3_44_0::test_reset_via_agent_begin_twophase_rollback (call)' : two-phase xact not supported by drivers or two-phase xact not supported by database or max_prepared_transactions not available or zero
  917. SKIPPED [1] lib/sqlalchemy/testing/config.py:420: 'test/orm/test_transaction.py::RollbackRecoverTest_sqlite+pysqlite_3_44_0::test_pk_violation_with_savepoint (call)' : savepoints not supported
  918. SKIPPED [1] lib/sqlalchemy/testing/config.py:420: 'test/orm/test_transaction.py::SavepointTest_sqlite+pysqlite_3_44_0::test_expunge_pending_on_rollback (call)' : savepoints not supported
  919. SKIPPED [1] lib/sqlalchemy/testing/config.py:420: 'test/orm/test_transaction.py::SavepointTest_sqlite+pysqlite_3_44_0::test_savepoint_commit (call)' : savepoints not supported
  920. SKIPPED [1] lib/sqlalchemy/testing/config.py:420: 'test/orm/test_transaction.py::SavepointTest_sqlite+pysqlite_3_44_0::test_savepoint_commit_collections (call)' : savepoints not supported
  921. SKIPPED [1] lib/sqlalchemy/testing/config.py:420: 'test/orm/test_transaction.py::SavepointTest_sqlite+pysqlite_3_44_0::test_savepoint_delete (call)' : savepoints not supported
  922. SKIPPED [1] lib/sqlalchemy/testing/config.py:420: 'test/orm/test_transaction.py::SavepointTest_sqlite+pysqlite_3_44_0::test_savepoint_lost_still_runs (call)' : savepoints not supported
  923. SKIPPED [1] lib/sqlalchemy/testing/config.py:420: 'test/orm/test_transaction.py::SavepointTest_sqlite+pysqlite_3_44_0::test_savepoint_rollback (call)' : savepoints not supported
  924. SKIPPED [1] lib/sqlalchemy/testing/config.py:420: 'test/orm/test_transaction.py::SavepointTest_sqlite+pysqlite_3_44_0::test_savepoint_rollback_collections (call)' : savepoints not supported
  925. SKIPPED [1] lib/sqlalchemy/testing/config.py:420: 'test/orm/test_transaction.py::SavepointTest_sqlite+pysqlite_3_44_0::test_update_deleted_on_rollback (call)' : savepoints not supported
  926. SKIPPED [1] lib/sqlalchemy/testing/config.py:420: 'test/orm/test_transaction.py::SessionTransactionTest_sqlite+pysqlite_3_44_0::test_dirty_state_transferred_deep_nesting (call)' : savepoints not supported
  927. SKIPPED [1] lib/sqlalchemy/testing/config.py:420: 'test/orm/test_transaction.py::SessionTransactionTest_sqlite+pysqlite_3_44_0::test_external_nested_transaction (call)' : savepoints not supported
  928. SKIPPED [1] lib/sqlalchemy/testing/config.py:420: 'test/orm/test_transaction.py::SessionTransactionTest_sqlite+pysqlite_3_44_0::test_failed_rollback_deactivates_transaction (call)' : sqlite
  929. SKIPPED [1] lib/sqlalchemy/testing/config.py:420: 'test/orm/test_transaction.py::SessionTransactionTest_sqlite+pysqlite_3_44_0::test_invalidate (call)' : sqlite
  930. SKIPPED [1] lib/sqlalchemy/testing/config.py:420: 'test/orm/test_transaction.py::SessionTransactionTest_sqlite+pysqlite_3_44_0::test_mixed_transaction_close (call)' : savepoints not supported
  931. SKIPPED [1] lib/sqlalchemy/testing/config.py:420: 'test/orm/test_transaction.py::SessionTransactionTest_sqlite+pysqlite_3_44_0::test_nested_accounting_deleted_items_restored (call)' : savepoints not supported
  932. SKIPPED [1] lib/sqlalchemy/testing/config.py:420: 'test/orm/test_transaction.py::SessionTransactionTest_sqlite+pysqlite_3_44_0::test_nested_accounting_new_items_removed (call)' : savepoints not supported
  933. SKIPPED [1] lib/sqlalchemy/testing/config.py:420: 'test/orm/test_transaction.py::SessionTransactionTest_sqlite+pysqlite_3_44_0::test_nested_autotrans (call)' : savepoints not supported
  934. SKIPPED [1] lib/sqlalchemy/testing/config.py:420: 'test/orm/test_transaction.py::SessionTransactionTest_sqlite+pysqlite_3_44_0::test_nested_transaction (call)' : savepoints not supported
  935. SKIPPED [1] lib/sqlalchemy/testing/config.py:420: 'test/orm/test_transaction.py::SessionTransactionTest_sqlite+pysqlite_3_44_0::test_nested_transaction_connection_add (call)' : savepoints not supported
  936. SKIPPED [1] lib/sqlalchemy/testing/config.py:420: 'test/orm/test_transaction.py::SessionTransactionTest_sqlite+pysqlite_3_44_0::test_no_rollback_in_committed_state (call)' : sqlite
  937. SKIPPED [1] lib/sqlalchemy/testing/config.py:420: 'test/orm/test_transaction.py::SessionTransactionTest_sqlite+pysqlite_3_44_0::test_savepoint_on_external (call)' : savepoints not supported
  938. SKIPPED [1] lib/sqlalchemy/testing/config.py:420: 'test/orm/test_transaction.py::SessionTransactionTest_sqlite+pysqlite_3_44_0::test_transactions_isolated (call)' : sqlite
  939. SKIPPED [1] lib/sqlalchemy/testing/config.py:420: 'test/orm/test_transaction.py::SessionTransactionTest_sqlite+pysqlite_3_44_0::test_twophase (call)' : two-phase xact not supported by drivers or two-phase xact not supported by database or max_prepared_transactions not available or zero
  940. SKIPPED [1] lib/sqlalchemy/testing/config.py:420: 'test/orm/test_transaction.py::SubtransactionRecipeTest_subtransaction_recipe_one_True_sqlite+pysqlite_3_44_0::test_recipe_heavy_nesting (call)' : savepoints not supported
  941. SKIPPED [1] lib/sqlalchemy/testing/config.py:420: 'test/orm/test_transaction.py::SubtransactionRecipeTest_subtransaction_recipe_one_True_sqlite+pysqlite_3_44_0::test_recipe_mixed_transaction_control (call)' : savepoints not supported
  942. SKIPPED [1] lib/sqlalchemy/testing/config.py:420: 'test/orm/test_transaction.py::SubtransactionRecipeTest_subtransaction_recipe_three_True_sqlite+pysqlite_3_44_0::test_recipe_heavy_nesting (call)' : savepoints not supported
  943. SKIPPED [1] lib/sqlalchemy/testing/config.py:420: 'test/orm/test_transaction.py::SubtransactionRecipeTest_subtransaction_recipe_three_True_sqlite+pysqlite_3_44_0::test_recipe_mixed_transaction_control (call)' : savepoints not supported
  944. SKIPPED [1] lib/sqlalchemy/testing/config.py:420: 'test/orm/test_transaction.py::SubtransactionRecipeTest_subtransaction_recipe_two_False_sqlite+pysqlite_3_44_0::test_recipe_heavy_nesting (call)' : savepoints not supported
  945. SKIPPED [1] lib/sqlalchemy/testing/config.py:420: 'test/orm/test_transaction.py::SubtransactionRecipeTest_subtransaction_recipe_two_False_sqlite+pysqlite_3_44_0::test_recipe_mixed_transaction_control (call)' : savepoints not supported
  946. SKIPPED [1] lib/sqlalchemy/testing/config.py:420: 'test/engine/test_transaction.py::TransactionTest_sqlite+pysqlite_3_44_0::test_commit_inactive (call)' : sqlite
  947. SKIPPED [1] lib/sqlalchemy/testing/config.py:420: 'test/engine/test_transaction.py::TransactionTest_sqlite+pysqlite_3_44_0::test_ctxmanager_autobegins_real_trans_from_nested (call)' : savepoints not supported
  948. SKIPPED [1] lib/sqlalchemy/testing/config.py:420: 'test/engine/test_transaction.py::TransactionTest_sqlite+pysqlite_3_44_0::test_ctxmanager_rolls_back_savepoint[False] (call)' : savepoints not supported
  949. SKIPPED [1] lib/sqlalchemy/testing/config.py:420: 'test/engine/test_transaction.py::TransactionTest_sqlite+pysqlite_3_44_0::test_ctxmanager_rolls_back_savepoint[True] (call)' : savepoints not supported
  950. SKIPPED [1] lib/sqlalchemy/testing/config.py:420: 'test/engine/test_transaction.py::TransactionTest_sqlite+pysqlite_3_44_0::test_deactivated_savepoint_warning_straight (call)' : savepoints not supported
  951. SKIPPED [1] lib/sqlalchemy/testing/config.py:420: 'test/engine/test_transaction.py::TransactionTest_sqlite+pysqlite_3_44_0::test_multiple_two_phase (call)' : two-phase xact not supported by drivers or two-phase xact not supported by database or max_prepared_transactions not available or zero
  952. SKIPPED [1] lib/sqlalchemy/testing/config.py:420: 'test/engine/test_transaction.py::TransactionTest_sqlite+pysqlite_3_44_0::test_nested_subtransaction_commit (call)' : savepoints not supported
  953. SKIPPED [1] lib/sqlalchemy/testing/config.py:420: 'test/engine/test_transaction.py::TransactionTest_sqlite+pysqlite_3_44_0::test_nested_subtransaction_rollback (call)' : savepoints not supported
  954. SKIPPED [1] lib/sqlalchemy/testing/config.py:420: 'test/engine/test_transaction.py::TransactionTest_sqlite+pysqlite_3_44_0::test_no_rollback_in_deactive (call)' : sqlite
  955. SKIPPED [1] lib/sqlalchemy/testing/config.py:420: 'test/engine/test_transaction.py::TransactionTest_sqlite+pysqlite_3_44_0::test_no_rollback_in_deactive_savepoint (call)' : sqlite
  956. SKIPPED [1] lib/sqlalchemy/testing/config.py:420: 'test/engine/test_transaction.py::TransactionTest_sqlite+pysqlite_3_44_0::test_reset_rollback_two_phase_no_rollback (call)' : two-phase xact not supported by drivers or two-phase xact not supported by database or max_prepared_transactions not available or zero
  957. SKIPPED [1] lib/sqlalchemy/testing/config.py:420: 'test/engine/test_transaction.py::TransactionTest_sqlite+pysqlite_3_44_0::test_rollback_inactive (call)' : sqlite
  958. SKIPPED [1] lib/sqlalchemy/testing/config.py:420: 'test/engine/test_transaction.py::TransactionTest_sqlite+pysqlite_3_44_0::test_savepoint_five (call)' : savepoints not supported
  959. SKIPPED [1] lib/sqlalchemy/testing/config.py:420: 'test/engine/test_transaction.py::TransactionTest_sqlite+pysqlite_3_44_0::test_savepoint_four (call)' : savepoints not supported
  960. SKIPPED [1] lib/sqlalchemy/testing/config.py:420: 'test/engine/test_transaction.py::TransactionTest_sqlite+pysqlite_3_44_0::test_savepoint_one (call)' : savepoints not supported
  961. SKIPPED [1] lib/sqlalchemy/testing/config.py:420: 'test/engine/test_transaction.py::TransactionTest_sqlite+pysqlite_3_44_0::test_savepoint_release_fails_ctxmanager (call)' : savepoints not supported
  962. SKIPPED [1] lib/sqlalchemy/testing/config.py:420: 'test/engine/test_transaction.py::TransactionTest_sqlite+pysqlite_3_44_0::test_savepoint_release_fails_flat (call)' : savepoints not supported
  963. SKIPPED [1] lib/sqlalchemy/testing/config.py:420: 'test/engine/test_transaction.py::TransactionTest_sqlite+pysqlite_3_44_0::test_savepoint_rollback_fails_flat (call)' : savepoints not supported
  964. SKIPPED [1] lib/sqlalchemy/testing/config.py:420: 'test/engine/test_transaction.py::TransactionTest_sqlite+pysqlite_3_44_0::test_savepoint_seven (call)' : savepoints not supported
  965. SKIPPED [1] lib/sqlalchemy/testing/config.py:420: 'test/engine/test_transaction.py::TransactionTest_sqlite+pysqlite_3_44_0::test_savepoint_six (call)' : savepoints not supported
  966. SKIPPED [1] lib/sqlalchemy/testing/config.py:420: 'test/engine/test_transaction.py::TransactionTest_sqlite+pysqlite_3_44_0::test_savepoint_three (call)' : savepoints not supported
  967. SKIPPED [1] lib/sqlalchemy/testing/config.py:420: 'test/engine/test_transaction.py::TransactionTest_sqlite+pysqlite_3_44_0::test_savepoint_two (call)' : savepoints not supported
  968. SKIPPED [1] lib/sqlalchemy/testing/config.py:420: 'test/engine/test_transaction.py::TransactionTest_sqlite+pysqlite_3_44_0::test_two_phase_recover (call)' : two-phase xact not supported by drivers or two-phase xact not supported by database or max_prepared_transactions not available or zero
  969. SKIPPED [1] lib/sqlalchemy/testing/config.py:420: 'test/engine/test_transaction.py::TransactionTest_sqlite+pysqlite_3_44_0::test_two_phase_transaction (call)' : two-phase xact not supported by drivers or two-phase xact not supported by database or max_prepared_transactions not available or zero
  970. SKIPPED [1] lib/sqlalchemy/testing/config.py:420: 'test/orm/test_transaction.py::TwoPhaseTest_sqlite+pysqlite_3_44_0::test_rollback_on_prepare (call)' : two-phase xact not supported by drivers or two-phase xact not supported by database or max_prepared_transactions not available or zero
  971. SKIPPED [32] lib/sqlalchemy/testing/config.py:420: 'test.dialect.postgresql.test_types.ArrayEnum' unsupported on any DB implementation 'sqlite(3.44.0)+pysqlite'
  972. SKIPPED [6] lib/sqlalchemy/testing/config.py:420: 'test.dialect.postgresql.test_types.ArrayJSON' unsupported on any DB implementation 'sqlite(3.44.0)+pysqlite'
  973. SKIPPED [15] lib/sqlalchemy/testing/config.py:420: 'test.dialect.mssql.test_types.BinaryTest' unsupported on any DB implementation 'sqlite(3.44.0)+pysqlite'
  974. SKIPPED [4] lib/sqlalchemy/testing/config.py:420: 'test.dialect.mssql.test_types.BooleanTest' unsupported on any DB implementation 'sqlite(3.44.0)+pysqlite'
  975. SKIPPED [4] lib/sqlalchemy/testing/config.py:420: 'test.dialect.postgresql.test_types.CITextTest' unsupported on any DB implementation 'sqlite(3.44.0)+pysqlite'
  976. SKIPPED [230] lib/sqlalchemy/testing/config.py:420: 'test.dialect.postgresql.test_types.CoreArrayRoundTripTest' unsupported on any DB implementation 'sqlite(3.44.0)+pysqlite'
  977. SKIPPED [5] lib/sqlalchemy/testing/config.py:420: 'test.dialect.postgresql.test_types.DateMultiRangeRoundTripTest' unsupported on any DB implementation 'sqlite(3.44.0)+pysqlite'not +psycopg and not +asyncpg and not +pg8000, not postgresql >= (14,)
  978. SKIPPED [4] lib/sqlalchemy/testing/config.py:420: 'test.dialect.postgresql.test_types.DateMultiRangeRoundTripTest' unsupported on any DB implementation 'sqlite(3.44.0)+pysqlite'not postgresql >= (14,), not +psycopg and not +asyncpg and not +pg8000
  979. SKIPPED [1227] lib/sqlalchemy/testing/config.py:420: 'test.dialect.postgresql.test_types.DateRangeRoundTripTest' unsupported on any DB implementation 'sqlite(3.44.0)+pysqlite'not +psycopg2 and not +psycopg and not +asyncpg and not +pg8000
  980. SKIPPED [4] lib/sqlalchemy/testing/config.py:420: 'test.dialect.postgresql.test_types.DateTimeMultiRangeRoundTripTest' unsupported on any DB implementation 'sqlite(3.44.0)+pysqlite'not postgresql >= (14,), not +psycopg and not +asyncpg and not +pg8000
  981. SKIPPED [5] lib/sqlalchemy/testing/config.py:420: 'test.dialect.postgresql.test_types.DateTimeMultiRangeRoundTripTest' unsupported on any DB implementation 'sqlite(3.44.0)+pysqlite'not +psycopg and not +asyncpg and not +pg8000, not postgresql >= (14,)
  982. SKIPPED [1227] lib/sqlalchemy/testing/config.py:420: 'test.dialect.postgresql.test_types.DateTimeRangeRoundTripTest' unsupported on any DB implementation 'sqlite(3.44.0)+pysqlite'not +psycopg2 and not +psycopg and not +asyncpg and not +pg8000
  983. SKIPPED [23] lib/sqlalchemy/testing/config.py:420: 'test.dialect.postgresql.test_types.DateTimeTZMultiRangeCompilationTest' unsupported on any DB implementation 'sqlite(3.44.0)+pysqlite'
  984. SKIPPED [9] lib/sqlalchemy/testing/config.py:420: 'test.dialect.postgresql.test_types.DateTimeTZRMultiangeRoundTripTest' unsupported on any DB implementation 'sqlite(3.44.0)+pysqlite'
  985. SKIPPED [1227] lib/sqlalchemy/testing/config.py:420: 'test.dialect.postgresql.test_types.DateTimeTZRangeRoundTripTest' unsupported on any DB implementation 'sqlite(3.44.0)+pysqlite'not +psycopg2 and not +psycopg and not +asyncpg and not +pg8000
  986. SKIPPED [2] lib/sqlalchemy/testing/config.py:420: 'test.dialect.postgresql.test_types.DomainDDLEventTest' unsupported on any DB implementation 'sqlite(3.44.0)+pysqlite'
  987. SKIPPED [2] lib/sqlalchemy/testing/config.py:420: 'test.dialect.postgresql.test_types.EnumDDLEventTest' unsupported on any DB implementation 'sqlite(3.44.0)+pysqlite'
  988. SKIPPED [19] lib/sqlalchemy/testing/config.py:420: 'test.dialect.mysql.test_types.EnumSetTest' unsupported on any DB implementation 'sqlite(3.44.0)+pysqlite'
  989. SKIPPED [7] lib/sqlalchemy/testing/config.py:420: 'test.dialect.oracle.test_types.EuroNumericTest' unsupported on any DB implementation 'sqlite(3.44.0)+pysqlite'
  990. SKIPPED [3] lib/sqlalchemy/testing/config.py:420: 'test.dialect.postgresql.test_types.FloatCoercionTest' unsupported on any DB implementation 'sqlite(3.44.0)+pysqlite'
  991. SKIPPED [13] lib/sqlalchemy/testing/config.py:420: 'test.dialect.postgresql.test_types.HStoreRoundTripTest' unsupported on any DB implementation 'sqlite(3.44.0)+pysqlite'needs hstore extension
  992. SKIPPED [4] lib/sqlalchemy/testing/config.py:420: 'test.dialect.postgresql.test_types.HashableFlagORMTest' unsupported on any DB implementation 'sqlite(3.44.0)+pysqlite'
  993. SKIPPED [10] lib/sqlalchemy/testing/config.py:420: 'test.dialect.postgresql.test_types.InetRoundTripTests' unsupported on any DB implementation 'sqlite(3.44.0)+pysqlite'
  994. SKIPPED [5] lib/sqlalchemy/testing/config.py:420: 'test.dialect.postgresql.test_types.Int4MultiRangeRoundTripTest' unsupported on any DB implementation 'sqlite(3.44.0)+pysqlite'not postgresql >= (14,), not +psycopg and not +asyncpg and not +pg8000
  995. SKIPPED [4] lib/sqlalchemy/testing/config.py:420: 'test.dialect.postgresql.test_types.Int4MultiRangeRoundTripTest' unsupported on any DB implementation 'sqlite(3.44.0)+pysqlite'not +psycopg and not +asyncpg and not +pg8000, not postgresql >= (14,)
  996. SKIPPED [1227] lib/sqlalchemy/testing/config.py:420: 'test.dialect.postgresql.test_types.Int4RangeRoundTripTest' unsupported on any DB implementation 'sqlite(3.44.0)+pysqlite'not +psycopg2 and not +psycopg and not +asyncpg and not +pg8000
  997. SKIPPED [5] lib/sqlalchemy/testing/config.py:420: 'test.dialect.postgresql.test_types.Int8MultiRangeRoundTripTest' unsupported on any DB implementation 'sqlite(3.44.0)+pysqlite'not +psycopg and not +asyncpg and not +pg8000, not postgresql >= (14,)
  998. SKIPPED [4] lib/sqlalchemy/testing/config.py:420: 'test.dialect.postgresql.test_types.Int8MultiRangeRoundTripTest' unsupported on any DB implementation 'sqlite(3.44.0)+pysqlite'not postgresql >= (14,), not +psycopg and not +asyncpg and not +pg8000
  999. SKIPPED [1227] lib/sqlalchemy/testing/config.py:420: 'test.dialect.postgresql.test_types.Int8RangeRoundTripTest' unsupported on any DB implementation 'sqlite(3.44.0)+pysqlite'not +psycopg2 and not +psycopg and not +asyncpg and not +pg8000
  1000. SKIPPED [5] lib/sqlalchemy/testing/config.py:420: 'test.dialect.postgresql.test_types.JSONBCastSuiteTest' unsupported on any DB implementation 'sqlite(3.44.0)+pysqlite'not postgresql >= (9, 4)
  1001. SKIPPED [24] lib/sqlalchemy/testing/config.py:420: 'test.dialect.postgresql.test_types.JSONBRoundTripTest' unsupported on any DB implementation 'sqlite(3.44.0)+pysqlite'
  1002. SKIPPED [99] lib/sqlalchemy/testing/config.py:420: 'test.dialect.postgresql.test_types.JSONBSuiteTest' unsupported on any DB implementation 'sqlite(3.44.0)+pysqlite'not postgresql >= (9, 4)
  1003. SKIPPED [21] lib/sqlalchemy/testing/config.py:420: 'test.dialect.postgresql.test_types.JSONRoundTripTest' unsupported on any DB implementation 'sqlite(3.44.0)+pysqlite'
  1004. SKIPPED [2] lib/sqlalchemy/testing/config.py:420: 'test.dialect.mysql.test_types.JSONTest' unsupported on any DB implementation 'sqlite(3.44.0)+pysqlite'
  1005. SKIPPED [44] lib/sqlalchemy/testing/config.py:420: 'test.dialect.oracle.test_types.LOBFetchTest' unsupported on any DB implementation 'sqlite(3.44.0)+pysqlite'
  1006. SKIPPED [1] lib/sqlalchemy/testing/config.py:420: 'test/sql/test_types.py::LiteralTest_sqlite+pysqlite_3_44_0::test_render_datetime[date] (call)' : custom function
  1007. SKIPPED [1] lib/sqlalchemy/testing/config.py:420: 'test/sql/test_types.py::LiteralTest_sqlite+pysqlite_3_44_0::test_render_datetime[datetime] (call)' : custom function
  1008. SKIPPED [1] lib/sqlalchemy/testing/config.py:420: 'test/sql/test_types.py::LiteralTest_sqlite+pysqlite_3_44_0::test_render_datetime[time] (call)' : custom function
  1009. SKIPPED [3] lib/sqlalchemy/testing/config.py:420: 'test.dialect.mssql.test_types.MSDateTypeTest' unsupported on any DB implementation 'sqlite(3.44.0)+pysqlite'
  1010. SKIPPED [65] lib/sqlalchemy/testing/config.py:420: 'test.dialect.postgresql.test_types.NamedTypeTest' unsupported on any DB implementation 'sqlite(3.44.0)+pysqlite'
  1011. SKIPPED [2] lib/sqlalchemy/testing/config.py:420: 'test.dialect.postgresql.test_types.NativeEnumDDLEventTest' unsupported on any DB implementation 'sqlite(3.44.0)+pysqlite'
  1012. SKIPPED [4] lib/sqlalchemy/testing/config.py:420: 'test.dialect.postgresql.test_types.NumMultiRangeRoundTripTest' unsupported on any DB implementation 'sqlite(3.44.0)+pysqlite'not +psycopg and not +asyncpg and not +pg8000, not postgresql >= (14,)
  1013. SKIPPED [5] lib/sqlalchemy/testing/config.py:420: 'test.dialect.postgresql.test_types.NumMultiRangeRoundTripTest' unsupported on any DB implementation 'sqlite(3.44.0)+pysqlite'not postgresql >= (14,), not +psycopg and not +asyncpg and not +pg8000
  1014. SKIPPED [1227] lib/sqlalchemy/testing/config.py:420: 'test.dialect.postgresql.test_types.NumRangeRoundTripTest' unsupported on any DB implementation 'sqlite(3.44.0)+pysqlite'not +psycopg2 and not +psycopg and not +asyncpg and not +pg8000
  1015. SKIPPED [2] lib/sqlalchemy/testing/config.py:420: 'test.dialect.postgresql.test_types.NumericInterpretationTest' unsupported on any DB implementation 'sqlite(3.44.0)+pysqlite'
  1016. SKIPPED [1] lib/sqlalchemy/testing/config.py:420: 'test.dialect.postgresql.test_types.OIDTest' unsupported on any DB implementation 'sqlite(3.44.0)+pysqlite'
  1017. SKIPPED [291] lib/sqlalchemy/testing/config.py:420: 'test.dialect.postgresql.test_types.PGArrayRoundTripTest' unsupported on any DB implementation 'sqlite(3.44.0)+pysqlite'
  1018. SKIPPED [8] lib/sqlalchemy/testing/config.py:420: 'test.dialect.postgresql.test_types.PGInsertManyValuesTest' unsupported on any DB implementation 'sqlite(3.44.0)+pysqlite'
  1019. SKIPPED [4] lib/sqlalchemy/testing/config.py:420: 'test.dialect.postgresql.test_types.RegClassTest' unsupported on any DB implementation 'sqlite(3.44.0)+pysqlite'
  1020. SKIPPED [9] lib/sqlalchemy/testing/config.py:420: 'test.dialect.mssql.test_types.RowVersionTest' unsupported on any DB implementation 'sqlite(3.44.0)+pysqlite'
  1021. SKIPPED [16] lib/sqlalchemy/testing/config.py:420: 'test.dialect.oracle.test_types.SetInputSizesTest' unsupported on any DB implementation 'sqlite(3.44.0)+pysqlite'
  1022. SKIPPED [3] lib/sqlalchemy/testing/config.py:420: 'test.dialect.postgresql.test_types.SpecialTypesTest' unsupported on any DB implementation 'sqlite(3.44.0)+pysqlite'
  1023. SKIPPED [312] lib/sqlalchemy/testing/config.py:420: 'test.dialect.mssql.test_types.StringRoundTripTest' unsupported on any DB implementation 'sqlite(3.44.0)+pysqlite'
  1024. SKIPPED [2] lib/sqlalchemy/testing/config.py:420: 'test.dialect.mssql.test_types.TimeParameterTest' unsupported on any DB implementation 'sqlite(3.44.0)+pysqlite'
  1025. SKIPPED [1] lib/sqlalchemy/testing/config.py:420: 'test.dialect.postgresql.test_types.TimePrecisionTest' unsupported on any DB implementation 'sqlite(3.44.0)+pysqlite'
  1026. SKIPPED [7] lib/sqlalchemy/testing/config.py:420: 'test.dialect.postgresql.test_types.TimestampTest' unsupported on any DB implementation 'sqlite(3.44.0)+pysqlite'
  1027. SKIPPED [2] lib/sqlalchemy/testing/config.py:420: 'test.dialect.postgresql.test_types.TimezoneTest' unsupported on any DB implementation 'sqlite(3.44.0)+pysqlite'
  1028. SKIPPED [1] lib/sqlalchemy/testing/config.py:420: 'test/sql/test_types.py::TypeDecoratorSpecialCasesTest_sqlite+pysqlite_3_44_0::test_typedec_of_array (call)' : custom function
  1029. SKIPPED [1] lib/sqlalchemy/testing/config.py:420: 'test/sql/test_types.py::TypeDecoratorSpecialCasesTest_sqlite+pysqlite_3_44_0::test_typedec_of_array_modified (call)' : custom function
  1030. SKIPPED [19] lib/sqlalchemy/testing/config.py:420: 'test.dialect.mssql.test_types.TypeRoundTripTest' unsupported on any DB implementation 'sqlite(3.44.0)+pysqlite'
  1031. SKIPPED [33] lib/sqlalchemy/testing/config.py:420: 'test.dialect.mysql.test_types.TypeRoundTripTest' unsupported on any DB implementation 'sqlite(3.44.0)+pysqlite'
  1032. SKIPPED [29] lib/sqlalchemy/testing/config.py:420: 'test.dialect.oracle.test_types.TypesTest' unsupported on any DB implementation 'sqlite(3.44.0)+pysqlite'
  1033. SKIPPED [7] lib/sqlalchemy/testing/config.py:420: 'test.dialect.postgresql.test_types.UUIDTest' unsupported on any DB implementation 'sqlite(3.44.0)+pysqlite'
  1034. SKIPPED [7] lib/sqlalchemy/testing/config.py:420: 'test.dialect.mssql.test_types.UniqueIdentifierTest' unsupported on any DB implementation 'sqlite(3.44.0)+pysqlite'
  1035. SKIPPED [1] lib/sqlalchemy/testing/config.py:420: 'test.orm.test_unitofwork.BatchDeleteIgnoresRowcountTest' unsupported on any DB implementation 'sqlite(3.44.0)+pysqlite'not supported by database
  1036. SKIPPED [4] lib/sqlalchemy/testing/config.py:420: 'test.orm.test_unitofwork.ExtraPassiveDeletesTest' unsupported on any DB implementation 'sqlite(3.44.0)+pysqlite'not supported by database
  1037. SKIPPED [1] lib/sqlalchemy/testing/config.py:420: 'test/orm/test_unitofwork.py::NoRowInsertedTest_sqlite+pysqlite_3_44_0::test_insert_single_no_pk_correct_exception (call)' : only postgresql uses RETURNING for a single-row INSERT among the DBs we are using in this test
  1038. SKIPPED [3] lib/sqlalchemy/testing/config.py:420: 'test.orm.test_unitofwork.PassiveDeletesTest' unsupported on any DB implementation 'sqlite(3.44.0)+pysqlite'not supported by database
  1039. SKIPPED [1] lib/sqlalchemy/testing/config.py:420: 'test/orm/test_unitofworkv2.py::ORMOnlyPrimaryKeyTest::test_a (call)' : not postgresql >= (10,) and not oracle >= (12,) and not mssql
  1040. SKIPPED [1] lib/sqlalchemy/testing/config.py:420: 'test/orm/test_unitofworkv2.py::ORMOnlyPrimaryKeyTest::test_b (call)' : doesn't support sequences as a server side default. and doesn't support sequences as a server side default. and doesn't support sequences as a server side default.
  1041. SKIPPED [1] lib/sqlalchemy/testing/config.py:420: 'test/orm/test_unitofworkv2.py::TryToFoolInsertManyValuesTest_sqlite+pysqlite_3_44_0::test_original_use_case[default_string_uuid-identity] (call)' : not postgresql >= (10,) and not oracle >= (12,) and not mssql
  1042. SKIPPED [1] lib/sqlalchemy/testing/config.py:420: 'test/orm/test_unitofworkv2.py::TryToFoolInsertManyValuesTest_sqlite+pysqlite_3_44_0::test_original_use_case[default_string_uuid-sequence] (call)' : no sequence support
  1043. SKIPPED [1] lib/sqlalchemy/testing/config.py:420: 'test/orm/test_unitofworkv2.py::TryToFoolInsertManyValuesTest_sqlite+pysqlite_3_44_0::test_original_use_case[default_uuid-identity] (call)' : not postgresql >= (10,) and not oracle >= (12,) and not mssql
  1044. SKIPPED [1] lib/sqlalchemy/testing/config.py:420: 'test/orm/test_unitofworkv2.py::TryToFoolInsertManyValuesTest_sqlite+pysqlite_3_44_0::test_original_use_case[default_uuid-sequence] (call)' : no sequence support
  1045. SKIPPED [1] lib/sqlalchemy/testing/config.py:420: 'test/orm/test_unitofworkv2.py::TryToFoolInsertManyValuesTest_sqlite+pysqlite_3_44_0::test_original_use_case[explicit-identity] (call)' : not postgresql >= (10,) and not oracle >= (12,) and not mssql
  1046. SKIPPED [1] lib/sqlalchemy/testing/config.py:420: 'test/orm/test_unitofworkv2.py::TryToFoolInsertManyValuesTest_sqlite+pysqlite_3_44_0::test_original_use_case[explicit-sequence] (call)' : no sequence support
  1047. SKIPPED [1] lib/sqlalchemy/testing/config.py:420: 'test/orm/test_unitofworkv2.py::TryToFoolInsertManyValuesTest_sqlite+pysqlite_3_44_0::test_original_use_case[implicit_not_omitted-identity] (call)' : not postgresql >= (10,) and not oracle >= (12,) and not mssql
  1048. SKIPPED [1] lib/sqlalchemy/testing/config.py:420: 'test/orm/test_unitofworkv2.py::TryToFoolInsertManyValuesTest_sqlite+pysqlite_3_44_0::test_original_use_case[implicit_not_omitted-sequence] (call)' : no sequence support
  1049. SKIPPED [1] lib/sqlalchemy/testing/config.py:420: 'test/orm/test_unitofworkv2.py::TryToFoolInsertManyValuesTest_sqlite+pysqlite_3_44_0::test_original_use_case[implicit_omitted-identity] (call)' : not postgresql >= (10,) and not oracle >= (12,) and not mssql
  1050. SKIPPED [1] lib/sqlalchemy/testing/config.py:420: 'test/orm/test_unitofworkv2.py::TryToFoolInsertManyValuesTest_sqlite+pysqlite_3_44_0::test_original_use_case[implicit_omitted-sequence] (call)' : no sequence support
  1051. SKIPPED [1] lib/sqlalchemy/testing/config.py:420: 'test/orm/test_unitofworkv2.py::TryToFoolInsertManyValuesTest_sqlite+pysqlite_3_44_0::test_original_use_case[none-identity] (call)' : not postgresql >= (10,) and not oracle >= (12,) and not mssql
  1052. SKIPPED [1] lib/sqlalchemy/testing/config.py:420: 'test/orm/test_unitofworkv2.py::TryToFoolInsertManyValuesTest_sqlite+pysqlite_3_44_0::test_original_use_case[none-sequence] (call)' : no sequence support
  1053. SKIPPED [1] lib/sqlalchemy/testing/config.py:420: 'test/orm/test_unitofworkv2.py::TryToFoolInsertManyValuesTest_sqlite+pysqlite_3_44_0::test_this_really_fails_on_mssql_wo_full_fix (call)' : not mssql
  1054. SKIPPED [1] lib/sqlalchemy/testing/config.py:420: 'test/sql/test_update.py::UpdateFromMultiTableUpdateDefaultsTest_sqlite+pysqlite_3_44_0::test_defaults_second_table (call)' : Multi table update and Multi table update
  1055. SKIPPED [1] lib/sqlalchemy/testing/config.py:420: 'test/sql/test_update.py::UpdateFromMultiTableUpdateDefaultsTest_sqlite+pysqlite_3_44_0::test_defaults_second_table_same_name (call)' : Multi table update and Multi table update
  1056. SKIPPED [1] lib/sqlalchemy/testing/config.py:420: 'test/sql/test_update.py::UpdateFromMultiTableUpdateDefaultsTest_sqlite+pysqlite_3_44_0::test_no_defaults_second_table (call)' : Multi table update and Multi table update
  1057. SKIPPED [1] lib/sqlalchemy/testing/config.py:420: 'test/sql/test_update.py::UpdateFromRoundTripTest_sqlite+pysqlite_3_44_0::test_exec_join_multitable (call)' : Multi table update and Multi table update
  1058. SKIPPED [1] lib/sqlalchemy/testing/config.py:420: 'test/sql/test_update.py::UpdateFromRoundTripTest_sqlite+pysqlite_3_44_0::test_exec_multitable (call)' : Multi table update and Multi table update
  1059. SKIPPED [1] lib/sqlalchemy/testing/config.py:420: 'test/sql/test_update.py::UpdateFromRoundTripTest_sqlite+pysqlite_3_44_0::test_exec_multitable_same_name (call)' : Multi table update and Multi table update
  1060. SKIPPED [1] lib/sqlalchemy/testing/config.py:420: 'test/orm/dml/test_update_delete_where.py::InheritTest_sqlite+pysqlite_3_44_0::test_delete_using[None] (call)' : Backend does not support DELETE..USING or equivalent and Backend does not support DELETE..USING or equivalent and Backend does not support DELETE..USING or equivalent and Backend does not support DELETE..USING or equivalent
  1061. SKIPPED [1] lib/sqlalchemy/testing/config.py:420: 'test/orm/dml/test_update_delete_where.py::InheritTest_sqlite+pysqlite_3_44_0::test_delete_using[evaluate] (call)' : Backend does not support DELETE..USING or equivalent and Backend does not support DELETE..USING or equivalent and Backend does not support DELETE..USING or equivalent and Backend does not support DELETE..USING or equivalent
  1062. SKIPPED [1] lib/sqlalchemy/testing/config.py:420: 'test/orm/dml/test_update_delete_where.py::InheritTest_sqlite+pysqlite_3_44_0::test_delete_using[fetch] (call)' : Backend does not support DELETE..USING or equivalent and Backend does not support DELETE..USING or equivalent and Backend does not support DELETE..USING or equivalent and Backend does not support DELETE..USING or equivalent
  1063. SKIPPED [1] lib/sqlalchemy/testing/config.py:420: 'test/orm/dml/test_update_delete_where.py::InheritTest_sqlite+pysqlite_3_44_0::test_delete_using[fetch_w_hint] (call)' : Backend does not support DELETE..USING or equivalent and Backend does not support DELETE..USING or equivalent and Backend does not support DELETE..USING or equivalent and Backend does not support DELETE..USING or equivalent
  1064. SKIPPED [1] lib/sqlalchemy/testing/config.py:420: 'test/orm/dml/test_update_delete_where.py::InheritTest_sqlite+pysqlite_3_44_0::test_update_from_join_no_problem (call)' : Multi table update and Multi table update
  1065. SKIPPED [1] lib/sqlalchemy/testing/config.py:420: 'test/orm/dml/test_update_delete_where.py::InheritTest_sqlite+pysqlite_3_44_0::test_update_from_multitable[None] (call)' : Backend does not support DELETE..USING or equivalent and Backend does not support DELETE..USING or equivalent and Backend does not support DELETE..USING or equivalent and Backend does not support DELETE..USING or equivalent
  1066. SKIPPED [1] lib/sqlalchemy/testing/config.py:420: 'test/orm/dml/test_update_delete_where.py::InheritTest_sqlite+pysqlite_3_44_0::test_update_from_multitable[evaluate] (call)' : Backend does not support DELETE..USING or equivalent and Backend does not support DELETE..USING or equivalent and Backend does not support DELETE..USING or equivalent and Backend does not support DELETE..USING or equivalent
  1067. SKIPPED [1] lib/sqlalchemy/testing/config.py:420: 'test/orm/dml/test_update_delete_where.py::InheritTest_sqlite+pysqlite_3_44_0::test_update_from_multitable[fetch] (call)' : Backend does not support DELETE..USING or equivalent and Backend does not support DELETE..USING or equivalent and Backend does not support DELETE..USING or equivalent and Backend does not support DELETE..USING or equivalent
  1068. SKIPPED [1] lib/sqlalchemy/testing/config.py:420: 'test/orm/dml/test_update_delete_where.py::UpdateDeleteFromTest_sqlite+pysqlite_3_44_0::test_delete_using_joined_subq_test (call)' : Backend does not support DELETE..USING or equivalent and Backend does not support DELETE..USING or equivalent and Backend does not support DELETE..USING or equivalent and Backend does not support DELETE..USING or equivalent
  1069. SKIPPED [1] lib/sqlalchemy/testing/config.py:420: 'test/orm/dml/test_update_delete_where.py::UpdateDeleteFromTest_sqlite+pysqlite_3_44_0::test_multi_table_criteria_ok_wo_eval (call)' : Multi table update and Multi table update
  1070. SKIPPED [1] lib/sqlalchemy/testing/config.py:420: 'test/orm/dml/test_update_delete_where.py::UpdateDeleteFromTest_sqlite+pysqlite_3_44_0::test_update_from_multitable_same_names (call)' : Multi table update and Multi table update
  1071. SKIPPED [1] lib/sqlalchemy/testing/config.py:420: 'test/orm/dml/test_update_delete_where.py::UpdateDeleteTest_sqlite+pysqlite_3_44_0::test_update_against_external_non_mapped_cols (call)' : not postgresql and not mssql
  1072. SKIPPED [1] lib/sqlalchemy/testing/config.py:420: 'test/base/test_utils.py::CyExtensionTest::test_all_cyext_imported (call)' : No Cython
  1073. SKIPPED [1] lib/sqlalchemy/testing/config.py:420: 'test/orm/test_versioning.py::ServerVersioningTest_sqlite+pysqlite_3_44_0::test_concurrent_mod_err_expire_on_commit (call)' : sqlite
  1074. SKIPPED [1] lib/sqlalchemy/testing/config.py:420: 'test/orm/test_versioning.py::ServerVersioningTest_sqlite+pysqlite_3_44_0::test_concurrent_mod_err_noexpire_on_commit (call)' : sqlite
  1075. SKIPPED [1] lib/sqlalchemy/testing/config.py:420: 'test/orm/test_versioning.py::VersioningTest_sqlite+pysqlite_3_44_0::test_versioncheck_for_update (call)' : no FOR UPDATE NOWAIT support
  1076. FAILED test/sql/test_resultset.py::CursorResultTest_sqlite+pysqlite_3_44_0::test_pickle_rows_other_process[not_use_labels]
  1077. FAILED test/sql/test_resultset.py::CursorResultTest_sqlite+pysqlite_3_44_0::test_pickle_rows_other_process[use_labels]
  1078. ========= 2 failed, 20608 passed, 10704 skipped in 3256.33s (0:54:16) ==========
  1079. ==> ERROR: A failure occurred in check().
  1080.     Aborting...
  1081.  
Advertisement
Add Comment
Please, Sign In to add comment