SHARE
TWEET

15210-trunk-dtest

a guest Aug 12th, 2019 107 Never
Not a member of Pastebin yet? Sign Up, it unlocks many cool features!
  1. ============================= test session starts ==============================
  2. platform darwin -- Python 3.7.1, pytest-3.6.4, py-1.8.0, pluggy-0.7.1
  3. rootdir: /Users/asp/development/cassandra-dtest, inifile: pytest.ini
  4. plugins: timeout-1.3.3, flaky-3.6.0
  5. timeout: 900.0s
  6. timeout method: signal
  7. timeout func_only: False
  8. collected 5527 items / 4485 deselected
  9.  
  10. auditlog_test.py .....                                                   [  0%]
  11. auth_join_ring_false_test.py ....                                        [  0%]
  12. auth_test.py ..ss....s.................................................. [  6%]
  13. ..................................                                       [  9%]
  14. batch_test.py ..................sssssss                                  [ 12%]
  15. bootstrap_test.py ......................                                 [ 14%]
  16. cdc_test.py .....                                                        [ 14%]
  17. cfid_test.py .                                                           [ 14%]
  18. commitlog_test.py ............                                           [ 16%]
  19. compaction_test.py sss..........................s                        [ 18%]
  20. compression_test.py ....                                                 [ 19%]
  21. concurrent_schema_changes_test.py sssssssssssss                          [ 20%]
  22. configuration_test.py ..                                                 [ 20%]
  23. consistency_test.py ..............F....                                  [ 22%]
  24. consistent_bootstrap_test.py ..                                          [ 22%]
  25. counter_test.py s....s.s                                                 [ 23%]
  26. cql_prepared_test.py .                                                   [ 23%]
  27. cql_test.py ..s......sss...ss.........                                   [ 26%]
  28. cql_tracing_test.py FF..                                                 [ 26%]
  29. delete_insert_test.py .                                                  [ 26%]
  30. deletion_test.py ..                                                      [ 26%]
  31. disk_balance_test.py ..........                                          [ 27%]
  32. fqltool_test.py ...                                                      [ 28%]
  33. global_row_key_cache_test.py .                                           [ 28%]
  34. hintedhandoff_test.py .......                                            [ 28%]
  35. internode_ssl_test.py ..                                                 [ 28%]
  36. jmx_auth_test.py .                                                       [ 29%]
  37. jmx_test.py ........                                                     [ 29%]
  38. json_test.py ...............                                             [ 31%]
  39. json_tools_test.py s                                                     [ 31%]
  40. largecolumn_test.py .                                                    [ 31%]
  41. legacy_sstables_test.py s                                                [ 31%]
  42. materialized_views_test.py .........................s.....s............. [ 35%]
  43. ..s..                                                                    [ 36%]
  44. metadata_test.py s                                                       [ 36%]
  45. mixed_version_test.py s                                                  [ 36%]
  46. multidc_putget_test.py ..                                                [ 36%]
  47. native_transport_ssl_test.py ....                                        [ 37%]
  48. nodetool_test.py ...........                                             [ 38%]
  49. offline_tools_test.py ....s.                                             [ 38%]
  50. paging_test.py ......................s.s.....s.s..s.s..s..........s..... [ 44%]
  51.                                                                          [ 44%]
  52. paxos_test.py ..s.                                                       [ 44%]
  53. prepared_statements_test.py .                                            [ 44%]
  54. pushed_notifications_test.py .......                                     [ 45%]
  55. putget_test.py ......s                                                   [ 46%]
  56. range_ghost_test.py .                                                    [ 46%]
  57. read_failures_test.py ...                                                [ 46%]
  58. read_repair_test.py .s............                                       [ 47%]
  59. rebuild_test.py ..E....                                                  [ 48%]
  60. refresh_test.py .                                                        [ 48%]
  61. replace_address_test.py .....                                            [ 48%]
  62. replication_test.py .....ss...s.                                         [ 50%]
  63. schema_metadata_test.py .........ss.......                               [ 51%]
  64. schema_test.py .s....                                                    [ 52%]
  65. scrub_test.py .......                                                    [ 53%]
  66. secondary_indexes_test.py .....s...........s....                         [ 55%]
  67. seed_test.py ...                                                         [ 55%]
  68. snapshot_test.py ..........                                              [ 56%]
  69. snitch_test.py .                                                         [ 56%]
  70. sslnodetonode_test.py ........                                           [ 57%]
  71. sstable_generation_loading_test.py sssssssssssssssssss.....              [ 59%]
  72. sstablesplit_test.py ..                                                  [ 59%]
  73. sstableutil_test.py ..                                                   [ 59%]
  74. streaming_test.py ..x.                                                   [ 60%]
  75. stress_tool_test.py ...                                                  [ 60%]
  76. super_column_cache_test.py s                                             [ 60%]
  77. super_counter_test.py s                                                  [ 60%]
  78. system_keyspaces_test.py ..                                              [ 61%]
  79. thrift_hsha_test.py ss                                                   [ 61%]
  80. thrift_test.py sssssssssssssssssssssssssssssssssssssssssssssssssssssssss [ 66%]
  81. sssssssssssssssssssssssssssssssssssssssssssssssssss                      [ 71%]
  82. token_generator_test.py sss                                              [ 71%]
  83. topology_test.py ...s......                                              [ 72%]
  84. transient_replication_ring_test.py ........                              [ 73%]
  85. transient_replication_test.py ..............s...                         [ 75%]
  86. ttl_test.py ..........s..............                                    [ 77%]
  87. udtencoding_test.py .                                                    [ 77%]
  88. user_functions_test.py ........                                          [ 78%]
  89. user_types_test.py ............                                          [ 79%]
  90. wide_rows_test.py ..                                                     [ 79%]
  91. write_failures_test.py s..........s                                      [ 81%]
  92. cqlsh_tests/test_cqlsh.py ..........................................s... [ 85%]
  93. .....                                                                    [ 85%]
  94. cqlsh_tests/test_cqlsh_copy.py ......................................... [ 89%]
  95. .......                                                                  [ 90%]
  96. meta_tests/assertion_test.py ...........                                 [ 91%]
  97. meta_tests/utils_test/funcutils_test.py ...........                      [ 92%]
  98. meta_tests/utils_test/metadata_wrapper_test.py ...............           [ 94%]
  99. repair_tests/deprecated_repair_test.py sssssss                           [ 94%]
  100. repair_tests/incremental_repair_test.py .........s..........             [ 96%]
  101. repair_tests/preview_repair_test.py .                                    [ 96%]
  102. repair_tests/repair_test.py s.sss.......................s..s.            [100%]
  103.  
  104. ==================================== ERRORS ====================================
  105. ___________ ERROR at teardown of TestRebuild.test_resumable_rebuild ____________
  106. Unexpected error found in node logs (see stdout for full details). Errors: [ERROR [Stream-Deserializer-127.0.0.2:7000-c5516bb6] 2019-08-01 14:27:05,891 StreamingInboundHandler.java:212 - [Stream channel: c5516bb6] stream operation from 127.0.0.2:7000 failed
  107. java.lang.RuntimeException: Stream receive task 1b313770-b4a3-11e9-947d-4db32a1db71e of cf 075264e0-b4a3-11e9-978e-4f4d4892d0e1 already finished.
  108.     at org.apache.cassandra.streaming.StreamReceiveTask.getReceiver(StreamReceiveTask.java:107)
  109.     at org.apache.cassandra.streaming.StreamSession.getAggregator(StreamSession.java:241)
  110.     at org.apache.cassandra.db.streaming.CassandraStreamReader.createWriter(CassandraStreamReader.java:157)
  111.     at org.apache.cassandra.db.streaming.CassandraStreamReader.read(CassandraStreamReader.java:122)
  112.     at org.apache.cassandra.db.streaming.CassandraIncomingFile.read(CassandraIncomingFile.java:74)
  113.     at org.apache.cassandra.streaming.messages.IncomingStreamMessage$1.deserialize(IncomingStreamMessage.java:49)
  114.     at org.apache.cassandra.streaming.messages.IncomingStreamMessage$1.deserialize(IncomingStreamMessage.java:36)
  115.     at org.apache.cassandra.streaming.messages.StreamMessage.deserialize(StreamMessage.java:49)
  116.     at org.apache.cassandra.streaming.async.StreamingInboundHandler$StreamDeserializingTask.run(StreamingInboundHandler.java:175)
  117.     at io.netty.util.concurrent.FastThreadLocalRunnable.run(FastThreadLocalRunnable.java:30)
  118.     at java.lang.Thread.run(Thread.java:748), ERROR [Stream-Deserializer-127.0.0.2:7000-c5516bb6] 2019-08-01 14:27:05,891 StreamingInboundHandler.java:212 - [Stream channel: c5516bb6] stream operation from 127.0.0.2:7000 failed
  119. java.lang.RuntimeException: Stream receive task 1b313770-b4a3-11e9-947d-4db32a1db71e of cf 075264e0-b4a3-11e9-978e-4f4d4892d0e1 already finished.
  120.     at org.apache.cassandra.streaming.StreamReceiveTask.getReceiver(StreamReceiveTask.java:107)
  121.     at org.apache.cassandra.streaming.StreamSession.getAggregator(StreamSession.java:241)
  122.     at org.apache.cassandra.db.streaming.CassandraStreamReader.createWriter(CassandraStreamReader.java:157)
  123.     at org.apache.cassandra.db.streaming.CassandraStreamReader.read(CassandraStreamReader.java:122)
  124.     at org.apache.cassandra.db.streaming.CassandraIncomingFile.read(CassandraIncomingFile.java:74)
  125.     at org.apache.cassandra.streaming.messages.IncomingStreamMessage$1.deserialize(IncomingStreamMessage.java:49)
  126.     at org.apache.cassandra.streaming.messages.IncomingStreamMessage$1.deserialize(IncomingStreamMessage.java:36)
  127.     at org.apache.cassandra.streaming.messages.StreamMessage.deserialize(StreamMessage.java:49)
  128.     at org.apache.cassandra.streaming.async.StreamingInboundHandler$StreamDeserializingTask.run(StreamingInboundHandler.java:175)
  129.     at io.netty.util.concurrent.FastThreadLocalRunnable.run(FastThreadLocalRunnable.java:30)
  130.     at java.lang.Thread.run(Thread.java:748)]
  131. ---------------------------- Captured stdout setup -----------------------------
  132. 14:26:09,177 ccm DEBUG Log-watching thread starting.
  133. ------------------------------ Captured log setup ------------------------------
  134. 14:26:09,96 conftest INFO Starting execution of test_resumable_rebuild at 2019-08-01 14:26:09.096549
  135. 14:26:09,97 dtest_setup INFO cluster ccm directory: /var/folders/g3/9njfx8nd2f91w7kcbzxnhbnxwd6p5v/T/dtest-0wi6xhd7
  136. ----------------------------- Captured stdout call -----------------------------
  137. install rule inject stream failure
  138.  
  139. ----------------------------- Captured stderr call -----------------------------
  140. Exception in thread Thread-827:
  141. Traceback (most recent call last):
  142.   File "/usr/local/Cellar/python/3.7.1/Frameworks/Python.framework/Versions/3.7/lib/python3.7/threading.py", line 917, in _bootstrap_inner
  143.     self.run()
  144.   File "/Users/asp/dtest/src/ccm/ccmlib/cluster.py", line 189, in run
  145.     self.scan_and_report()
  146.   File "/Users/asp/dtest/src/ccm/ccmlib/cluster.py", line 182, in scan_and_report
  147.     on_error_call(errordata)
  148.   File "/Users/asp/development/cassandra-dtest/dtest_setup.py", line 137, in _log_error_handler
  149.     pytest.fail("Error details: \n{message}".format(message=message))
  150.   File "/Users/asp/dtest/lib/python3.7/site-packages/_pytest/outcomes.py", line 97, in fail
  151.     raise Failed(msg=msg, pytrace=pytrace)
  152. Failed: Error details:
  153. Errors seen in logs for: node3
  154. node3: ERROR [Stream-Deserializer-127.0.0.2:7000-c5516bb6] 2019-08-01 14:27:05,891 StreamingInboundHandler.java:212 - [Stream channel: c5516bb6] stream operation from 127.0.0.2:7000 failed
  155. java.lang.RuntimeException: Stream receive task 1b313770-b4a3-11e9-947d-4db32a1db71e of cf 075264e0-b4a3-11e9-978e-4f4d4892d0e1 already finished.
  156.     at org.apache.cassandra.streaming.StreamReceiveTask.getReceiver(StreamReceiveTask.java:107)
  157.     at org.apache.cassandra.streaming.StreamSession.getAggregator(StreamSession.java:241)
  158.     at org.apache.cassandra.db.streaming.CassandraStreamReader.createWriter(CassandraStreamReader.java:157)
  159.     at org.apache.cassandra.db.streaming.CassandraStreamReader.read(CassandraStreamReader.java:122)
  160.     at org.apache.cassandra.db.streaming.CassandraIncomingFile.read(CassandraIncomingFile.java:74)
  161.     at org.apache.cassandra.streaming.messages.IncomingStreamMessage$1.deserialize(IncomingStreamMessage.java:49)
  162.     at org.apache.cassandra.streaming.messages.IncomingStreamMessage$1.deserialize(IncomingStreamMessage.java:36)
  163.     at org.apache.cassandra.streaming.messages.StreamMessage.deserialize(StreamMessage.java:49)
  164.     at org.apache.cassandra.streaming.async.StreamingInboundHandler$StreamDeserializingTask.run(StreamingInboundHandler.java:175)
  165.     at io.netty.util.concurrent.FastThreadLocalRunnable.run(FastThreadLocalRunnable.java:30)
  166.     at java.lang.Thread.run(Thread.java:748)
  167.  
  168. ------------------------------ Captured log call -------------------------------
  169. 14:26:29,792 cassandra.cluster INFO New Cassandra host <Host: 127.0.0.2 dc1> discovered
  170. 14:26:35,744 cassandra.cluster INFO New Cassandra host <Host: 127.0.0.1 dc1> discovered
  171. 14:26:55,792 cassandra.cluster INFO New Cassandra host <Host: 127.0.0.3 dc2> discovered
  172. 14:26:56,472 cassandra.cluster INFO New Cassandra host <Host: 127.0.0.3 dc2> discovered
  173. 14:27:01,18 cassandra.cluster INFO New Cassandra host <Host: 127.0.0.1 dc1> discovered
  174. 14:27:01,19 cassandra.cluster INFO New Cassandra host <Host: 127.0.0.2 dc1> discovered
  175. 14:27:01,103 cassandra.protocol WARNING Server warning: When increasing replication factor you need to run a full (-full) repair to distribute the data.
  176. 14:27:02,186 cassandra.protocol WARNING Server warning: When increasing replication factor you need to run a full (-full) repair to distribute the data.
  177. ---------------------------- Captured log teardown -----------------------------
  178. 14:27:28,535 conftest ERROR Unexpected error in node3 log, error:
  179. ERROR [Stream-Deserializer-127.0.0.2:7000-c5516bb6] 2019-08-01 14:27:05,891 StreamingInboundHandler.java:212 - [Stream channel: c5516bb6] stream operation from 127.0.0.2:7000 failed
  180. java.lang.RuntimeException: Stream receive task 1b313770-b4a3-11e9-947d-4db32a1db71e of cf 075264e0-b4a3-11e9-978e-4f4d4892d0e1 already finished.
  181.     at org.apache.cassandra.streaming.StreamReceiveTask.getReceiver(StreamReceiveTask.java:107)
  182.     at org.apache.cassandra.streaming.StreamSession.getAggregator(StreamSession.java:241)
  183.     at org.apache.cassandra.db.streaming.CassandraStreamReader.createWriter(CassandraStreamReader.java:157)
  184.     at org.apache.cassandra.db.streaming.CassandraStreamReader.read(CassandraStreamReader.java:122)
  185.     at org.apache.cassandra.db.streaming.CassandraIncomingFile.read(CassandraIncomingFile.java:74)
  186.     at org.apache.cassandra.streaming.messages.IncomingStreamMessage$1.deserialize(IncomingStreamMessage.java:49)
  187.     at org.apache.cassandra.streaming.messages.IncomingStreamMessage$1.deserialize(IncomingStreamMessage.java:36)
  188.     at org.apache.cassandra.streaming.messages.StreamMessage.deserialize(StreamMessage.java:49)
  189.     at org.apache.cassandra.streaming.async.StreamingInboundHandler$StreamDeserializingTask.run(StreamingInboundHandler.java:175)
  190.     at io.netty.util.concurrent.FastThreadLocalRunnable.run(FastThreadLocalRunnable.java:30)
  191.     at java.lang.Thread.run(Thread.java:748)
  192. =================================== FAILURES ===================================
  193. _______________________ TestConsistency.test_short_read ________________________
  194.  
  195. self = <consistency_test.TestConsistency object at 0x114adba90>
  196.  
  197.     def test_short_read(self):
  198.         """
  199.             @jira_ticket CASSANDRA-9460
  200.             """
  201.         cluster = self.cluster
  202.    
  203.         # this test causes the python driver to be extremely noisy due to
  204.         # frequent starting and stopping of nodes. let's move the log level
  205.         # of the driver to ERROR for this test only
  206.         logging.getLogger("cassandra").setLevel('ERROR')
  207.    
  208.         # Disable hinted handoff and set batch commit log so this doesn't
  209.         # interfer with the test
  210.         cluster.set_configuration_options(values={'hinted_handoff_enabled': False})
  211.         cluster.set_batch_commitlog(enabled=True)
  212.    
  213.         cluster.populate(3).start(wait_other_notice=True)
  214.         node1, node2, node3 = cluster.nodelist()
  215.    
  216.         session = self.patient_cql_connection(node1)
  217.         create_ks(session, 'ks', 3)
  218.    
  219.         if cluster.version() < '4.0':
  220.             create_cf(session, 'cf', read_repair=0.0)
  221.         else:
  222.             create_cf(session, 'cf')
  223.    
  224.         normal_key = 'normal'
  225.         reversed_key = 'reversed'
  226.    
  227.         # Repeat this test 10 times to make it more easy to spot a null pointer exception caused by a race, see CASSANDRA-9460
  228.         for k in range(10):
  229.             # insert 9 columns in two rows
  230.             insert_columns(self, session, normal_key, 9)
  231.             insert_columns(self, session, reversed_key, 9)
  232.    
  233.             # Delete 3 first columns (and 3 last columns, for the reversed version) with a different node dead each time
  234.             for node, column_number_to_delete in zip(list(range(1, 4)), list(range(3))):
  235. >               self.stop_node(node)
  236.  
  237. consistency_test.py:1395:
  238. _ _ _ _ _ _ _ _ _ _ _ _ _ _ _ _ _ _ _ _ _ _ _ _ _ _ _ _ _ _ _ _ _ _ _ _ _ _ _ _
  239. /Users/asp/development/cassandra-dtest/consistency_test.py:1576: in stop_node
  240.     to_stop.flush()
  241. /Users/asp/dtest/src/ccm/ccmlib/node.py:1375: in flush
  242.     self.nodetool(cmd)
  243. /Users/asp/dtest/src/ccm/ccmlib/node.py:853: in nodetool
  244.     p = self.nodetool_process(cmd)
  245. /Users/asp/dtest/src/ccm/ccmlib/node.py:850: in nodetool_process
  246.     return subprocess.Popen(args, env=env, stdout=subprocess.PIPE, stderr=subprocess.PIPE, universal_newlines=True)
  247. /usr/local/Cellar/python/3.7.1/Frameworks/Python.framework/Versions/3.7/lib/python3.7/subprocess.py:722: in __init__
  248.     ???
  249. _ _ _ _ _ _ _ _ _ _ _ _ _ _ _ _ _ _ _ _ _ _ _ _ _ _ _ _ _ _ _ _ _ _ _ _ _ _ _ _
  250.  
  251. self = <subprocess.Popen object at 0x11755af28>, stdin = None, stdout = -1
  252. stderr = -1
  253.  
  254. >   ???
  255. E   OSError: [Errno 24] Too many open files
  256.  
  257. /usr/local/Cellar/python/3.7.1/Frameworks/Python.framework/Versions/3.7/lib/python3.7/subprocess.py:1358: OSError
  258. ---------------------------- Captured stdout setup -----------------------------
  259. 11:01:48,625 ccm DEBUG Log-watching thread starting.
  260. ------------------------------ Captured log setup ------------------------------
  261. 11:01:48,545 conftest INFO Starting execution of test_short_read at 2019-08-01 11:01:48.545810
  262. 11:01:48,546 dtest_setup INFO cluster ccm directory: /var/folders/g3/9njfx8nd2f91w7kcbzxnhbnxwd6p5v/T/dtest-gzmulz3f
  263. ----------------------------- Captured stderr call -----------------------------
  264. Exception in thread Thread-239:
  265. Traceback (most recent call last):
  266.   File "/usr/local/Cellar/python/3.7.1/Frameworks/Python.framework/Versions/3.7/lib/python3.7/threading.py", line 917, in _bootstrap_inner
  267.   File "/Users/asp/dtest/src/ccm/ccmlib/cluster.py", line 189, in run
  268.     self.scan_and_report()
  269.   File "/Users/asp/dtest/src/ccm/ccmlib/cluster.py", line 182, in scan_and_report
  270.     on_error_call(errordata)
  271.   File "/Users/asp/development/cassandra-dtest/dtest_setup.py", line 137, in _log_error_handler
  272.   File "/Users/asp/dtest/lib/python3.7/site-packages/_pytest/outcomes.py", line 97, in fail
  273. Failed: Error details:
  274. Errors seen in logs for: log_scanner
  275. log_scanner: [Errno 24] Too many open files: '/var/folders/g3/9njfx8nd2f91w7kcbzxnhbnxwd6p5v/T/dtest-gzmulz3f/test/node1/logs/system.log'
  276.  
  277. ______________________ TestCqlTracing.test_tracing_simple ______________________
  278.  
  279. self = <cql_tracing_test.TestCqlTracing object at 0x115363780>
  280.  
  281.     @since('2.2')
  282.     def test_tracing_simple(self):
  283.         """
  284.             Test tracing using the default tracing class. See trace().
  285.    
  286.             @jira_ticket CASSANDRA-10392
  287.             @jira_ticket CASSANDRA-11598
  288.             # Restricted to 2.2+ due to flakiness on 2.1.  See CASSANDRA-11598 and CASSANDRA-12407 for details.
  289.             """
  290.         session = self.prepare()
  291. >       self.trace(session)
  292.  
  293. cql_tracing_test.py:115:
  294. _ _ _ _ _ _ _ _ _ _ _ _ _ _ _ _ _ _ _ _ _ _ _ _ _ _ _ _ _ _ _ _ _ _ _ _ _ _ _ _
  295.  
  296. self = <cql_tracing_test.TestCqlTracing object at 0x115363780>
  297. session = <cassandra.cluster.Session object at 0x114fa4828>
  298.  
  299.     def trace(self, session):
  300.         """
  301.             * CREATE a table
  302.             * enable TRACING
  303.             * SELECT on a known system table and assert it ran with tracing by checking the output
  304.             * INSERT a row into the created system table and assert it ran with tracing
  305.             * SELECT from the table and assert it ran with tracing
  306.    
  307.             @param session The Session object to use to create a table.
  308.             @jira_ticket CASSANDRA-10392
  309.             """
  310.    
  311.         node1 = self.cluster.nodelist()[0]
  312.    
  313.         # Create
  314.         session.execute("""
  315.                 CREATE TABLE ks.users (
  316.                     userid uuid PRIMARY KEY,
  317.                     firstname text,
  318.                     lastname text,
  319.                     age int
  320.                 );
  321.             """)
  322.    
  323.         out, err, _ = node1.run_cqlsh('TRACING ON')
  324.         assert 'Tracing is enabled' in out
  325.    
  326.         out, err, _ = node1.run_cqlsh('TRACING ON; SELECT * from system.peers')
  327.         assert 'Tracing session: ' in out
  328.         assert 'Request complete ' in out
  329.    
  330.         # Inserts
  331.         out, err, _ = node1.run_cqlsh(
  332.             "CONSISTENCY ALL; TRACING ON; "
  333.             "INSERT INTO ks.users (userid, firstname, lastname, age) "
  334.             "VALUES (550e8400-e29b-41d4-a716-446655440000, 'Frodo', 'Baggins', 32)")
  335.         logger.debug(out)
  336. >       assert 'Tracing session: ' in out
  337. E       AssertionError: assert 'Tracing session: ' in 'Consistency level set to ALL.\nNow Tracing is enabled\n'
  338.  
  339. cql_tracing_test.py:83: AssertionError
  340. ---------------------------- Captured stdout setup -----------------------------
  341. 11:26:05,698 ccm DEBUG Log-watching thread starting.
  342. ------------------------------ Captured log setup ------------------------------
  343. 11:26:05,614 conftest INFO Starting execution of test_tracing_simple at 2019-08-01 11:26:05.614115
  344. 11:26:05,614 dtest_setup INFO cluster ccm directory: /var/folders/g3/9njfx8nd2f91w7kcbzxnhbnxwd6p5v/T/dtest-q0g6oky6
  345. ------------------------------ Captured log call -------------------------------
  346. 11:26:24,497 cassandra.cluster INFO New Cassandra host <Host: 127.0.0.3 datacenter1> discovered
  347. 11:26:24,498 cassandra.cluster INFO New Cassandra host <Host: 127.0.0.2 datacenter1> discovered
  348. --------------------------- Captured stdout teardown ---------------------------
  349. 11:26:42,39 ccm DEBUG Log-watching thread exiting.
  350. ___________________ TestCqlTracing.test_tracing_unknown_impl ___________________
  351.  
  352. self = <cql_tracing_test.TestCqlTracing object at 0x113def1d0>
  353.  
  354.     @since('3.4')
  355.     def test_tracing_unknown_impl(self):
  356.         """
  357.             Test that Cassandra logs an error, but keeps its default tracing
  358.             behavior, when a nonexistent tracing class is specified.
  359.    
  360.             * set a nonexistent custom tracing class
  361.             * run trace()
  362.             * if running the test on a version with custom tracing classes
  363.               implemented, check that an error about the nonexistent class was
  364.               logged.
  365.    
  366.             @jira_ticket CASSANDRA-10392
  367.             """
  368.         expected_error = 'Cannot use class junk for tracing'
  369.         self.fixture_dtest_setup.ignore_log_patterns = [expected_error]
  370.         session = self.prepare(jvm_args=['-Dcassandra.custom_tracing_class=junk'])
  371. >       self.trace(session)
  372.  
  373. cql_tracing_test.py:134:
  374. _ _ _ _ _ _ _ _ _ _ _ _ _ _ _ _ _ _ _ _ _ _ _ _ _ _ _ _ _ _ _ _ _ _ _ _ _ _ _ _
  375.  
  376. self = <cql_tracing_test.TestCqlTracing object at 0x113def1d0>
  377. session = <cassandra.cluster.Session object at 0x119bf2b38>
  378.  
  379.     def trace(self, session):
  380.         """
  381.             * CREATE a table
  382.             * enable TRACING
  383.             * SELECT on a known system table and assert it ran with tracing by checking the output
  384.             * INSERT a row into the created system table and assert it ran with tracing
  385.             * SELECT from the table and assert it ran with tracing
  386.    
  387.             @param session The Session object to use to create a table.
  388.             @jira_ticket CASSANDRA-10392
  389.             """
  390.    
  391.         node1 = self.cluster.nodelist()[0]
  392.    
  393.         # Create
  394.         session.execute("""
  395.                 CREATE TABLE ks.users (
  396.                     userid uuid PRIMARY KEY,
  397.                     firstname text,
  398.                     lastname text,
  399.                     age int
  400.                 );
  401.             """)
  402.    
  403.         out, err, _ = node1.run_cqlsh('TRACING ON')
  404.         assert 'Tracing is enabled' in out
  405.    
  406.         out, err, _ = node1.run_cqlsh('TRACING ON; SELECT * from system.peers')
  407.         assert 'Tracing session: ' in out
  408.         assert 'Request complete ' in out
  409.    
  410.         # Inserts
  411.         out, err, _ = node1.run_cqlsh(
  412.             "CONSISTENCY ALL; TRACING ON; "
  413.             "INSERT INTO ks.users (userid, firstname, lastname, age) "
  414.             "VALUES (550e8400-e29b-41d4-a716-446655440000, 'Frodo', 'Baggins', 32)")
  415.         logger.debug(out)
  416. >       assert 'Tracing session: ' in out
  417. E       AssertionError: assert 'Tracing session: ' in 'Consistency level set to ALL.\nNow Tracing is enabled\n'
  418.  
  419. cql_tracing_test.py:83: AssertionError
  420. ---------------------------- Captured stdout setup -----------------------------
  421. 11:26:42,600 ccm DEBUG Log-watching thread starting.
  422. ------------------------------ Captured log setup ------------------------------
  423. 11:26:42,519 conftest INFO Starting execution of test_tracing_unknown_impl at 2019-08-01 11:26:42.519882
  424. 11:26:42,520 dtest_setup INFO cluster ccm directory: /var/folders/g3/9njfx8nd2f91w7kcbzxnhbnxwd6p5v/T/dtest-9nm98j6o
  425. ----------------------------- Captured stdout call -----------------------------
  426.  
  427. ------------------------------ Captured log call -------------------------------
  428. 11:27:05,860 cassandra.cluster INFO New Cassandra host <Host: 127.0.0.3 datacenter1> discovered
  429. 11:27:05,861 cassandra.cluster INFO New Cassandra host <Host: 127.0.0.2 datacenter1> discovered
  430. --------------------------- Captured stdout teardown ---------------------------
  431. 11:27:20,218 ccm DEBUG Log-watching thread exiting.
  432. ===Flaky Test Report===
  433.  
  434. test_archiving passed 1 out of the required 1 times. Success!
  435. test_fql_nodetool_options passed 1 out of the required 1 times. Success!
  436. test_archiving_fql passed 1 out of the required 1 times. Success!
  437. test_archive_on_startup passed 1 out of the required 1 times. Success!
  438. test_archive_on_shutdown passed 1 out of the required 1 times. Success!
  439. test_login_existing_node passed 1 out of the required 1 times. Success!
  440. test_login_new_node passed 1 out of the required 1 times. Success!
  441. test_list_users passed 1 out of the required 1 times. Success!
  442. test_modify_and_select_auth passed 1 out of the required 1 times. Success!
  443. test_system_auth_ks_is_alterable passed 1 out of the required 1 times. Success!
  444. test_login passed 1 out of the required 1 times. Success!
  445. test_cant_create_existing_user passed 1 out of the required 1 times. Success!
  446. test_list_users passed 1 out of the required 1 times. Success!
  447. test_handle_corrupt_role_data passed 1 out of the required 1 times. Success!
  448. test_user_cant_drop_themselves passed 1 out of the required 1 times. Success!
  449. test_dropping_nonexistent_user_throws_exception passed 1 out of the required 1 times. Success!
  450. test_drop_user_case_sensitive passed 1 out of the required 1 times. Success!
  451. test_alter_user_case_sensitive passed 1 out of the required 1 times. Success!
  452. test_regular_users_can_alter_their_passwords_only passed 1 out of the required 1 times. Success!
  453. test_users_cant_alter_their_superuser_status passed 1 out of the required 1 times. Success!
  454. test_only_superuser_alters_superuser_status passed 1 out of the required 1 times. Success!
  455. test_altering_nonexistent_user_throws_exception passed 1 out of the required 1 times. Success!
  456. test_conditional_create_drop_user passed 1 out of the required 1 times. Success!
  457. test_create_ks_auth passed 1 out of the required 1 times. Success!
  458. test_create_cf_auth passed 1 out of the required 1 times. Success!
  459. test_alter_ks_auth passed 1 out of the required 1 times. Success!
  460. test_alter_cf_auth passed 1 out of the required 1 times. Success!
  461. test_materialized_views_auth passed 1 out of the required 1 times. Success!
  462. test_drop_ks_auth passed 1 out of the required 1 times. Success!
  463. test_drop_cf_auth passed 1 out of the required 1 times. Success!
  464. test_modify_and_select_auth passed 1 out of the required 1 times. Success!
  465. test_grant_revoke_without_ks_specified passed 1 out of the required 1 times. Success!
  466. test_grant_revoke_auth passed 1 out of the required 1 times. Success!
  467. test_grant_revoke_nonexistent_user_or_ks passed 1 out of the required 1 times. Success!
  468. test_grant_revoke_cleanup passed 1 out of the required 1 times. Success!
  469. test_permissions_caching passed 1 out of the required 1 times. Success!
  470. test_list_permissions passed 1 out of the required 1 times. Success!
  471. test_type_auth passed 1 out of the required 1 times. Success!
  472. test_restart_node_doesnt_lose_auth_data passed 1 out of the required 1 times. Success!
  473. test_auth_metrics passed 1 out of the required 1 times. Success!
  474. test_create_drop_role passed 1 out of the required 1 times. Success!
  475. test_conditional_create_drop_role passed 1 out of the required 1 times. Success!
  476. test_create_drop_role_validation passed 1 out of the required 1 times. Success!
  477. test_role_admin_validation passed 1 out of the required 1 times. Success!
  478. test_creator_of_db_resource_granted_all_permissions passed 1 out of the required 1 times. Success!
  479. test_create_and_grant_roles_with_superuser_status passed 1 out of the required 1 times. Success!
  480. test_drop_and_revoke_roles_with_superuser_status passed 1 out of the required 1 times. Success!
  481. test_drop_role_removes_memberships passed 1 out of the required 1 times. Success!
  482. test_drop_role_revokes_permissions_granted_on_it passed 1 out of the required 1 times. Success!
  483. test_grant_revoke_roles passed 1 out of the required 1 times. Success!
  484. test_grant_revoke_role_validation passed 1 out of the required 1 times. Success!
  485. test_list_roles passed 1 out of the required 1 times. Success!
  486. test_grant_revoke_permissions passed 1 out of the required 1 times. Success!
  487. test_filter_granted_permissions_by_resource_type passed 1 out of the required 1 times. Success!
  488. test_list_permissions passed 1 out of the required 1 times. Success!
  489. test_list_permissions_validation passed 1 out of the required 1 times. Success!
  490. test_role_caching_authenticated_user passed 1 out of the required 1 times. Success!
  491. test_drop_non_existent_role_should_not_update_cache passed 1 out of the required 1 times. Success!
  492. test_prevent_circular_grants passed 1 out of the required 1 times. Success!
  493. test_create_user_as_alias_for_create_role passed 1 out of the required 1 times. Success!
  494. test_role_name passed 1 out of the required 1 times. Success!
  495. test_role_requires_login_privilege_to_authenticate passed 1 out of the required 1 times. Success!
  496. test_roles_do_not_inherit_login_privilege passed 1 out of the required 1 times. Success!
  497. test_role_requires_password_to_login passed 1 out of the required 1 times. Success!
  498. test_superuser_status_is_inherited passed 1 out of the required 1 times. Success!
  499. test_list_users_considers_inherited_superuser_status passed 1 out of the required 1 times. Success!
  500. test_grant_revoke_udf_permissions passed 1 out of the required 1 times. Success!
  501. test_grant_revoke_are_idempotent passed 1 out of the required 1 times. Success!
  502. test_function_resource_hierarchy_permissions passed 1 out of the required 1 times. Success!
  503. test_udf_permissions_validation passed 1 out of the required 1 times. Success!
  504. test_drop_role_cleans_up_udf_permissions passed 1 out of the required 1 times. Success!
  505. test_drop_function_and_keyspace_cleans_up_udf_permissions passed 1 out of the required 1 times. Success!
  506. test_udf_with_overloads_permissions passed 1 out of the required 1 times. Success!
  507. test_drop_keyspace_cleans_up_function_level_permissions passed 1 out of the required 1 times. Success!
  508. test_udf_permissions_in_selection passed 1 out of the required 1 times. Success!
  509. test_udf_permissions_in_select_where_clause passed 1 out of the required 1 times. Success!
  510. test_udf_permissions_in_insert passed 1 out of the required 1 times. Success!
  511. test_udf_permissions_in_update passed 1 out of the required 1 times. Success!
  512. test_udf_permissions_in_delete passed 1 out of the required 1 times. Success!
  513. test_inheritence_of_udf_permissions passed 1 out of the required 1 times. Success!
  514. test_builtin_functions_require_no_special_permissions passed 1 out of the required 1 times. Success!
  515. test_disallow_grant_revoke_on_builtin_functions passed 1 out of the required 1 times. Success!
  516. test_disallow_grant_execute_on_non_function_resources passed 1 out of the required 1 times. Success!
  517. test_aggregate_function_permissions passed 1 out of the required 1 times. Success!
  518. test_ignore_invalid_roles passed 1 out of the required 1 times. Success!
  519. test_authentication_handle_unavailable passed 1 out of the required 1 times. Success!
  520. test_authentication_through_cache_handle_unavailable passed 1 out of the required 1 times. Success!
  521. test_authentication_from_cache_while_unavailable passed 1 out of the required 1 times. Success!
  522. test_credentials_cache_background_reload_handle_unavailable passed 1 out of the required 1 times. Success!
  523. test_authorization_handle_unavailable passed 1 out of the required 1 times. Success!
  524. test_authorization_through_cache_handle_unavailable passed 1 out of the required 1 times. Success!
  525. test_authorization_from_cache_while_unavailable passed 1 out of the required 1 times. Success!
  526. test_permission_cache_background_reload_handle_unavailable passed 1 out of the required 1 times. Success!
  527. test_full_dc_access passed 1 out of the required 1 times. Success!
  528. test_single_dc_access passed 1 out of the required 1 times. Success!
  529. test_revoked_dc_access passed 1 out of the required 1 times. Success!
  530. test_create_dc_validation passed 1 out of the required 1 times. Success!
  531. test_alter_dc_validation passed 1 out of the required 1 times. Success!
  532. test_revoked_login passed 1 out of the required 1 times. Success!
  533. test_empty_batch_throws_no_error passed 1 out of the required 1 times. Success!
  534. test_counter_batch_accepts_counter_mutations passed 1 out of the required 1 times. Success!
  535. test_counter_batch_rejects_regular_mutations passed 1 out of the required 1 times. Success!
  536. test_logged_batch_accepts_regular_mutations passed 1 out of the required 1 times. Success!
  537. test_logged_batch_gcgs_below_threshold_single_table passed 1 out of the required 1 times. Success!
  538. test_logged_batch_gcgs_below_threshold_multi_table passed 1 out of the required 1 times. Success!
  539. test_unlogged_batch_gcgs_below_threshold_should_not_print_warning passed 1 out of the required 1 times. Success!
  540. test_logged_batch_rejects_counter_mutations passed 1 out of the required 1 times. Success!
  541. test_unlogged_batch_accepts_regular_mutations passed 1 out of the required 1 times. Success!
  542. test_unlogged_batch_rejects_counter_mutations passed 1 out of the required 1 times. Success!
  543. test_logged_batch_throws_uae passed 1 out of the required 1 times. Success!
  544. test_logged_batch_doesnt_throw_uae passed 1 out of the required 1 times. Success!
  545. test_acknowledged_by_batchlog_not_set_when_batchlog_write_fails passed 1 out of the required 1 times. Success!
  546. test_acknowledged_by_batchlog_set_when_batchlog_write_succeeds passed 1 out of the required 1 times. Success!
  547. test_batch_uses_proper_timestamp passed 1 out of the required 1 times. Success!
  548. test_only_one_timestamp_is_valid passed 1 out of the required 1 times. Success!
  549. test_each_statement_in_batch_uses_proper_timestamp passed 1 out of the required 1 times. Success!
  550. test_multi_table_batch_for_10554 passed 1 out of the required 1 times. Success!
  551. test_simple_bootstrap_with_ssl passed 1 out of the required 1 times. Success!
  552. test_simple_bootstrap passed 1 out of the required 1 times. Success!
  553. test_bootstrap_on_write_survey passed 1 out of the required 1 times. Success!
  554. test_simple_bootstrap_small_keepalive_period passed 1 out of the required 1 times. Success!
  555. test_simple_bootstrap_nodata passed 1 out of the required 1 times. Success!
  556. test_read_from_bootstrapped_node passed 1 out of the required 1 times. Success!
  557. test_consistent_range_movement_true_with_replica_down_should_fail passed 1 out of the required 1 times. Success!
  558. test_consistent_range_movement_false_with_replica_down_should_succeed passed 1 out of the required 1 times. Success!
  559. test_consistent_range_movement_true_with_rf1_should_fail passed 1 out of the required 1 times. Success!
  560. test_consistent_range_movement_false_with_rf1_should_succeed passed 1 out of the required 1 times. Success!
  561. test_resumable_bootstrap failed (1 runs remaining out of 2).
  562.     <class 'ccmlib.node.TimeoutError'>
  563.     01 Aug 2019 01:42:13 [node3] Missing: ['Some data streaming failed']:
  564. INFO  [main] 2019-07-31 18:32:13,893 YamlConfigura.....
  565. See system.log for remainder
  566.     [<TracebackEntry /Users/asp/development/cassandra-dtest/bootstrap_test.py:339>, <TracebackEntry /Users/asp/dtest/src/ccm/ccmlib/node.py:536>]
  567. test_resumable_bootstrap passed 1 out of the required 1 times. Success!
  568. test_bootstrap_with_reset_bootstrap_state failed (1 runs remaining out of 2).
  569.     <class 'ccmlib.node.TimeoutError'>
  570.     01 Aug 2019 16:53:35 [node1] Missing: ['127.0.0.2:7000.* now UP']:
  571. INFO  [main] 2019-08-01 06:44:18,334 YamlConfigura.....
  572. See system.log for remainder
  573.     [<TracebackEntry /Users/asp/development/cassandra-dtest/bootstrap_test.py:361>, <TracebackEntry /Users/asp/dtest/src/ccm/ccmlib/cluster.py:486>, <TracebackEntry /Users/asp/dtest/src/ccm/ccmlib/node.py:568>, <TracebackEntry /Users/asp/dtest/src/ccm/ccmlib/node.py:536>]
  574. test_bootstrap_with_reset_bootstrap_state passed 1 out of the required 1 times. Success!
  575. test_manual_bootstrap passed 1 out of the required 1 times. Success!
  576. test_local_quorum_bootstrap passed 1 out of the required 1 times. Success!
  577. test_shutdown_wiped_node_cannot_join passed 1 out of the required 1 times. Success!
  578. test_killed_wiped_node_cannot_join passed 1 out of the required 1 times. Success!
  579. test_decommissioned_wiped_node_can_join passed 1 out of the required 1 times. Success!
  580. test_decommissioned_wiped_node_can_gossip_to_single_seed passed 1 out of the required 1 times. Success!
  581. test_failed_bootstrap_wiped_node_can_join passed 1 out of the required 1 times. Success!
  582. test_simultaneous_bootstrap passed 1 out of the required 1 times. Success!
  583. test_cleanup passed 1 out of the required 1 times. Success!
  584. test_bootstrap_binary_disabled passed 1 out of the required 1 times. Success!
  585. test_cdc_enabled_data_readable_on_round_trip passed 1 out of the required 1 times. Success!
  586. test_cdc_disabled_data_readable_on_round_trip passed 1 out of the required 1 times. Success!
  587. test_non_cdc_segments_deleted_after_replay passed 1 out of the required 1 times. Success!
  588. test_insertion_and_commitlog_behavior_after_reaching_cdc_total_space passed 1 out of the required 1 times. Success!
  589. test_cdc_data_available_in_cdc_raw passed 1 out of the required 1 times. Success!
  590. test_cfid passed 1 out of the required 1 times. Success!
  591. test_mv_lock_contention_during_replay passed 1 out of the required 1 times. Success!
  592. test_commitlog_replay_on_startup passed 1 out of the required 1 times. Success!
  593. test_default_segment_size passed 1 out of the required 1 times. Success!
  594. test_small_segment_size passed 1 out of the required 1 times. Success!
  595. test_default_compressed_segment_size passed 1 out of the required 1 times. Success!
  596. test_small_compressed_segment_size passed 1 out of the required 1 times. Success!
  597. test_stop_failure_policy passed 1 out of the required 1 times. Success!
  598. test_stop_commit_failure_policy passed 1 out of the required 1 times. Success!
  599. test_die_failure_policy passed 1 out of the required 1 times. Success!
  600. test_ignore_failure_policy passed 1 out of the required 1 times. Success!
  601. test_bad_crc passed 1 out of the required 1 times. Success!
  602. test_compression_error passed 1 out of the required 1 times. Success!
  603. test_data_size passed 1 out of the required 1 times. Success!
  604. test_bloomfilter_size[LeveledCompactionStrategy] passed 1 out of the required 1 times. Success!
  605. test_bloomfilter_size[SizeTieredCompactionStrategy] passed 1 out of the required 1 times. Success!
  606. test_bloomfilter_size[DateTieredCompactionStrategy] passed 1 out of the required 1 times. Success!
  607. test_sstable_deletion[LeveledCompactionStrategy] passed 1 out of the required 1 times. Success!
  608. test_sstable_deletion[SizeTieredCompactionStrategy] passed 1 out of the required 1 times. Success!
  609. test_sstable_deletion[DateTieredCompactionStrategy] passed 1 out of the required 1 times. Success!
  610. test_dtcs_deletion[DateTieredCompactionStrategy] passed 1 out of the required 1 times. Success!
  611. test_compaction_throughput passed 1 out of the required 1 times. Success!
  612. test_compaction_strategy_switching[LeveledCompactionStrategy] passed 1 out of the required 1 times. Success!
  613. test_compaction_strategy_switching[SizeTieredCompactionStrategy] passed 1 out of the required 1 times. Success!
  614. test_compaction_strategy_switching[DateTieredCompactionStrategy] passed 1 out of the required 1 times. Success!
  615. test_large_compaction_warning passed 1 out of the required 1 times. Success!
  616. test_disable_autocompaction_nodetool[LeveledCompactionStrategy] passed 1 out of the required 1 times. Success!
  617. test_disable_autocompaction_nodetool[SizeTieredCompactionStrategy] passed 1 out of the required 1 times. Success!
  618. test_disable_autocompaction_nodetool[DateTieredCompactionStrategy] passed 1 out of the required 1 times. Success!
  619. test_disable_autocompaction_schema[LeveledCompactionStrategy] passed 1 out of the required 1 times. Success!
  620. test_disable_autocompaction_schema[SizeTieredCompactionStrategy] passed 1 out of the required 1 times. Success!
  621. test_disable_autocompaction_schema[DateTieredCompactionStrategy] passed 1 out of the required 1 times. Success!
  622. test_disable_autocompaction_alter[LeveledCompactionStrategy] passed 1 out of the required 1 times. Success!
  623. test_disable_autocompaction_alter[SizeTieredCompactionStrategy] passed 1 out of the required 1 times. Success!
  624. test_disable_autocompaction_alter[DateTieredCompactionStrategy] passed 1 out of the required 1 times. Success!
  625. test_disable_autocompaction_alter_and_nodetool[LeveledCompactionStrategy] passed 1 out of the required 1 times. Success!
  626. test_disable_autocompaction_alter_and_nodetool[SizeTieredCompactionStrategy] passed 1 out of the required 1 times. Success!
  627. test_disable_autocompaction_alter_and_nodetool[DateTieredCompactionStrategy] passed 1 out of the required 1 times. Success!
  628. test_user_defined_compaction passed 1 out of the required 1 times. Success!
  629. test_disable_compression_cql passed 1 out of the required 1 times. Success!
  630. test_compression_cql_options passed 1 out of the required 1 times. Success!
  631. test_compression_cql_disabled_with_alter passed 1 out of the required 1 times. Success!
  632. test_compression_cql_enabled_with_alter passed 1 out of the required 1 times. Success!
  633. test_compression_chunk_length passed 1 out of the required 1 times. Success!
  634. test_change_durable_writes passed 1 out of the required 1 times. Success!
  635. test_simple_strategy passed 1 out of the required 1 times. Success!
  636. test_simple_strategy_each_quorum passed 1 out of the required 1 times. Success!
  637. test_simple_strategy_counters passed 1 out of the required 1 times. Success!
  638. test_simple_strategy_each_quorum_counters passed 1 out of the required 1 times. Success!
  639. test_14513_transient passed 1 out of the required 1 times. Success!
  640. test_14513_permanent passed 1 out of the required 1 times. Success!
  641. test_14330 passed 1 out of the required 1 times. Success!
  642. test_13911 passed 1 out of the required 1 times. Success!
  643. test_13911_rows_srp passed 1 out of the required 1 times. Success!
  644. test_13911_partitions_srp passed 1 out of the required 1 times. Success!
  645. test_13880 passed 1 out of the required 1 times. Success!
  646. test_13747 passed 1 out of the required 1 times. Success!
  647. test_13595 passed 1 out of the required 1 times. Success!
  648. test_12872 passed 1 out of the required 1 times. Success!
  649. test_short_read failed and was not selected for rerun.
  650.     <class 'OSError'>
  651.     [Errno 24] Too many open files
  652.     [<TracebackEntry /Users/asp/development/cassandra-dtest/consistency_test.py:1395>, <TracebackEntry /Users/asp/development/cassandra-dtest/consistency_test.py:1576>, <TracebackEntry /Users/asp/dtest/src/ccm/ccmlib/node.py:1375>, <TracebackEntry /Users/asp/dtest/src/ccm/ccmlib/node.py:853>, <TracebackEntry /Users/asp/dtest/src/ccm/ccmlib/node.py:850>, <TracebackEntry /usr/local/Cellar/python/3.7.1/Frameworks/Python.framework/Versions/3.7/lib/python3.7/subprocess.py:722>, <TracebackEntry /usr/local/Cellar/python/3.7.1/Frameworks/Python.framework/Versions/3.7/lib/python3.7/subprocess.py:1358>]
  653. test_short_read_delete passed 1 out of the required 1 times. Success!
  654. test_short_read_quorum_delete passed 1 out of the required 1 times. Success!
  655. test_readrepair passed 1 out of the required 1 times. Success!
  656. test_quorum_available_during_failure passed 1 out of the required 1 times. Success!
  657. test_consistent_reads_after_move passed 1 out of the required 1 times. Success!
  658. test_consistent_reads_after_bootstrap passed 1 out of the required 1 times. Success!
  659. test_simple_increment passed 1 out of the required 1 times. Success!
  660. test_upgrade passed 1 out of the required 1 times. Success!
  661. test_counter_consistency passed 1 out of the required 1 times. Success!
  662. test_multi_counter_update passed 1 out of the required 1 times. Success!
  663. test_drop_counter_column passed 1 out of the required 1 times. Success!
  664. test_batch_preparation passed 1 out of the required 1 times. Success!
  665. test_keyspace passed 1 out of the required 1 times. Success!
  666. test_table passed 1 out of the required 1 times. Success!
  667. test_index passed 1 out of the required 1 times. Success!
  668. test_type passed 1 out of the required 1 times. Success!
  669. test_user passed 1 out of the required 1 times. Success!
  670. test_statements passed 1 out of the required 1 times. Success!
  671. test_partition_key_allow_filtering passed 1 out of the required 1 times. Success!
  672. test_batch passed 1 out of the required 1 times. Success!
  673. test_invalid_string_literals passed 1 out of the required 1 times. Success!
  674. test_prepared_statement_invalidation passed 1 out of the required 1 times. Success!
  675. test_range_slice passed 1 out of the required 1 times. Success!
  676. test_local_query passed 1 out of the required 1 times. Success!
  677. test_remote_query passed 1 out of the required 1 times. Success!
  678. test_disable_slow_query_log passed 1 out of the required 1 times. Success!
  679. test_lwt_with_static_columns passed 1 out of the required 1 times. Success!
  680. test_conditional_updates_on_static_columns_with_null_values passed 1 out of the required 1 times. Success!
  681. test_conditional_updates_on_static_columns_with_non_existing_values passed 1 out of the required 1 times. Success!
  682. test_conditional_updates_on_static_columns_with_null_values_batch passed 1 out of the required 1 times. Success!
  683. test_conditional_deletes_on_static_columns_with_null_values passed 1 out of the required 1 times. Success!
  684. test_conditional_deletes_on_static_columns_with_null_values_batch passed 1 out of the required 1 times. Success!
  685. test_tracing_simple failed and was not selected for rerun.
  686.     <class 'AssertionError'>
  687.     assert 'Tracing session: ' in 'Consistency level set to ALL.\nNow Tracing is enabled\n'
  688.     [<TracebackEntry /Users/asp/development/cassandra-dtest/cql_tracing_test.py:115>, <TracebackEntry /Users/asp/development/cassandra-dtest/cql_tracing_test.py:83>]
  689. test_tracing_unknown_impl failed and was not selected for rerun.
  690.     <class 'AssertionError'>
  691.     assert 'Tracing session: ' in 'Consistency level set to ALL.\nNow Tracing is enabled\n'
  692.     [<TracebackEntry /Users/asp/development/cassandra-dtest/cql_tracing_test.py:134>, <TracebackEntry /Users/asp/development/cassandra-dtest/cql_tracing_test.py:83>]
  693. test_tracing_default_impl passed 1 out of the required 1 times. Success!
  694. test_tracing_does_not_interfere_with_digest_calculation passed 1 out of the required 1 times. Success!
  695. test_delete_insert_search passed 1 out of the required 1 times. Success!
  696. test_gc passed 1 out of the required 1 times. Success!
  697. test_tombstone_size passed 1 out of the required 1 times. Success!
  698. test_disk_balance_stress passed 1 out of the required 1 times. Success!
  699. test_disk_balance_replace_same_address passed 1 out of the required 1 times. Success!
  700. test_disk_balance_replace_different_address passed 1 out of the required 1 times. Success!
  701. test_disk_balance_decommission passed 1 out of the required 1 times. Success!
  702. test_blacklisted_directory passed 1 out of the required 1 times. Success!
  703. test_alter_replication_factor passed 1 out of the required 1 times. Success!
  704. test_disk_balance_after_boundary_change_stcs passed 1 out of the required 1 times. Success!
  705. test_disk_balance_after_boundary_change_lcs passed 1 out of the required 1 times. Success!
  706. test_disk_balance_after_joining_ring_stcs passed 1 out of the required 1 times. Success!
  707. test_disk_balance_after_joining_ring_lcs passed 1 out of the required 1 times. Success!
  708. test_replay passed 1 out of the required 1 times. Success!
  709. test_compare passed 1 out of the required 1 times. Success!
  710. test_compare_mismatch passed 1 out of the required 1 times. Success!
  711. test_functional passed 1 out of the required 1 times. Success!
  712. test_nodetool passed 1 out of the required 1 times. Success!
  713. test_hintedhandoff_disabled passed 1 out of the required 1 times. Success!
  714. test_hintedhandoff_enabled passed 1 out of the required 1 times. Success!
  715. test_hintedhandoff_setmaxwindow passed 1 out of the required 1 times. Success!
  716. test_hintedhandoff_dc_disabled passed 1 out of the required 1 times. Success!
  717. test_hintedhandoff_dc_reenabled passed 1 out of the required 1 times. Success!
  718. test_hintedhandoff_decom passed 1 out of the required 1 times. Success!
  719. test_putget_with_internode_ssl passed 1 out of the required 1 times. Success!
  720. test_putget_with_internode_ssl_without_compression passed 1 out of the required 1 times. Success!
  721. test_basic_auth passed 1 out of the required 1 times. Success!
  722. test_netstats passed 1 out of the required 1 times. Success!
  723. test_table_metric_mbeans passed 1 out of the required 1 times. Success!
  724. test_mv_metric_mbeans_release passed 1 out of the required 1 times. Success!
  725. test_compactionstats passed 1 out of the required 1 times. Success!
  726. test_phi passed 1 out of the required 1 times. Success!
  727. test_set_get_batchlog_replay_throttle passed 1 out of the required 1 times. Success!
  728. test_jmx_connection passed 1 out of the required 1 times. Success!
  729. test_require_client_auth passed 1 out of the required 1 times. Success!
  730. test_basic_data_types passed 1 out of the required 1 times. Success!
  731. test_counters passed 1 out of the required 1 times. Success!
  732. test_complex_data_types passed 1 out of the required 1 times. Success!
  733. test_basic_data_types passed 1 out of the required 1 times. Success!
  734. test_complex_data_types passed 1 out of the required 1 times. Success!
  735. test_collection_update passed 1 out of the required 1 times. Success!
  736. test_selecting_pkey_as_json passed 1 out of the required 1 times. Success!
  737. test_select_using_secondary_index passed 1 out of the required 1 times. Success!
  738. test_basic_data_types passed 1 out of the required 1 times. Success!
  739. test_complex_data_types passed 1 out of the required 1 times. Success!
  740. test_delete_using_pkey_json passed 1 out of the required 1 times. Success!
  741. test_simple_schema passed 1 out of the required 1 times. Success!
  742. test_pkey_requirement passed 1 out of the required 1 times. Success!
  743. test_null_value passed 1 out of the required 1 times. Success!
  744. test_complex_schema passed 1 out of the required 1 times. Success!
  745. test_cleanup passed 1 out of the required 1 times. Success!
  746. test_view_metadata_cleanup passed 1 out of the required 1 times. Success!
  747. test_create passed 1 out of the required 1 times. Success!
  748. test_gcgs_validation passed 1 out of the required 1 times. Success!
  749. test_insert passed 1 out of the required 1 times. Success!
  750. test_populate_mv_after_insert passed 1 out of the required 1 times. Success!
  751. test_populate_mv_after_insert_wide_rows passed 1 out of the required 1 times. Success!
  752. test_crc_check_chance passed 1 out of the required 1 times. Success!
  753. test_prepared_statement passed 1 out of the required 1 times. Success!
  754. test_immutable passed 1 out of the required 1 times. Success!
  755. test_drop_mv passed 1 out of the required 1 times. Success!
  756. test_drop_column passed 1 out of the required 1 times. Success!
  757. test_drop_table passed 1 out of the required 1 times. Success!
  758. test_clustering_column passed 1 out of the required 1 times. Success!
  759. test_insert_during_range_movement_rf1 passed 1 out of the required 1 times. Success!
  760. test_insert_during_range_movement_rf2 passed 1 out of the required 1 times. Success!
  761. test_insert_during_range_movement_rf3 passed 1 out of the required 1 times. Success!
  762. test_allow_filtering passed 1 out of the required 1 times. Success!
  763. test_secondary_index passed 1 out of the required 1 times. Success!
  764. test_ttl passed 1 out of the required 1 times. Success!
  765. test_query_all_new_column passed 1 out of the required 1 times. Success!
  766. test_query_new_column passed 1 out of the required 1 times. Success!
  767. test_rename_column passed 1 out of the required 1 times. Success!
  768. test_rename_column_atomicity passed 1 out of the required 1 times. Success!
  769. test_lwt passed 1 out of the required 1 times. Success!
  770. test_interrupt_build_process passed 1 out of the required 1 times. Success!
  771. test_drop_with_stopped_build passed 1 out of the required 1 times. Success!
  772. test_resume_stopped_build passed 1 out of the required 1 times. Success!
  773. test_mv_with_default_ttl_with_flush passed 1 out of the required 1 times. Success!
  774. test_mv_with_default_ttl_without_flush passed 1 out of the required 1 times. Success!
  775. test_no_base_column_in_view_pk_complex_timestamp_with_flush passed 1 out of the required 1 times. Success!
  776. test_base_column_in_view_pk_complex_timestamp_with_flush passed 1 out of the required 1 times. Success!
  777. test_base_column_in_view_pk_complex_timestamp_without_flush passed 1 out of the required 1 times. Success!
  778. test_expired_liveness_with_limit_rf1_nodes1 passed 1 out of the required 1 times. Success!
  779. test_expired_liveness_with_limit_rf1_nodes3 passed 1 out of the required 1 times. Success!
  780. test_expired_liveness_with_limit_rf3 passed 1 out of the required 1 times. Success!
  781. test_base_column_in_view_pk_commutative_tombstone_with_flush passed 1 out of the required 1 times. Success!
  782. test_base_column_in_view_pk_commutative_tombstone_without_flush passed 1 out of the required 1 times. Success!
  783. test_view_tombstone passed 1 out of the required 1 times. Success!
  784. test_simple_repair_by_base passed 1 out of the required 1 times. Success!
  785. test_simple_repair_by_view passed 1 out of the required 1 times. Success!
  786. test_base_replica_repair passed 1 out of the required 1 times. Success!
  787. test_base_replica_repair_with_contention passed 1 out of the required 1 times. Success!
  788. test_complex_mv_select_statements passed 1 out of the required 1 times. Success!
  789. test_base_view_consistency_on_failure_after_mv_apply passed 1 out of the required 1 times. Success!
  790. test_base_view_consistency_on_failure_before_mv_apply passed 1 out of the required 1 times. Success!
  791. test_multi_partition_consistent_reads_after_write passed 1 out of the required 1 times. Success!
  792. test_mutations_dontblock passed 1 out of the required 1 times. Success!
  793. test_putget_2dc_rf1 passed 1 out of the required 1 times. Success!
  794. test_putget_2dc_rf2 passed 1 out of the required 1 times. Success!
  795. test_connect_to_ssl passed 1 out of the required 1 times. Success!
  796. test_connect_to_ssl_optional passed 1 out of the required 1 times. Success!
  797. test_use_custom_port passed 1 out of the required 1 times. Success!
  798. test_use_custom_ssl_port passed 1 out of the required 1 times. Success!
  799. test_decommission_after_drain_is_invalid passed 1 out of the required 1 times. Success!
  800. test_correct_dc_rack_in_nodetool_info passed 1 out of the required 1 times. Success!
  801. test_nodetool_timeout_commands passed 1 out of the required 1 times. Success!
  802. test_cleanup_when_no_replica_with_index passed 1 out of the required 1 times. Success!
  803. test_cleanup_when_no_replica_without_index passed 1 out of the required 1 times. Success!
  804. test_meaningless_notice_in_status passed 1 out of the required 1 times. Success!
  805. test_set_get_batchlog_replay_throttle passed 1 out of the required 1 times. Success!
  806. test_reloadlocalschema passed 1 out of the required 1 times. Success!
  807. test_refresh_size_estimates_clears_invalid_entries passed 1 out of the required 1 times. Success!
  808. test_set_get_concurrent_view_builders passed 1 out of the required 1 times. Success!
  809. test_describecluster_more_information_three_datacenters passed 1 out of the required 1 times. Success!
  810. test_sstablelevelreset passed 1 out of the required 1 times. Success!
  811. test_sstableofflinerelevel passed 1 out of the required 1 times. Success!
  812. test_sstableverify passed 1 out of the required 1 times. Success!
  813. test_sstableexpiredblockers passed 1 out of the required 1 times. Success!
  814. test_sstabledump passed 1 out of the required 1 times. Success!
  815. test_with_no_results passed 1 out of the required 1 times. Success!
  816. test_with_less_results_than_page_size passed 1 out of the required 1 times. Success!
  817. test_with_more_results_than_page_size passed 1 out of the required 1 times. Success!
  818. test_with_equal_results_to_page_size passed 1 out of the required 1 times. Success!
  819. test_undefined_page_size_default passed 1 out of the required 1 times. Success!
  820. test_with_order_by passed 1 out of the required 1 times. Success!
  821. test_with_order_by_reversed passed 1 out of the required 1 times. Success!
  822. test_with_limit passed 1 out of the required 1 times. Success!
  823. test_with_allow_filtering passed 1 out of the required 1 times. Success!
  824. test_paging_a_single_wide_row passed 1 out of the required 1 times. Success!
  825. test_paging_across_multi_wide_rows passed 1 out of the required 1 times. Success!
  826. test_paging_using_secondary_indexes passed 1 out of the required 1 times. Success!
  827. test_paging_with_in_orderby_and_two_partition_keys passed 1 out of the required 1 times. Success!
  828. test_group_by_paging passed 1 out of the required 1 times. Success!
  829. test_group_by_with_range_name_query_paging passed 1 out of the required 1 times. Success!
  830. test_group_by_with_static_columns_paging passed 1 out of the required 1 times. Success!
  831. test_static_columns_paging passed 1 out of the required 1 times. Success!
  832. test_paging_using_secondary_indexes_with_static_cols passed 1 out of the required 1 times. Success!
  833. test_static_columns_with_empty_non_static_columns_paging passed 1 out of the required 1 times. Success!
  834. test_select_in_clause_with_duplicate_keys passed 1 out of the required 1 times. Success!
  835. test_paging_with_filtering passed 1 out of the required 1 times. Success!
  836. test_paging_with_filtering_on_counter_columns passed 1 out of the required 1 times. Success!
  837. test_paging_with_filtering_on_clustering_columns passed 1 out of the required 1 times. Success!
  838. test_paging_with_filtering_on_clustering_columns_with_contains passed 1 out of the required 1 times. Success!
  839. test_paging_with_filtering_on_static_columns passed 1 out of the required 1 times. Success!
  840. test_paging_with_filtering_on_partition_key passed 1 out of the required 1 times. Success!
  841. test_paging_with_filtering_on_partition_key_with_limit passed 1 out of the required 1 times. Success!
  842. test_paging_with_filtering_on_partition_key_on_counter_columns passed 1 out of the required 1 times. Success!
  843. test_paging_with_filtering_on_partition_key_on_clustering_columns passed 1 out of the required 1 times. Success!
  844. test_paging_with_filtering_on_partition_key_on_clustering_columns_with_contains passed 1 out of the required 1 times. Success!
  845. test_paging_with_filtering_on_partition_key_on_static_columns passed 1 out of the required 1 times. Success!
  846. test_paging_with_no_clustering_columns passed 1 out of the required 1 times. Success!
  847. test_per_partition_limit_paging passed 1 out of the required 1 times. Success!
  848. test_paging_for_range_name_queries passed 1 out of the required 1 times. Success!
  849. test_paging_with_empty_row_and_empty_static_columns passed 1 out of the required 1 times. Success!
  850. test_data_change_impacting_earlier_page passed 1 out of the required 1 times. Success!
  851. test_data_change_impacting_later_page passed 1 out of the required 1 times. Success!
  852. test_row_TTL_expiry_during_paging passed 1 out of the required 1 times. Success!
  853. test_cell_TTL_expiry_during_paging passed 1 out of the required 1 times. Success!
  854. test_node_unavailabe_during_paging passed 1 out of the required 1 times. Success!
  855. test_query_isolation passed 1 out of the required 1 times. Success!
  856. test_single_partition_deletions passed 1 out of the required 1 times. Success!
  857. test_multiple_partition_deletions passed 1 out of the required 1 times. Success!
  858. test_single_row_deletions passed 1 out of the required 1 times. Success!
  859. test_single_cell_deletions passed 1 out of the required 1 times. Success!
  860. test_multiple_cell_deletions passed 1 out of the required 1 times. Success!
  861. test_ttl_deletions passed 1 out of the required 1 times. Success!
  862. test_failure_threshold_deletions passed 1 out of the required 1 times. Success!
  863. test_deletion_with_distinct_paging passed 1 out of the required 1 times. Success!
  864. test_replica_availability passed 1 out of the required 1 times. Success!
  865. test_cluster_availability passed 1 out of the required 1 times. Success!
  866. test_contention_many_threads passed 1 out of the required 1 times. Success!
  867. test_dropped_index passed 1 out of the required 1 times. Success!
  868. test_move_single_node passed 1 out of the required 1 times. Success!
  869. test_move_single_node_localhost passed 1 out of the required 1 times. Success!
  870. test_restart_node passed 1 out of the required 1 times. Success!
  871. test_restart_node_localhost passed 1 out of the required 1 times. Success!
  872. test_add_and_remove_node passed 1 out of the required 1 times. Success!
  873. test_schema_changes passed 1 out of the required 1 times. Success!
  874. test_tombstone_failure_threshold_message passed 1 out of the required 1 times. Success!
  875. test_putget passed 1 out of the required 1 times. Success!
  876. test_putget_snappy passed 1 out of the required 1 times. Success!
  877. test_putget_deflate passed 1 out of the required 1 times. Success!
  878. test_non_local_read passed 1 out of the required 1 times. Success!
  879. test_rangeputget passed 1 out of the required 1 times. Success!
  880. test_wide_row passed 1 out of the required 1 times. Success!
  881. test_ghosts passed 1 out of the required 1 times. Success!
  882. test_tombstone_failure_v3 passed 1 out of the required 1 times. Success!
  883. test_tombstone_failure_v4 passed 1 out of the required 1 times. Success!
  884. test_tombstone_failure_v5 passed 1 out of the required 1 times. Success!
  885. test_alter_rf_and_run_read_repair passed 1 out of the required 1 times. Success!
  886. test_range_slice_query_with_tombstones passed 1 out of the required 1 times. Success!
  887. test_gcable_tombstone_resurrection_on_range_slice_query passed 1 out of the required 1 times. Success!
  888. test_failed_read_repair passed 1 out of the required 1 times. Success!
  889. test_normal_read_repair passed 1 out of the required 1 times. Success!
  890. test_speculative_data_request passed 1 out of the required 1 times. Success!
  891. test_speculative_write passed 1 out of the required 1 times. Success!
  892. test_quorum_requirement passed 1 out of the required 1 times. Success!
  893. test_quorum_requirement_on_speculated_read passed 1 out of the required 1 times. Success!
  894. test_monotonic_reads[blocking] passed 1 out of the required 1 times. Success!
  895. test_monotonic_reads[none] passed 1 out of the required 1 times. Success!
  896. test_atomic_writes[blocking] passed 1 out of the required 1 times. Success!
  897. test_atomic_writes[none] passed 1 out of the required 1 times. Success!
  898. test_simple_rebuild passed 1 out of the required 1 times. Success!
  899. test_resumable_rebuild passed 1 out of the required 1 times. Success!
  900. test_rebuild_ranges passed 1 out of the required 1 times. Success!
  901. test_disallow_rebuild_nonlocal_range passed 1 out of the required 1 times. Success!
  902. test_disallow_rebuild_from_nonreplica passed 1 out of the required 1 times. Success!
  903. test_rebuild_with_specific_sources passed 1 out of the required 1 times. Success!
  904. test_refresh_deadlock_startup passed 1 out of the required 1 times. Success!
  905. test_fail_without_replace passed 1 out of the required 1 times. Success!
  906. test_unsafe_replace passed 1 out of the required 1 times. Success!
  907. test_insert_data_during_replace_same_address passed 1 out of the required 1 times. Success!
  908. test_insert_data_during_replace_different_address passed 1 out of the required 1 times. Success!
  909. test_replace_with_insufficient_replicas passed 1 out of the required 1 times. Success!
  910. test_simple passed 1 out of the required 1 times. Success!
  911. test_rf_collapse_gossiping_property_file_snitch passed 1 out of the required 1 times. Success!
  912. test_rf_expand_gossiping_property_file_snitch passed 1 out of the required 1 times. Success!
  913. test_rf_collapse_property_file_snitch passed 1 out of the required 1 times. Success!
  914. test_rf_expand_property_file_snitch passed 1 out of the required 1 times. Success!
  915. test_cannot_restart_with_different_rack passed 1 out of the required 1 times. Success!
  916. test_failed_snitch_update_gossiping_property_file_snitch passed 1 out of the required 1 times. Success!
  917. test_failed_snitch_update_property_file_snitch passed 1 out of the required 1 times. Success!
  918. test_switch_data_center_startup_fails passed 1 out of the required 1 times. Success!
  919. test_creating_and_dropping_keyspace passed 1 out of the required 1 times. Success!
  920. test_creating_and_dropping_table passed 1 out of the required 1 times. Success!
  921. test_creating_and_dropping_table_with_2ary_indexes passed 1 out of the required 1 times. Success!
  922. test_creating_and_dropping_user_types passed 1 out of the required 1 times. Success!
  923. test_creating_and_dropping_udf passed 1 out of the required 1 times. Success!
  924. test_creating_and_dropping_uda passed 1 out of the required 1 times. Success!
  925. test_basic_table_datatype passed 1 out of the required 1 times. Success!
  926. test_collection_table_datatype passed 1 out of the required 1 times. Success!
  927. test_clustering_order passed 1 out of the required 1 times. Success!
  928. test_nondefault_table_settings passed 1 out of the required 1 times. Success!
  929. test_indexes passed 1 out of the required 1 times. Success!
  930. test_durable_writes passed 1 out of the required 1 times. Success!
  931. test_static_column passed 1 out of the required 1 times. Success!
  932. test_udt_table passed 1 out of the required 1 times. Success!
  933. test_udf passed 1 out of the required 1 times. Success!
  934. test_uda passed 1 out of the required 1 times. Success!
  935. test_table_alteration passed 1 out of the required 1 times. Success!
  936. test_drop_column_compaction passed 1 out of the required 1 times. Success!
  937. test_drop_column_queries passed 1 out of the required 1 times. Success!
  938. test_drop_column_and_restart passed 1 out of the required 1 times. Success!
  939. test_drop_static_column_and_restart passed 1 out of the required 1 times. Success!
  940. test_scrub_static_table passed 1 out of the required 1 times. Success!
  941. test_standalone_scrub passed 1 out of the required 1 times. Success!
  942. test_scrub_collections_table passed 1 out of the required 1 times. Success!
  943. test_nodetool_scrub passed 1 out of the required 1 times. Success!
  944. test_standalone_scrub passed 1 out of the required 1 times. Success!
  945. test_standalone_scrub_essential_files_only passed 1 out of the required 1 times. Success!
  946. test_scrub_with_UDT passed 1 out of the required 1 times. Success!
  947. test_data_created_before_index_not_returned_in_where_query passed 1 out of the required 1 times. Success!
  948. test_low_cardinality_indexes passed 1 out of the required 1 times. Success!
  949. test_6924_dropping_ks passed 1 out of the required 1 times. Success!
  950. test_6924_dropping_cf passed 1 out of the required 1 times. Success!
  951. test_8280_validate_indexed_values passed 1 out of the required 1 times. Success!
  952. test_manual_rebuild_index passed 1 out of the required 1 times. Success!
  953. test_failing_manual_rebuild_index passed 1 out of the required 1 times. Success!
  954. test_drop_index_while_building passed 1 out of the required 1 times. Success!
  955. test_index_is_not_rebuilt_at_restart passed 1 out of the required 1 times. Success!
  956. test_multi_index_filtering_query passed 1 out of the required 1 times. Success!
  957. test_only_coordinator_chooses_index_for_query passed 1 out of the required 1 times. Success!
  958. test_tuple_indexes passed 1 out of the required 1 times. Success!
  959. test_list_indexes passed 1 out of the required 1 times. Success!
  960. test_set_indexes passed 1 out of the required 1 times. Success!
  961. test_multiple_indexes_on_single_map_column passed 1 out of the required 1 times. Success!
  962. test_map_indexes passed 1 out of the required 1 times. Success!
  963. test_bootstrap passed 1 out of the required 1 times. Success!
  964. test_resume passed 1 out of the required 1 times. Success!
  965. test_manual_join passed 1 out of the required 1 times. Success!
  966. test_write_survey passed 1 out of the required 1 times. Success!
  967. test_startup_no_live_seeds passed 1 out of the required 1 times. Success!
  968. test_startup_non_seed_with_peers passed 1 out of the required 1 times. Success!
  969. test_startup_after_ring_delay passed 1 out of the required 1 times. Success!
  970. test_basic_snapshot_and_restore passed 1 out of the required 1 times. Success!
  971. test_snapshot_and_restore_drop_table_remove_dropped_column passed 1 out of the required 1 times. Success!
  972. test_snapshot_and_restore_dropping_a_column passed 1 out of the required 1 times. Success!
  973. test_archive_commitlog passed 1 out of the required 1 times. Success!
  974. test_archive_commitlog_with_active_commitlog passed 1 out of the required 1 times. Success!
  975. test_dont_archive_commitlog passed 1 out of the required 1 times. Success!
  976. test_archive_commitlog_point_in_time passed 1 out of the required 1 times. Success!
  977. test_archive_commitlog_point_in_time_with_active_commitlog passed 1 out of the required 1 times. Success!
  978. test_archive_commitlog_point_in_time_with_active_commitlog_ln passed 1 out of the required 1 times. Success!
  979. test_archive_and_restore_commitlog_repeatedly passed 1 out of the required 1 times. Success!
  980. test_prefer_local_reconnect_on_listen_address passed 1 out of the required 1 times. Success!
  981. test_ssl_enabled passed 1 out of the required 1 times. Success!
  982. test_ssl_correct_hostname_with_validation passed 1 out of the required 1 times. Success!
  983. test_ssl_wrong_hostname_no_validation passed 1 out of the required 1 times. Success!
  984. test_ssl_wrong_hostname_with_validation passed 1 out of the required 1 times. Success!
  985. test_ssl_client_auth_required_fail passed 1 out of the required 1 times. Success!
  986. test_ssl_client_auth_required_succeed passed 1 out of the required 1 times. Success!
  987. test_ca_mismatch passed 1 out of the required 1 times. Success!
  988. test_optional_outbound_tls passed 1 out of the required 1 times. Success!
  989. test_sstableloader_uppercase_keyspace_name passed 1 out of the required 1 times. Success!
  990. test_incompressible_data_in_compressed_table passed 1 out of the required 1 times. Success!
  991. test_remove_index_file passed 1 out of the required 1 times. Success!
  992. test_sstableloader_with_mv passed 1 out of the required 1 times. Success!
  993. test_sstableloader_with_failing_2i passed 1 out of the required 1 times. Success!
  994. test_split passed 1 out of the required 1 times. Success!
  995. test_single_file_split passed 1 out of the required 1 times. Success!
  996. test_compaction passed 1 out of the required 1 times. Success!
  997. test_abortedcompaction passed 1 out of the required 1 times. Success!
  998. test_zerocopy_streaming passed 1 out of the required 1 times. Success!
  999. test_zerocopy_streaming_leveled_compaction passed 1 out of the required 1 times. Success!
  1000. test_zerocopy_streaming_size_tiered_compaction failed and was not selected for rerun.
  1001.     <class 'AssertionError'>
  1002.     1 > 0
  1003. assert False
  1004.  +  where False = <built-in function gt>(0, 1)
  1005.     [<TracebackEntry /Users/asp/development/cassandra-dtest/streaming_test.py:95>, <TracebackEntry /Users/asp/development/cassandra-dtest/streaming_test.py:77>]
  1006. test_zerocopy_streaming_no_replication passed 1 out of the required 1 times. Success!
  1007. test_uniform_ratio passed 1 out of the required 1 times. Success!
  1008. test_fixed_ratio passed 1 out of the required 1 times. Success!
  1009. test_quick_write passed 1 out of the required 1 times. Success!
  1010. test_local_system_keyspaces passed 1 out of the required 1 times. Success!
  1011. test_replicated_system_keyspaces passed 1 out of the required 1 times. Success!
  1012. test_do_not_join_ring passed 1 out of the required 1 times. Success!
  1013. test_size_estimates_multidc passed 1 out of the required 1 times. Success!
  1014. test_simple_decommission passed 1 out of the required 1 times. Success!
  1015. test_resumable_decommission passed 1 out of the required 1 times. Success!
  1016. test_movement passed 1 out of the required 1 times. Success!
  1017. test_decommission passed 1 out of the required 1 times. Success!
  1018. test_move_single_node passed 1 out of the required 1 times. Success!
  1019. test_decommissioned_node_cant_rejoin passed 1 out of the required 1 times. Success!
  1020. test_crash_during_decommission passed 1 out of the required 1 times. Success!
  1021. test_bootstrap_and_cleanup passed 1 out of the required 1 times. Success!
  1022. test_move_forwards_between_and_cleanup passed 1 out of the required 1 times. Success!
  1023. test_move_forwards_and_cleanup passed 1 out of the required 1 times. Success!
  1024. test_move_backwards_between_and_cleanup passed 1 out of the required 1 times. Success!
  1025. test_move_backwards_and_cleanup passed 1 out of the required 1 times. Success!
  1026. test_decommission passed 1 out of the required 1 times. Success!
  1027. test_remove passed 1 out of the required 1 times. Success!
  1028. test_replace passed 1 out of the required 1 times. Success!
  1029. test_transient_noop_write passed 1 out of the required 1 times. Success!
  1030. test_transient_write passed 1 out of the required 1 times. Success!
  1031. test_transient_full_merge_read passed 1 out of the required 1 times. Success!
  1032. test_srp passed 1 out of the required 1 times. Success!
  1033. test_transient_full_merge_read_with_delete_transient_coordinator passed 1 out of the required 1 times. Success!
  1034. test_transient_full_merge_read_with_delete_full_coordinator passed 1 out of the required 1 times. Success!
  1035. test_speculative_write_repair_cycle passed 1 out of the required 1 times. Success!
  1036. test_primary_range_repair passed 1 out of the required 1 times. Success!
  1037. test_optimized_primary_range_repair passed 1 out of the required 1 times. Success!
  1038. test_transient_incremental_repair passed 1 out of the required 1 times. Success!
  1039. test_cheap_quorums passed 1 out of the required 1 times. Success!
  1040. test_speculative_write passed 1 out of the required 1 times. Success!
  1041. test_full_repair_from_full_replica passed 1 out of the required 1 times. Success!
  1042. test_full_repair_from_transient_replica passed 1 out of the required 1 times. Success!
  1043. test_disabled_read_repair passed 1 out of the required 1 times. Success!
  1044. test_always_speculate passed 1 out of the required 1 times. Success!
  1045. test_custom_speculate passed 1 out of the required 1 times. Success!
  1046. test_default_ttl passed 1 out of the required 1 times. Success!
  1047. test_insert_ttl_has_priority_on_defaut_ttl passed 1 out of the required 1 times. Success!
  1048. test_insert_ttl_works_without_default_ttl passed 1 out of the required 1 times. Success!
  1049. test_default_ttl_can_be_removed passed 1 out of the required 1 times. Success!
  1050. test_removing_default_ttl_does_not_affect_existing_rows passed 1 out of the required 1 times. Success!
  1051. test_update_single_column_ttl passed 1 out of the required 1 times. Success!
  1052. test_update_multiple_columns_ttl passed 1 out of the required 1 times. Success!
  1053. test_update_column_ttl_with_default_ttl passed 1 out of the required 1 times. Success!
  1054. test_remove_column_ttl passed 1 out of the required 1 times. Success!
  1055. test_set_ttl_to_zero_to_default_ttl passed 1 out of the required 1 times. Success!
  1056. test_collection_list_ttl passed 1 out of the required 1 times. Success!
  1057. test_collection_set_ttl passed 1 out of the required 1 times. Success!
  1058. test_collection_map_ttl passed 1 out of the required 1 times. Success!
  1059. test_delete_with_ttl_expired passed 1 out of the required 1 times. Success!
  1060. test_expiration_overflow_policy_cap passed 1 out of the required 1 times. Success!
  1061. test_expiration_overflow_policy_cap_default_ttl passed 1 out of the required 1 times. Success!
  1062. test_expiration_overflow_policy_capnowarn passed 1 out of the required 1 times. Success!
  1063. test_expiration_overflow_policy_capnowarn_default_ttl passed 1 out of the required 1 times. Success!
  1064. test_expiration_overflow_policy_reject passed 1 out of the required 1 times. Success!
  1065. test_expiration_overflow_policy_reject_default_ttl passed 1 out of the required 1 times. Success!
  1066. test_ttl_is_replicated passed 1 out of the required 1 times. Success!
  1067. test_ttl_is_respected_on_delayed_replication passed 1 out of the required 1 times. Success!
  1068. test_ttl_is_respected_on_repair passed 1 out of the required 1 times. Success!
  1069. test_recover_negative_expiration_date_sstables_with_scrub passed 1 out of the required 1 times. Success!
  1070. test_udt passed 1 out of the required 1 times. Success!
  1071. test_migration passed 1 out of the required 1 times. Success!
  1072. test_udf_overload passed 1 out of the required 1 times. Success!
  1073. test_udf_scripting passed 1 out of the required 1 times. Success!
  1074. test_default_aggregate passed 1 out of the required 1 times. Success!
  1075. test_aggregate_udf passed 1 out of the required 1 times. Success!
  1076. test_udf_with_udt passed 1 out of the required 1 times. Success!
  1077. test_udf_with_udt_keyspace_isolation passed 1 out of the required 1 times. Success!
  1078. test_aggregate_with_udt_keyspace_isolation passed 1 out of the required 1 times. Success!
  1079. test_type_dropping passed 1 out of the required 1 times. Success!
  1080. test_nested_type_dropping passed 1 out of the required 1 times. Success!
  1081. test_type_enforcement passed 1 out of the required 1 times. Success!
  1082. test_nested_user_types passed 1 out of the required 1 times. Success!
  1083. test_type_as_part_of_pkey passed 1 out of the required 1 times. Success!
  1084. test_type_secondary_indexing passed 1 out of the required 1 times. Success!
  1085. test_type_keyspace_permission_isolation passed 1 out of the required 1 times. Success!
  1086. test_nulls_in_user_types passed 1 out of the required 1 times. Success!
  1087. test_no_counters_in_user_types passed 1 out of the required 1 times. Success!
  1088. test_type_as_clustering_col passed 1 out of the required 1 times. Success!
  1089. test_udt_subfield passed 1 out of the required 1 times. Success!
  1090. test_user_type_isolation passed 1 out of the required 1 times. Success!
  1091. test_wide_rows passed 1 out of the required 1 times. Success!
  1092. test_column_index_stress passed 1 out of the required 1 times. Success!
  1093. test_mutation_v3 passed 1 out of the required 1 times. Success!
  1094. test_mutation_v4 passed 1 out of the required 1 times. Success!
  1095. test_mutation_v5 passed 1 out of the required 1 times. Success!
  1096. test_mutation_any passed 1 out of the required 1 times. Success!
  1097. test_mutation_one passed 1 out of the required 1 times. Success!
  1098. test_mutation_quorum passed 1 out of the required 1 times. Success!
  1099. test_batch passed 1 out of the required 1 times. Success!
  1100. test_counter passed 1 out of the required 1 times. Success!
  1101. test_paxos passed 1 out of the required 1 times. Success!
  1102. test_paxos_any passed 1 out of the required 1 times. Success!
  1103. test_simple_insert passed 1 out of the required 1 times. Success!
  1104. test_lwt passed 1 out of the required 1 times. Success!
  1105. test_past_and_future_dates passed 1 out of the required 1 times. Success!
  1106. test_sub_second_precision passed 1 out of the required 1 times. Success!
  1107. test_eat_glass passed 1 out of the required 1 times. Success!
  1108. test_source_glass passed 1 out of the required 1 times. Success!
  1109. test_unicode_syntax_error passed 1 out of the required 1 times. Success!
  1110. test_unicode_invalid_request_error passed 1 out of the required 1 times. Success!
  1111. test_with_empty_values passed 1 out of the required 1 times. Success!
  1112. test_tracing_from_system_traces passed 1 out of the required 1 times. Success!
  1113. test_select_element_inside_udt passed 1 out of the required 1 times. Success!
  1114. test_list_queries passed 1 out of the required 1 times. Success!
  1115. test_describe passed 1 out of the required 1 times. Success!
  1116. test_describe_describes_non_default_compaction_parameters passed 1 out of the required 1 times. Success!
  1117. test_describe_on_non_reserved_keywords passed 1 out of the required 1 times. Success!
  1118. test_describe_mv passed 1 out of the required 1 times. Success!
  1119. test_copy_to passed 1 out of the required 1 times. Success!
  1120. test_float_formatting passed 1 out of the required 1 times. Success!
  1121. test_int_values passed 1 out of the required 1 times. Success!
  1122. test_datetime_values passed 1 out of the required 1 times. Success!
  1123. test_tracing passed 1 out of the required 1 times. Success!
  1124. test_client_warnings passed 1 out of the required 1 times. Success!
  1125. test_connect_timeout passed 1 out of the required 1 times. Success!
  1126. test_update_schema_with_down_node passed 1 out of the required 1 times. Success!
  1127. test_describe_round_trip passed 1 out of the required 1 times. Success!
  1128. test_materialized_view passed 1 out of the required 1 times. Success!
  1129. test_clear passed 1 out of the required 1 times. Success!
  1130. test_cls passed 1 out of the required 1 times. Success!
  1131. test_batch passed 1 out of the required 1 times. Success!
  1132. test_uuid passed 1 out of the required 1 times. Success!
  1133. test_commented_lines passed 1 out of the required 1 times. Success!
  1134. test_colons_in_string_literals passed 1 out of the required 1 times. Success!
  1135. test_select passed 1 out of the required 1 times. Success!
  1136. test_insert passed 1 out of the required 1 times. Success!
  1137. test_update passed 1 out of the required 1 times. Success!
  1138. test_delete passed 1 out of the required 1 times. Success!
  1139. test_batch passed 1 out of the required 1 times. Success!
  1140. test_create_keyspace passed 1 out of the required 1 times. Success!
  1141. test_drop_keyspace passed 1 out of the required 1 times. Success!
  1142. test_create_table passed 1 out of the required 1 times. Success!
  1143. test_drop_table passed 1 out of the required 1 times. Success!
  1144. test_truncate passed 1 out of the required 1 times. Success!
  1145. test_use_keyspace passed 1 out of the required 1 times. Success!
  1146. test_drop_index passed 1 out of the required 1 times. Success!
  1147. test_create_index passed 1 out of the required 1 times. Success!
  1148. test_login_keeps_keyspace passed 1 out of the required 1 times. Success!
  1149. test_login_rejects_bad_pass passed 1 out of the required 1 times. Success!
  1150. test_login_authenticates_correct_user passed 1 out of the required 1 times. Success!
  1151. test_login_allows_bad_pass_and_continued_use passed 1 out of the required 1 times. Success!
  1152. test_list_roles_after_login passed 1 out of the required 1 times. Success!
  1153. test_reading_collections_with_empty_values passed 1 out of the required 1 times. Success!
  1154. test_writing_use_header passed 1 out of the required 1 times. Success!
  1155. test_reading_counter passed 1 out of the required 1 times. Success!
  1156. test_reading_counter_without_batching passed 1 out of the required 1 times. Success!
  1157. test_reading_use_header passed 1 out of the required 1 times. Success!
  1158. test_reading_with_ttl passed 1 out of the required 1 times. Success!
  1159. test_reading_with_skip_and_max_rows passed 1 out of the required 1 times. Success!
  1160. test_reading_with_skip_cols passed 1 out of the required 1 times. Success!
  1161. test_reading_counters_with_skip_cols passed 1 out of the required 1 times. Success!
  1162. test_writing_with_token_boundaries passed 1 out of the required 1 times. Success!
  1163. test_reading_max_parse_errors passed 1 out of the required 1 times. Success!
  1164. test_reading_max_insert_errors passed 1 out of the required 1 times. Success!
  1165. test_reading_with_multiple_files passed 1 out of the required 1 times. Success!
  1166. test_writing_with_max_output_size passed 1 out of the required 1 times. Success!
  1167. test_explicit_column_order_writing passed 1 out of the required 1 times. Success!
  1168. test_quoted_column_names_writing passed 1 out of the required 1 times. Success!
  1169. test_read_wrong_column_names passed 1 out of the required 1 times. Success!
  1170. test_boolstyle_round_trip passed 1 out of the required 1 times. Success!
  1171. test_round_trip_with_sub_second_precision passed 1 out of the required 1 times. Success!
  1172. test_round_trip_with_different_number_precision passed 1 out of the required 1 times. Success!
  1173. test_round_trip_with_num_processes passed 1 out of the required 1 times. Success!
  1174. test_round_trip_with_rate_file passed 1 out of the required 1 times. Success!
  1175. test_copy_options_from_config_file passed 1 out of the required 1 times. Success!
  1176. test_wrong_number_of_columns passed 1 out of the required 1 times. Success!
  1177. test_round_trip_murmur3 passed 1 out of the required 1 times. Success!
  1178. test_round_trip_random passed 1 out of the required 1 times. Success!
  1179. test_round_trip_order_preserving passed 1 out of the required 1 times. Success!
  1180. test_round_trip_byte_ordered passed 1 out of the required 1 times. Success!
  1181. test_source_copy_round_trip passed 1 out of the required 1 times. Success!
  1182. test_bulk_round_trip_default passed 1 out of the required 1 times. Success!
  1183. test_bulk_round_trip_non_prepared_statements passed 1 out of the required 1 times. Success!
  1184. test_bulk_round_trip_blogposts passed 1 out of the required 1 times. Success!
  1185. test_bulk_round_trip_blogposts_with_max_connections passed 1 out of the required 1 times. Success!
  1186. test_bulk_round_trip_with_timeouts passed 1 out of the required 1 times. Success!
  1187. test_bulk_round_trip_with_low_ingestrate passed 1 out of the required 1 times. Success!
  1188. test_bulk_round_trip_with_single_core passed 1 out of the required 1 times. Success!
  1189. test_bulk_round_trip_with_backoff passed 1 out of the required 1 times. Success!
  1190. test_copy_to_with_more_failures_than_max_attempts passed 1 out of the required 1 times. Success!
  1191. test_copy_to_with_fewer_failures_than_max_attempts passed 1 out of the required 1 times. Success!
  1192. test_copy_to_with_child_process_crashing passed 1 out of the required 1 times. Success!
  1193. test_copy_from_with_more_failures_than_max_attempts passed 1 out of the required 1 times. Success!
  1194. test_copy_from_with_fewer_failures_than_max_attempts passed 1 out of the required 1 times. Success!
  1195. test_copy_from_with_child_process_crashing passed 1 out of the required 1 times. Success!
  1196. test_copy_from_with_unacked_batches passed 1 out of the required 1 times. Success!
  1197. test_round_trip_with_authentication passed 1 out of the required 1 times. Success!
  1198. test_reading_pk_timestamps_with_counters passed 1 out of the required 1 times. Success!
  1199. test_copy_from_with_wrong_order_or_missing_UDT_fields passed 1 out of the required 1 times. Success!
  1200. test_importing_invalid_data_for_collections passed 1 out of the required 1 times. Success!
  1201. test_empty_string passed 1 out of the required 1 times. Success!
  1202. test_invalid_error passed 1 out of the required 1 times. Success!
  1203. test_invalid_error_after_valid_error passed 1 out of the required 1 times. Success!
  1204. test_invalid_error_before_valid_errors passed 1 out of the required 1 times. Success!
  1205. test_multiple_valid_errors passed 1 out of the required 1 times. Success!
  1206. test_valid_and_invalid_errors_same_line passed 1 out of the required 1 times. Success!
  1207. test_valid_error passed 1 out of the required 1 times. Success!
  1208. test_valid_error_with_whitespace passed 1 out of the required 1 times. Success!
  1209. test_almost_equal_expect_failure passed 1 out of the required 1 times. Success!
  1210. test_almost_equal_expect_pass passed 1 out of the required 1 times. Success!
  1211. test_assertions passed 1 out of the required 1 times. Success!
  1212. test_calling_func_attribute_calls_wrapped_function passed 1 out of the required 1 times. Success!
  1213. test_calling_func_attribute_not_rate_limited passed 1 out of the required 1 times. Success!
  1214. test_calling_rate_limited_func_delegates_to_wrapped_func passed 1 out of the required 1 times. Success!
  1215. test_can_call_again_if_last_called_older_than_limit passed 1 out of the required 1 times. Success!
  1216. test_end_to_end passed 1 out of the required 1 times. Success!
  1217. test_init_with_keyword_args passed 1 out of the required 1 times. Success!
  1218. test_init_with_positional_args passed 1 out of the required 1 times. Success!
  1219. test_last_called_not_set_when_called_within_time_limit passed 1 out of the required 1 times. Success!
  1220. test_last_called_set_when_called passed 1 out of the required 1 times. Success!
  1221. test_rate_limit_respected passed 1 out of the required 1 times. Success!
  1222. test_repr passed 1 out of the required 1 times. Success!
  1223. test_all_subclasses_defer_getattr passed 1 out of the required 1 times. Success!
  1224. test_all_subclasses_defer_getitem passed 1 out of the required 1 times. Success!
  1225. test_all_subclasses_known passed 1 out of the required 1 times. Success!
  1226. test_default_wrapper_max_schema_agreement_wait_is_None passed 1 out of the required 1 times. Success!
  1227. test_repr passed 1 out of the required 1 times. Success!
  1228. test_wrapped_access_calls_refresh passed 1 out of the required 1 times. Success!
  1229. test_wrapped_returns_table_metadata passed 1 out of the required 1 times. Success!
  1230. test_default_wrapper_max_schema_agreement_wait_is_None passed 1 out of the required 1 times. Success!
  1231. test_repr passed 1 out of the required 1 times. Success!
  1232. test_wrapped_access_calls_refresh passed 1 out of the required 1 times. Success!
  1233. test_wrapped_returns_keyspace_metadata passed 1 out of the required 1 times. Success!
  1234. test_default_wrapper_max_schema_agreement_wait_is_None passed 1 out of the required 1 times. Success!
  1235. test_repr passed 1 out of the required 1 times. Success!
  1236. test_wrapped_access_calls_refresh passed 1 out of the required 1 times. Success!
  1237. test_wrapped_returns_cluster_metadata passed 1 out of the required 1 times. Success!
  1238. test_consistent_repair passed 1 out of the required 1 times. Success!
  1239. test_manual_session_fail passed 1 out of the required 1 times. Success!
  1240. test_manual_session_cancel_non_coordinator_failure passed 1 out of the required 1 times. Success!
  1241. test_manual_session_force_cancel passed 1 out of the required 1 times. Success!
  1242. test_sstable_marking passed 1 out of the required 1 times. Success!
  1243. test_multiple_repair passed 1 out of the required 1 times. Success!
  1244. test_sstable_repairedset passed 1 out of the required 1 times. Success!
  1245. test_compaction passed 1 out of the required 1 times. Success!
  1246. test_multiple_full_repairs_lcs passed 1 out of the required 1 times. Success!
  1247. test_move passed 1 out of the required 1 times. Success!
  1248. test_decommission passed 1 out of the required 1 times. Success!
  1249. test_bootstrap passed 1 out of the required 1 times. Success!
  1250. test_force passed 1 out of the required 1 times. Success!
  1251. test_force_with_none_down passed 1 out of the required 1 times. Success!
  1252. test_hosts passed 1 out of the required 1 times. Success!
  1253. test_subrange passed 1 out of the required 1 times. Success!
  1254. test_repaired_tracking_with_partition_deletes passed 1 out of the required 1 times. Success!
  1255. test_repaired_tracking_with_varying_sstable_sets passed 1 out of the required 1 times. Success!
  1256. test_repaired_tracking_with_mismatching_replicas passed 1 out of the required 1 times. Success!
  1257. test_preview passed 1 out of the required 1 times. Success!
  1258. test_nonexistent_table_repair passed 1 out of the required 1 times. Success!
  1259. test_anticompaction_after_normal_repair passed 1 out of the required 1 times. Success!
  1260. test_simple_sequential_repair passed 1 out of the required 1 times. Success!
  1261. test_simple_parallel_repair passed 1 out of the required 1 times. Success!
  1262. test_empty_vs_gcable_sequential_repair passed 1 out of the required 1 times. Success!
  1263. test_empty_vs_gcable_parallel_repair passed 1 out of the required 1 times. Success!
  1264. test_range_tombstone_digest_sequential_repair passed 1 out of the required 1 times. Success!
  1265. test_range_tombstone_digest_parallel_repair passed 1 out of the required 1 times. Success!
  1266. test_shadowed_cell_digest_sequential_repair passed 1 out of the required 1 times. Success!
  1267. test_shadowed_cell_digest_parallel_repair passed 1 out of the required 1 times. Success!
  1268. test_shadowed_range_tombstone_digest_sequential_repair passed 1 out of the required 1 times. Success!
  1269. test_shadowed_range_tombstone_digest_parallel_repair passed 1 out of the required 1 times. Success!
  1270. test_simple_repair_order_preserving passed 1 out of the required 1 times. Success!
  1271. test_local_dc_repair passed 1 out of the required 1 times. Success!
  1272. test_dc_repair passed 1 out of the required 1 times. Success!
  1273. test_dc_parallel_repair passed 1 out of the required 1 times. Success!
  1274. test_token_range_repair passed 1 out of the required 1 times. Success!
  1275. test_token_range_repair_with_cf passed 1 out of the required 1 times. Success!
  1276. test_partitioner_range_repair passed 1 out of the required 1 times. Success!
  1277. test_pull_repair passed 1 out of the required 1 times. Success!
  1278. test_trace_repair passed 1 out of the required 1 times. Success!
  1279. test_thread_count_repair passed 1 out of the required 1 times. Success!
  1280. test_multiple_concurrent_repairs passed 1 out of the required 1 times. Success!
  1281. test_wide_row_repair passed 1 out of the required 1 times. Success!
  1282. test_dead_sync_initiator passed 1 out of the required 1 times. Success!
  1283. test_dead_sync_participant passed 1 out of the required 1 times. Success!
  1284. test_failure_during_validation passed 1 out of the required 1 times. Success!
  1285.  
  1286. ===End Flaky Test Report===
  1287. =============================== warnings summary ===============================
  1288. native_transport_ssl_test.py::TestNativeTransportSSL::()::test_use_custom_port
  1289.   /Users/asp/dtest/src/ccm/ccmlib/node.py:584: UserWarning: Binary interface 127.0.0.1:9042 is not listening after 30 seconds, node may have failed to start.
  1290.     % (binary_itf[0], binary_itf[1]))
  1291.  
  1292. repair_tests/incremental_repair_test.py::TestIncRepair::()::test_multiple_full_repairs_lcs
  1293.   /Users/asp/dtest/src/ccm/ccmlib/node.py:584: UserWarning: Binary interface 127.0.0.2:9042 is not listening after 30 seconds, node may have failed to start.
  1294.     % (binary_itf[0], binary_itf[1]))
  1295.  
  1296. -- Docs: http://doc.pytest.org/en/latest/warnings.html
  1297. = 3 failed, 821 passed, 217 skipped, 4485 deselected, 1 xfailed, 2 warnings, 1 error in 91324.35 seconds =
RAW Paste Data
We use cookies for various purposes including analytics. By continuing to use Pastebin, you agree to our use of cookies as described in the Cookies Policy. OK, I Understand
 
Top