Not a member of Pastebin yet?
Sign Up,
it unlocks many cool features!
- "E:\Program Files\Java\Jdk1.8.0_91\bin\java" "-Dmaven.home=E:\Program Files\IntelliJ IDEA Community Edition 2016.1.4\plugins\maven\lib\maven3" "-Dclassworlds.conf=E:\Program Files\IntelliJ IDEA Community Edition 2016.1.4\plugins\maven\lib\maven3\bin\m2.conf" -Didea.launcher.port=7533 "-Didea.launcher.bin.path=E:\Program Files\IntelliJ IDEA Community Edition 2016.1.4\bin" -Dfile.encoding=UTF-8 -classpath "E:\Program Files\IntelliJ IDEA Community Edition 2016.1.4\plugins\maven\lib\maven3\boot\plexus-classworlds-2.4.jar;E:\Program Files\IntelliJ IDEA Community Edition 2016.1.4\lib\idea_rt.jar" com.intellij.rt.execution.application.AppMain org.codehaus.classworlds.Launcher -Didea.version=2016.1.4 -e clean package
- [INFO] Error stacktraces are turned on.
- [INFO] Scanning for projects...
- [INFO]
- [INFO] ------------------------------------------------------------------------
- [INFO] Building DiscordSAIL 2.2.0
- [INFO] ------------------------------------------------------------------------
- [INFO]
- [INFO] --- maven-clean-plugin:2.4.1:clean (default-clean) @ DiscordSAIL ---
- [INFO] Deleting E:\Repositories\DiscordSailv2\target
- [INFO]
- [INFO] --- maven-resources-plugin:2.5:resources (default-resources) @ DiscordSAIL ---
- [debug] execute contextualize
- [WARNING] File encoding has not been set, using platform encoding UTF-8, i.e. build is platform dependent!
- [WARNING] Using platform encoding (UTF-8 actually) to copy filtered resources, i.e. build is platform dependent!
- [INFO] Copying 2 resources
- [INFO]
- [INFO] --- maven-compiler-plugin:2.3.2:compile (default-compile) @ DiscordSAIL ---
- [WARNING] File encoding has not been set, using platform encoding UTF-8, i.e. build is platform dependent!
- [INFO] Compiling 44 source files to E:\Repositories\DiscordSailv2\target\classes
- [INFO] -------------------------------------------------------------
- [ERROR] COMPILATION ERROR :
- [INFO] -------------------------------------------------------------
- [ERROR] \Repositories\DiscordSailv2\src\main\java\Main\Globals.java:[6,30] error: package com.sun.istack.internal does not exist
- [ERROR] \Repositories\DiscordSailv2\src\main\java\Objects\GuildContentObject.java:[6,30] error: package com.sun.istack.internal does not exist
- [ERROR] \Repositories\DiscordSailv2\src\main\java\Main\Utility.java:[8,30] error: package com.sun.istack.internal does not exist
- [ERROR] \Repositories\DiscordSailv2\src\main\java\Main\Globals.java:[149,5] error: cannot find symbol
- [ERROR] \Repositories\DiscordSailv2\src\main\java\Objects\GuildContentObject.java:[12,5] error: cannot find symbol
- [ERROR] \Repositories\DiscordSailv2\src\main\java\Objects\GuildContentObject.java:[14,5] error: cannot find symbol
- [ERROR] \Repositories\DiscordSailv2\src\main\java\Objects\GuildContentObject.java:[16,5] error: cannot find symbol
- [ERROR] \Repositories\DiscordSailv2\src\main\java\Objects\GuildContentObject.java:[18,5] error: cannot find symbol
- [ERROR] \Repositories\DiscordSailv2\src\main\java\Objects\GuildContentObject.java:[20,5] error: cannot find symbol
- [ERROR] \Repositories\DiscordSailv2\src\main\java\Objects\GuildContentObject.java:[22,5] error: cannot find symbol
- [ERROR] \Repositories\DiscordSailv2\src\main\java\Main\Utility.java:[124,5] error: cannot find symbol
- [INFO] 11 errors
- [INFO] -------------------------------------------------------------
- [INFO] ------------------------------------------------------------------------
- [INFO] BUILD FAILURE
- [INFO] ------------------------------------------------------------------------
- [INFO] Total time: 1.517s
- [INFO] Finished at: Sat Jan 21 17:20:51 AEDT 2017
- [INFO] Final Memory: 12M/30M
- [INFO] ------------------------------------------------------------------------
- [ERROR] Failed to execute goal org.apache.maven.plugins:maven-compiler-plugin:2.3.2:compile (default-compile) on project DiscordSAIL: Compilation failure: Compilation failure:
- [ERROR] \Repositories\DiscordSailv2\src\main\java\Main\Globals.java:[6,30] error: package com.sun.istack.internal does not exist
- [ERROR] \Repositories\DiscordSailv2\src\main\java\Objects\GuildContentObject.java:[6,30] error: package com.sun.istack.internal does not exist
- [ERROR] \Repositories\DiscordSailv2\src\main\java\Main\Utility.java:[8,30] error: package com.sun.istack.internal does not exist
- [ERROR] \Repositories\DiscordSailv2\src\main\java\Main\Globals.java:[149,5] error: cannot find symbol
- [ERROR] \Repositories\DiscordSailv2\src\main\java\Objects\GuildContentObject.java:[12,5] error: cannot find symbol
- [ERROR] \Repositories\DiscordSailv2\src\main\java\Objects\GuildContentObject.java:[14,5] error: cannot find symbol
- [ERROR] \Repositories\DiscordSailv2\src\main\java\Objects\GuildContentObject.java:[16,5] error: cannot find symbol
- [ERROR] \Repositories\DiscordSailv2\src\main\java\Objects\GuildContentObject.java:[18,5] error: cannot find symbol
- [ERROR] \Repositories\DiscordSailv2\src\main\java\Objects\GuildContentObject.java:[20,5] error: cannot find symbol
- [ERROR] \Repositories\DiscordSailv2\src\main\java\Objects\GuildContentObject.java:[22,5] error: cannot find symbol
- [ERROR] \Repositories\DiscordSailv2\src\main\java\Main\Utility.java:[124,5] error: cannot find symbol
- [ERROR] -> [Help 1]
- org.apache.maven.lifecycle.LifecycleExecutionException: Failed to execute goal org.apache.maven.plugins:maven-compiler-plugin:2.3.2:compile (default-compile) on project DiscordSAIL: Compilation failure
- at org.apache.maven.lifecycle.internal.MojoExecutor.execute(MojoExecutor.java:213)
- at org.apache.maven.lifecycle.internal.MojoExecutor.execute(MojoExecutor.java:153)
- at org.apache.maven.lifecycle.internal.MojoExecutor.execute(MojoExecutor.java:145)
- at org.apache.maven.lifecycle.internal.LifecycleModuleBuilder.buildProject(LifecycleModuleBuilder.java:84)
- at org.apache.maven.lifecycle.internal.LifecycleModuleBuilder.buildProject(LifecycleModuleBuilder.java:59)
- at org.apache.maven.lifecycle.internal.LifecycleStarter.singleThreadedBuild(LifecycleStarter.java:183)
- at org.apache.maven.lifecycle.internal.LifecycleStarter.execute(LifecycleStarter.java:161)
- at org.apache.maven.DefaultMaven.doExecute(DefaultMaven.java:320)
- at org.apache.maven.DefaultMaven.execute(DefaultMaven.java:156)
- at org.apache.maven.cli.MavenCli.execute(MavenCli.java:537)
- at org.apache.maven.cli.MavenCli.doMain(MavenCli.java:196)
- at org.apache.maven.cli.MavenCli.main(MavenCli.java:141)
- at sun.reflect.NativeMethodAccessorImpl.invoke0(Native Method)
- at sun.reflect.NativeMethodAccessorImpl.invoke(NativeMethodAccessorImpl.java:62)
- at sun.reflect.DelegatingMethodAccessorImpl.invoke(DelegatingMethodAccessorImpl.java:43)
- at java.lang.reflect.Method.invoke(Method.java:498)
- at org.codehaus.plexus.classworlds.launcher.Launcher.launchEnhanced(Launcher.java:290)
- at org.codehaus.plexus.classworlds.launcher.Launcher.launch(Launcher.java:230)
- at org.codehaus.plexus.classworlds.launcher.Launcher.mainWithExitCode(Launcher.java:409)
- at org.codehaus.plexus.classworlds.launcher.Launcher.main(Launcher.java:352)
- at org.codehaus.classworlds.Launcher.main(Launcher.java:47)
- at sun.reflect.NativeMethodAccessorImpl.invoke0(Native Method)
- at sun.reflect.NativeMethodAccessorImpl.invoke(NativeMethodAccessorImpl.java:62)
- at sun.reflect.DelegatingMethodAccessorImpl.invoke(DelegatingMethodAccessorImpl.java:43)
- at java.lang.reflect.Method.invoke(Method.java:498)
- at com.intellij.rt.execution.application.AppMain.main(AppMain.java:144)
- Caused by: org.apache.maven.plugin.CompilationFailureException: Compilation failure
- at org.apache.maven.plugin.AbstractCompilerMojo.execute(AbstractCompilerMojo.java:656)
- at org.apache.maven.plugin.CompilerMojo.execute(CompilerMojo.java:128)
- at org.apache.maven.plugin.DefaultBuildPluginManager.executeMojo(DefaultBuildPluginManager.java:101)
- at org.apache.maven.lifecycle.internal.MojoExecutor.execute(MojoExecutor.java:209)
- ... 25 more
- [ERROR]
- [ERROR] Re-run Maven using the -X switch to enable full debug logging.
- [ERROR]
- [ERROR] For more information about the errors and possible solutions, please read the following articles:
- [ERROR] [Help 1] http://cwiki.apache.org/confluence/display/MAVEN/MojoFailureException
- Process finished with exit code 1
Advertisement
Add Comment
Please, Sign In to add comment