liuk4friends

Netdata 1.33.1 failed build log #2

Feb 27th, 2022
197
0
Never
Not a member of Pastebin yet? Sign Up, it unlocks many cool features!
Bash 183.93 KB | None | 0 0
  1. Mac-mini-di-Luca:~ admin$ curl https://my-netdata.io/kickstart.sh > /tmp/netdata-kickstart.sh && sh /tmp/netdata-kickstart.sh
  2.   % Total    % Received % Xferd  Average Speed   Time    Time     Time  Current
  3.                                  Dload  Upload   Total   Spent    Left  Speed
  4. 100 46309    0 46309    0     0   148k      0 --:--:-- --:--:-- --:--:--  147k
  5.  
  6.  --- Using /var/folders/tm/bh_rhtyj47x8b5nl3dh3cm400000gn/T/netdata-kickstart-XXXXXXXXXX.XEeyS6Bo as a temporary directory. ---
  7. Password:
  8.  --- Found an existing netdata install at /usr/local/netdata, with installation type 'kickstart-build'. ---
  9. [/var/folders/tm/bh_rhtyj47x8b5nl3dh3cm400000gn/T/netdata-kickstart-XXXXXXXXXX.XEeyS6Bo]$ sudo /usr/local/netdata/usr/libexec/netdata/netdata-updater.sh --not-running-from-cron
  10. Dom 27 Feb 2022 11:51:51 CET : INFO:  Checking if a newer version of the updater script is available.
  11. usage: date [-jnRu] [-d dst] [-r seconds] [-t west] [-v[+|-]val[ymwdHMS]] ...
  12.             [-f fmt date | [[[mm]dd]HH]MM[[cc]yy][.ss]] [+format]
  13. /usr/local/netdata/usr/libexec/netdata/netdata-updater.sh: line 356: [: : integer expression expected
  14. Dom 27 Feb 2022 11:51:51 CET : INFO:  Running on a terminal - (this script also supports running headless from crontab)
  15. Dom 27 Feb 2022 11:51:52 CET : INFO:  Current Version: 00103300100028
  16. Dom 27 Feb 2022 11:51:52 CET : INFO:  Latest Version: 00103300100078
  17. Dom 27 Feb 2022 11:51:52 CET : INFO:  Update available
  18. ./netdata-latest.tar.gz: OK
  19. /usr/local/netdata/usr/libexec/netdata/netdata-updater.sh: line 493: pidof: command not found
  20. Dom 27 Feb 2022 11:51:57 CET : INFO:  Re-installing netdata...
  21.  
  22.   ^
  23.   |.-.   .-.   .-.   .-.   .-.   .  netdata  .-.   .-.   .-.   .-.   .-.   .-
  24.   |   '-'   '-'   '-'   '-'   '-'               '-'   '-'   '-'   '-'   '-'  
  25.   +----+-----+-----+-----+-----+-----+-----+-----+-----+-----+-----+-----+--->
  26.  
  27.  --- real-time performance monitoring, done right! ---
  28.  
  29.   You are about to build and install netdata to your system.
  30.  
  31.   The build process will use /tmp for
  32.   any temporary files. You can override this by setting $TMPDIR to a
  33.   writable directory where you can execute files.
  34.  
  35.   It will be installed at these locations:
  36.  
  37.    - the daemon     at /usr/local/netdata/usr/sbin/netdata
  38.    - config files   in /usr/local/netdata/etc/netdata
  39.    - web files      in /usr/local/netdata/usr/share/netdata
  40.    - plugins        in /usr/local/netdata/usr/libexec/netdata
  41.    - cache files    in /usr/local/netdata/var/cache/netdata
  42.    - db files       in /usr/local/netdata/var/lib/netdata
  43.    - log files      in /usr/local/netdata/var/log/netdata
  44.    - pid file       at /usr/local/netdata/var/run/netdata.pid
  45.    - logrotate file at /etc/logrotate.d/netdata
  46.  
  47.   This installer allows you to change the installation path.
  48.   Press Control-C and run the same command with --help for help.
  49.  
  50.  
  51.   NOTE:
  52.   Anonymous usage stats will be collected and sent to Netdata.
  53.   To opt-out, pass --disable-telemetry option to the installer or export
  54.   the environment variable DISABLE_TELEMETRY to a non-zero or non-empty value
  55.   (e.g: export DISABLE_TELEMETRY=1).
  56.  
  57. [/var/folders/zz/zyxvpxvq6csfxvn_n0000000000000/T/netdata-updater-XXXXXXXXXX.IEZCYuie/netdata-v1.33.1-78-g9ef13f190]# curl -q -sSL --connect-timeout 10 --retry 3 --output /var/folders/zz/zyxvpxvq6csfxvn_n0000000000000/T/netdata-protobuf-XXXXXX.8Hl3OmKD/protobuf-cpp-3.17.3.tar.gz https://github.com/protocolbuffers/protobuf/releases/download/v3.17.3/protobuf-cpp-3.17.3.tar.gz
  58.  OK  
  59.  
  60. protobuf-cpp-3.17.3.tar.gz: OK
  61. [/var/folders/zz/zyxvpxvq6csfxvn_n0000000000000/T/netdata-updater-XXXXXXXXXX.IEZCYuie/netdata-v1.33.1-78-g9ef13f190]# tar --no-same-owner -xf /var/folders/zz/zyxvpxvq6csfxvn_n0000000000000/T/netdata-protobuf-XXXXXX.8Hl3OmKD/protobuf-cpp-3.17.3.tar.gz -C /var/folders/zz/zyxvpxvq6csfxvn_n0000000000000/T/netdata-protobuf-XXXXXX.8Hl3OmKD
  62.  OK  
  63.  
  64. [/var/folders/zz/zyxvpxvq6csfxvn_n0000000000000/T/netdata-protobuf-XXXXXX.8Hl3OmKD/protobuf-3.17.3]# env CFLAGS=-fPIC CXXFLAGS= LDFLAGS= ./configure --disable-shared --without-zlib --disable-dependency-tracking --with-pic
  65. checking whether to enable maintainer-specific portions of Makefiles... yes
  66. checking build system type... x86_64-apple-darwin19.6.0
  67. checking host system type... x86_64-apple-darwin19.6.0
  68. checking target system type... x86_64-apple-darwin19.6.0
  69. checking for a BSD-compatible install... /usr/bin/install -c
  70. checking whether build environment is sane... yes
  71. checking for a thread-safe mkdir -p... ./install-sh -c -d
  72. checking for gawk... no
  73. checking for mawk... no
  74. checking for nawk... no
  75. checking for awk... awk
  76. checking whether make sets $(MAKE)... yes
  77. checking whether make supports nested variables... yes
  78. checking whether UID '0' is supported by ustar format... yes
  79. checking whether GID '0' is supported by ustar format... yes
  80. checking how to create a ustar tar archive... gnutar
  81. checking whether make supports nested variables... (cached) yes
  82. checking for gcc... gcc
  83. checking whether the C compiler works... yes
  84. checking for C compiler default output file name... a.out
  85. checking for suffix of executables...
  86. checking whether we are cross compiling... no
  87. checking for suffix of object files... o
  88. checking whether we are using the GNU C compiler... yes
  89. checking whether gcc accepts -g... yes
  90. checking for gcc option to accept ISO C89... none needed
  91. checking whether gcc understands -c and -o together... yes
  92. checking whether make supports the include directive... yes (GNU style)
  93. checking dependency style of gcc... none
  94. checking for g++... g++
  95. checking whether we are using the GNU C++ compiler... yes
  96. checking whether g++ accepts -g... yes
  97. checking dependency style of g++... none
  98. checking how to run the C preprocessor... gcc -E
  99. checking for gcc... gcc
  100. checking whether we are using the GNU C compiler... (cached) yes
  101. checking whether gcc accepts -g... yes
  102. checking for gcc option to accept ISO C89... (cached) none needed
  103. checking whether gcc understands -c and -o together... (cached) yes
  104. checking dependency style of gcc... (cached) none
  105. checking how to run the C preprocessor... gcc -E
  106. checking how to run the C++ preprocessor... g++ -E
  107. checking for g++... g++
  108. checking whether we are using the GNU C++ compiler... (cached) yes
  109. checking whether g++ accepts -g... yes
  110. checking dependency style of g++... (cached) none
  111. checking how to run the C++ preprocessor... g++ -E
  112. checking for grep that handles long lines and -e... /usr/bin/grep
  113. checking for egrep... /usr/bin/grep -E
  114. checking for ANSI C header files... yes
  115. checking for sys/types.h... yes
  116. checking for sys/stat.h... yes
  117. checking for stdlib.h... yes
  118. checking for string.h... yes
  119. checking for memory.h... yes
  120. checking for strings.h... yes
  121. checking for inttypes.h... yes
  122. checking for stdint.h... yes
  123. checking for unistd.h... yes
  124. checking minix/config.h usability... no
  125. checking minix/config.h presence... no
  126. checking for minix/config.h... no
  127. checking whether it is safe to define __EXTENSIONS__... yes
  128. checking for ar... ar
  129. checking the archiver (ar) interface... ar
  130. checking for gcc... gcc
  131. checking whether we are using the GNU Objective C compiler... yes
  132. checking whether gcc accepts -g... yes
  133. checking dependency style of gcc... none
  134. checking C++ compiler flags...... use user-supplied:
  135. checking whether __SUNPRO_CC is declared... no
  136. checking how to print strings... printf
  137. checking for a sed that does not truncate output... /usr/bin/sed
  138. checking for fgrep... /usr/bin/grep -F
  139. checking for ld used by gcc... /Applications/Xcode.app/Contents/Developer/Toolchains/XcodeDefault.xctoolchain/usr/bin/ld
  140. checking if the linker (/Applications/Xcode.app/Contents/Developer/Toolchains/XcodeDefault.xctoolchain/usr/bin/ld) is GNU ld... no
  141. checking for BSD- or MS-compatible name lister (nm)... /usr/bin/nm -B
  142. checking the name lister (/usr/bin/nm -B) interface... BSD nm
  143. checking whether ln -s works... yes
  144. checking the maximum length of command line arguments... 196608
  145. checking how to convert x86_64-apple-darwin19.6.0 file names to x86_64-apple-darwin19.6.0 format... func_convert_file_noop
  146. checking how to convert x86_64-apple-darwin19.6.0 file names to toolchain format... func_convert_file_noop
  147. checking for /Applications/Xcode.app/Contents/Developer/Toolchains/XcodeDefault.xctoolchain/usr/bin/ld option to reload object files... -r
  148. checking for objdump... objdump
  149. checking how to recognize dependent libraries... pass_all
  150. checking for dlltool... no
  151. checking how to associate runtime and link libraries... printf %s\n
  152. checking for archiver @FILE support... no
  153. checking for strip... strip
  154. checking for ranlib... ranlib
  155. checking command to parse /usr/bin/nm -B output from gcc object... ok
  156. checking for sysroot... no
  157. checking for a working dd... /bin/dd
  158. checking how to truncate binary pipes... /bin/dd bs=4096 count=1
  159. checking for mt... no
  160. checking if : is a manifest tool... no
  161. checking for dsymutil... dsymutil
  162. checking for nmedit... nmedit
  163. checking for lipo... lipo
  164. checking for otool... otool
  165. checking for otool64... no
  166. checking for -single_module linker flag... yes
  167. checking for -exported_symbols_list linker flag... yes
  168. checking for -force_load linker flag... yes
  169. checking for dlfcn.h... yes
  170. checking for objdir... .libs
  171. checking if gcc supports -fno-rtti -fno-exceptions... yes
  172. checking for gcc option to produce PIC... -fno-common -DPIC
  173. checking if gcc PIC flag -fno-common -DPIC works... yes
  174. checking if gcc static flag -static works... no
  175. checking if gcc supports -c -o file.o... yes
  176. checking if gcc supports -c -o file.o... (cached) yes
  177. checking whether the gcc linker (/Applications/Xcode.app/Contents/Developer/Toolchains/XcodeDefault.xctoolchain/usr/bin/ld) supports shared libraries... yes
  178. checking dynamic linker characteristics... darwin19.6.0 dyld
  179. checking how to hardcode library paths into programs... immediate
  180. checking whether stripping libraries is possible... yes
  181. checking if libtool supports shared libraries... yes
  182. checking whether to build shared libraries... no
  183. checking whether to build static libraries... yes
  184. checking how to run the C++ preprocessor... g++ -E
  185. checking for ld used by g++... /Applications/Xcode.app/Contents/Developer/Toolchains/XcodeDefault.xctoolchain/usr/bin/ld
  186. checking if the linker (/Applications/Xcode.app/Contents/Developer/Toolchains/XcodeDefault.xctoolchain/usr/bin/ld) is GNU ld... no
  187. checking whether the g++ linker (/Applications/Xcode.app/Contents/Developer/Toolchains/XcodeDefault.xctoolchain/usr/bin/ld) supports shared libraries... yes
  188. checking for g++ option to produce PIC... -fno-common -DPIC
  189. checking if g++ PIC flag -fno-common -DPIC works... yes
  190. checking if g++ static flag -static works... no
  191. checking if g++ supports -c -o file.o... yes
  192. checking if g++ supports -c -o file.o... (cached) yes
  193. checking whether the g++ linker (/Applications/Xcode.app/Contents/Developer/Toolchains/XcodeDefault.xctoolchain/usr/bin/ld) supports shared libraries... yes
  194. checking dynamic linker characteristics... darwin19.6.0 dyld
  195. checking how to hardcode library paths into programs... immediate
  196. checking whether the linker supports version scripts... no
  197. checking for ANSI C header files... (cached) yes
  198. checking fcntl.h usability... yes
  199. checking fcntl.h presence... yes
  200. checking for fcntl.h... yes
  201. checking for inttypes.h... (cached) yes
  202. checking limits.h usability... yes
  203. checking limits.h presence... yes
  204. checking for limits.h... yes
  205. checking for stdlib.h... (cached) yes
  206. checking for unistd.h... (cached) yes
  207. checking for working memcmp... yes
  208. checking for working strtod... yes
  209. checking for ftruncate... yes
  210. checking for memset... yes
  211. checking for mkdir... yes
  212. checking for strchr... yes
  213. checking for strerror... yes
  214. checking for strtol... yes
  215. checking whether g++ supports C++11 features by default... no
  216. checking whether g++ supports C++11 features with -std=c++11... yes
  217. checking whether -latomic is needed... no
  218. checking whether gcc is Clang... yes
  219. checking whether pthreads work with "-pthread" and "-lpthread"... yes
  220. checking whether Clang needs flag to prevent "argument unused" warning when linking with -pthread... no
  221. checking for joinable pthread attribute... PTHREAD_CREATE_JOINABLE
  222. checking whether more special flags are required for pthreads... no
  223. checking for PTHREAD_PRIO_INHERIT... yes
  224. checking the location of hash_map... <unordered_map>
  225. checking whether -llog is needed... no
  226. checking that generated files are newer than configure... done
  227. configure: creating ./config.status
  228. config.status: creating Makefile
  229. config.status: creating src/Makefile
  230. config.status: creating benchmarks/Makefile
  231. config.status: creating conformance/Makefile
  232. config.status: creating protobuf.pc
  233. config.status: creating protobuf-lite.pc
  234. config.status: creating config.h
  235. config.status: executing depfiles commands
  236. config.status: executing libtool commands
  237. === configuring in third_party/googletest (/var/folders/zz/zyxvpxvq6csfxvn_n0000000000000/T/netdata-protobuf-XXXXXX.8Hl3OmKD/protobuf-3.17.3/third_party/googletest)
  238. configure: running /bin/sh ./configure --disable-option-checking '--prefix=/usr/local'  '--disable-shared' '--without-zlib' '--disable-dependency-tracking' '--with-pic' 'CFLAGS=-fPIC' 'LDFLAGS=' 'CXXFLAGS=' --cache-file=/dev/null --srcdir=.
  239. checking for a BSD-compatible install... /usr/bin/install -c
  240. checking whether build environment is sane... yes
  241. checking for a thread-safe mkdir -p... build-aux/install-sh -c -d
  242. checking for gawk... no
  243. checking for mawk... no
  244. checking for nawk... no
  245. checking for awk... awk
  246. checking whether make sets $(MAKE)... yes
  247. checking whether make supports nested variables... yes
  248. checking that generated files are newer than configure... done
  249. configure: creating ./config.status
  250. config.status: creating Makefile
  251. === configuring in googletest (/var/folders/zz/zyxvpxvq6csfxvn_n0000000000000/T/netdata-protobuf-XXXXXX.8Hl3OmKD/protobuf-3.17.3/third_party/googletest/googletest)
  252. configure: running /bin/sh ./configure --disable-option-checking '--prefix=/usr/local'  '--disable-shared' '--without-zlib' '--disable-dependency-tracking' '--with-pic' 'CFLAGS=-fPIC' 'LDFLAGS=' 'CXXFLAGS=' --cache-file=/dev/null --srcdir=.
  253. checking for a BSD-compatible install... /usr/bin/install -c
  254. checking whether build environment is sane... yes
  255. checking for a thread-safe mkdir -p... build-aux/install-sh -c -d
  256. checking for gawk... no
  257. checking for mawk... no
  258. checking for nawk... no
  259. checking for awk... awk
  260. checking whether make sets $(MAKE)... yes
  261. checking whether make supports nested variables... yes
  262. checking for gcc... gcc
  263. checking whether the C compiler works... yes
  264. checking for C compiler default output file name... a.out
  265. checking for suffix of executables...
  266. checking whether we are cross compiling... no
  267. checking for suffix of object files... o
  268. checking whether we are using the GNU C compiler... yes
  269. checking whether gcc accepts -g... yes
  270. checking for gcc option to accept ISO C89... none needed
  271. checking whether gcc understands -c and -o together... yes
  272. checking whether make supports the include directive... yes (GNU style)
  273. checking dependency style of gcc... none
  274. checking for g++... g++
  275. checking whether we are using the GNU C++ compiler... yes
  276. checking whether g++ accepts -g... yes
  277. checking dependency style of g++... none
  278. checking build system type... x86_64-apple-darwin19.6.0
  279. checking host system type... x86_64-apple-darwin19.6.0
  280. checking how to print strings... printf
  281. checking for a sed that does not truncate output... /usr/bin/sed
  282. checking for grep that handles long lines and -e... /usr/bin/grep
  283. checking for egrep... /usr/bin/grep -E
  284. checking for fgrep... /usr/bin/grep -F
  285. checking for ld used by gcc... /Applications/Xcode.app/Contents/Developer/Toolchains/XcodeDefault.xctoolchain/usr/bin/ld
  286. checking if the linker (/Applications/Xcode.app/Contents/Developer/Toolchains/XcodeDefault.xctoolchain/usr/bin/ld) is GNU ld... no
  287. checking for BSD- or MS-compatible name lister (nm)... /usr/bin/nm -B
  288. checking the name lister (/usr/bin/nm -B) interface... BSD nm
  289. checking whether ln -s works... yes
  290. checking the maximum length of command line arguments... 196608
  291. checking how to convert x86_64-apple-darwin19.6.0 file names to x86_64-apple-darwin19.6.0 format... func_convert_file_noop
  292. checking how to convert x86_64-apple-darwin19.6.0 file names to toolchain format... func_convert_file_noop
  293. checking for /Applications/Xcode.app/Contents/Developer/Toolchains/XcodeDefault.xctoolchain/usr/bin/ld option to reload object files... -r
  294. checking for objdump... objdump
  295. checking how to recognize dependent libraries... pass_all
  296. checking for dlltool... no
  297. checking how to associate runtime and link libraries... printf %s\n
  298. checking for ar... ar
  299. checking for archiver @FILE support... no
  300. checking for strip... strip
  301. checking for ranlib... ranlib
  302. checking command to parse /usr/bin/nm -B output from gcc object... ok
  303. checking for sysroot... no
  304. checking for a working dd... /bin/dd
  305. checking how to truncate binary pipes... /bin/dd bs=4096 count=1
  306. checking for mt... no
  307. checking if : is a manifest tool... no
  308. checking for dsymutil... dsymutil
  309. checking for nmedit... nmedit
  310. checking for lipo... lipo
  311. checking for otool... otool
  312. checking for otool64... no
  313. checking for -single_module linker flag... yes
  314. checking for -exported_symbols_list linker flag... yes
  315. checking for -force_load linker flag... yes
  316. checking how to run the C preprocessor... gcc -E
  317. checking for ANSI C header files... yes
  318. checking for sys/types.h... yes
  319. checking for sys/stat.h... yes
  320. checking for stdlib.h... yes
  321. checking for string.h... yes
  322. checking for memory.h... yes
  323. checking for strings.h... yes
  324. checking for inttypes.h... yes
  325. checking for stdint.h... yes
  326. checking for unistd.h... yes
  327. checking for dlfcn.h... yes
  328. checking for objdir... .libs
  329. checking if gcc supports -fno-rtti -fno-exceptions... yes
  330. checking for gcc option to produce PIC... -fno-common -DPIC
  331. checking if gcc PIC flag -fno-common -DPIC works... yes
  332. checking if gcc static flag -static works... no
  333. checking if gcc supports -c -o file.o... yes
  334. checking if gcc supports -c -o file.o... (cached) yes
  335. checking whether the gcc linker (/Applications/Xcode.app/Contents/Developer/Toolchains/XcodeDefault.xctoolchain/usr/bin/ld) supports shared libraries... yes
  336. checking dynamic linker characteristics... darwin19.6.0 dyld
  337. checking how to hardcode library paths into programs... immediate
  338. checking whether stripping libraries is possible... yes
  339. checking if libtool supports shared libraries... yes
  340. checking whether to build shared libraries... no
  341. checking whether to build static libraries... yes
  342. checking how to run the C++ preprocessor... g++ -E
  343. checking for ld used by g++... /Applications/Xcode.app/Contents/Developer/Toolchains/XcodeDefault.xctoolchain/usr/bin/ld
  344. checking if the linker (/Applications/Xcode.app/Contents/Developer/Toolchains/XcodeDefault.xctoolchain/usr/bin/ld) is GNU ld... no
  345. checking whether the g++ linker (/Applications/Xcode.app/Contents/Developer/Toolchains/XcodeDefault.xctoolchain/usr/bin/ld) supports shared libraries... yes
  346. checking for g++ option to produce PIC... -fno-common -DPIC
  347. checking if g++ PIC flag -fno-common -DPIC works... yes
  348. checking if g++ static flag -static works... no
  349. checking if g++ supports -c -o file.o... yes
  350. checking if g++ supports -c -o file.o... (cached) yes
  351. checking whether the g++ linker (/Applications/Xcode.app/Contents/Developer/Toolchains/XcodeDefault.xctoolchain/usr/bin/ld) supports shared libraries... yes
  352. checking dynamic linker characteristics... darwin19.6.0 dyld
  353. checking how to hardcode library paths into programs... immediate
  354. checking for python... /usr/bin/python
  355. checking for the pthreads library -lpthreads... no
  356. checking whether pthreads work without any flags... yes
  357. checking for joinable pthread attribute... PTHREAD_CREATE_JOINABLE
  358. checking if more special flags are required for pthreads... -D_THREAD_SAFE
  359. checking whether to check for GCC pthread/shared inconsistencies... no
  360. checking that generated files are newer than configure... done
  361. configure: creating ./config.status
  362. config.status: creating Makefile
  363. config.status: creating scripts/gtest-config
  364. config.status: creating build-aux/config.h
  365. config.status: executing depfiles commands
  366. config.status: executing libtool commands
  367. === configuring in googlemock (/var/folders/zz/zyxvpxvq6csfxvn_n0000000000000/T/netdata-protobuf-XXXXXX.8Hl3OmKD/protobuf-3.17.3/third_party/googletest/googlemock)
  368. configure: running /bin/sh ./configure --disable-option-checking '--prefix=/usr/local'  '--disable-shared' '--without-zlib' '--disable-dependency-tracking' '--with-pic' 'CFLAGS=-fPIC' 'LDFLAGS=' 'CXXFLAGS=' --cache-file=/dev/null --srcdir=.
  369. checking for a BSD-compatible install... /usr/bin/install -c
  370. checking whether build environment is sane... yes
  371. checking for a thread-safe mkdir -p... build-aux/install-sh -c -d
  372. checking for gawk... no
  373. checking for mawk... no
  374. checking for nawk... no
  375. checking for awk... awk
  376. checking whether make sets $(MAKE)... yes
  377. checking whether make supports nested variables... yes
  378. checking for gcc... gcc
  379. checking whether the C compiler works... yes
  380. checking for C compiler default output file name... a.out
  381. checking for suffix of executables...
  382. checking whether we are cross compiling... no
  383. checking for suffix of object files... o
  384. checking whether we are using the GNU C compiler... yes
  385. checking whether gcc accepts -g... yes
  386. checking for gcc option to accept ISO C89... none needed
  387. checking whether gcc understands -c and -o together... yes
  388. checking whether make supports the include directive... yes (GNU style)
  389. checking dependency style of gcc... none
  390. checking for g++... g++
  391. checking whether we are using the GNU C++ compiler... yes
  392. checking whether g++ accepts -g... yes
  393. checking dependency style of g++... none
  394. checking build system type... x86_64-apple-darwin19.6.0
  395. checking host system type... x86_64-apple-darwin19.6.0
  396. checking how to print strings... printf
  397. checking for a sed that does not truncate output... /usr/bin/sed
  398. checking for grep that handles long lines and -e... /usr/bin/grep
  399. checking for egrep... /usr/bin/grep -E
  400. checking for fgrep... /usr/bin/grep -F
  401. checking for ld used by gcc... /Applications/Xcode.app/Contents/Developer/Toolchains/XcodeDefault.xctoolchain/usr/bin/ld
  402. checking if the linker (/Applications/Xcode.app/Contents/Developer/Toolchains/XcodeDefault.xctoolchain/usr/bin/ld) is GNU ld... no
  403. checking for BSD- or MS-compatible name lister (nm)... /usr/bin/nm -B
  404. checking the name lister (/usr/bin/nm -B) interface... BSD nm
  405. checking whether ln -s works... yes
  406. checking the maximum length of command line arguments... 196608
  407. checking how to convert x86_64-apple-darwin19.6.0 file names to x86_64-apple-darwin19.6.0 format... func_convert_file_noop
  408. checking how to convert x86_64-apple-darwin19.6.0 file names to toolchain format... func_convert_file_noop
  409. checking for /Applications/Xcode.app/Contents/Developer/Toolchains/XcodeDefault.xctoolchain/usr/bin/ld option to reload object files... -r
  410. checking for objdump... objdump
  411. checking how to recognize dependent libraries... pass_all
  412. checking for dlltool... no
  413. checking how to associate runtime and link libraries... printf %s\n
  414. checking for ar... ar
  415. checking for archiver @FILE support... no
  416. checking for strip... strip
  417. checking for ranlib... ranlib
  418. checking command to parse /usr/bin/nm -B output from gcc object... ok
  419. checking for sysroot... no
  420. checking for a working dd... /bin/dd
  421. checking how to truncate binary pipes... /bin/dd bs=4096 count=1
  422. checking for mt... no
  423. checking if : is a manifest tool... no
  424. checking for dsymutil... dsymutil
  425. checking for nmedit... nmedit
  426. checking for lipo... lipo
  427. checking for otool... otool
  428. checking for otool64... no
  429. checking for -single_module linker flag... yes
  430. checking for -exported_symbols_list linker flag... yes
  431. checking for -force_load linker flag... yes
  432. checking how to run the C preprocessor... gcc -E
  433. checking for ANSI C header files... yes
  434. checking for sys/types.h... yes
  435. checking for sys/stat.h... yes
  436. checking for stdlib.h... yes
  437. checking for string.h... yes
  438. checking for memory.h... yes
  439. checking for strings.h... yes
  440. checking for inttypes.h... yes
  441. checking for stdint.h... yes
  442. checking for unistd.h... yes
  443. checking for dlfcn.h... yes
  444. checking for objdir... .libs
  445. checking if gcc supports -fno-rtti -fno-exceptions... yes
  446. checking for gcc option to produce PIC... -fno-common -DPIC
  447. checking if gcc PIC flag -fno-common -DPIC works... yes
  448. checking if gcc static flag -static works... no
  449. checking if gcc supports -c -o file.o... yes
  450. checking if gcc supports -c -o file.o... (cached) yes
  451. checking whether the gcc linker (/Applications/Xcode.app/Contents/Developer/Toolchains/XcodeDefault.xctoolchain/usr/bin/ld) supports shared libraries... yes
  452. checking dynamic linker characteristics... darwin19.6.0 dyld
  453. checking how to hardcode library paths into programs... immediate
  454. checking whether stripping libraries is possible... yes
  455. checking if libtool supports shared libraries... yes
  456. checking whether to build shared libraries... no
  457. checking whether to build static libraries... yes
  458. checking how to run the C++ preprocessor... g++ -E
  459. checking for ld used by g++... /Applications/Xcode.app/Contents/Developer/Toolchains/XcodeDefault.xctoolchain/usr/bin/ld
  460. checking if the linker (/Applications/Xcode.app/Contents/Developer/Toolchains/XcodeDefault.xctoolchain/usr/bin/ld) is GNU ld... no
  461. checking whether the g++ linker (/Applications/Xcode.app/Contents/Developer/Toolchains/XcodeDefault.xctoolchain/usr/bin/ld) supports shared libraries... yes
  462. checking for g++ option to produce PIC... -fno-common -DPIC
  463. checking if g++ PIC flag -fno-common -DPIC works... yes
  464. checking if g++ static flag -static works... no
  465. checking if g++ supports -c -o file.o... yes
  466. checking if g++ supports -c -o file.o... (cached) yes
  467. checking whether the g++ linker (/Applications/Xcode.app/Contents/Developer/Toolchains/XcodeDefault.xctoolchain/usr/bin/ld) supports shared libraries... yes
  468. checking dynamic linker characteristics... darwin19.6.0 dyld
  469. checking how to hardcode library paths into programs... immediate
  470. checking for python... /usr/bin/python
  471. checking for the pthreads library -lpthreads... no
  472. checking whether pthreads work without any flags... yes
  473. checking for joinable pthread attribute... PTHREAD_CREATE_JOINABLE
  474. checking if more special flags are required for pthreads... -D_THREAD_SAFE
  475. checking whether to check for GCC pthread/shared inconsistencies... no
  476. checking for gtest-config... no
  477. checking that generated files are newer than configure... done
  478. configure: creating ./config.status
  479. config.status: creating Makefile
  480. config.status: creating scripts/gmock-config
  481. config.status: creating build-aux/config.h
  482. config.status: executing depfiles commands
  483. config.status: executing libtool commands
  484.  OK  
  485.  
  486. [/var/folders/zz/zyxvpxvq6csfxvn_n0000000000000/T/netdata-protobuf-XXXXXX.8Hl3OmKD/protobuf-3.17.3]# env CFLAGS=-fPIC CXXFLAGS= LDFLAGS= make -j4
  487. /Applications/Xcode.app/Contents/Developer/usr/bin/make  all-recursive
  488. Making all in .
  489. make[2]: Nothing to be done for `all-am'.
  490. Making all in src
  491.  CXX      google/protobuf/compiler/code_generator.lo
  492.  CXX      google/protobuf/compiler/command_line_interface.lo
  493.  CXX      google/protobuf/compiler/plugin.lo
  494.  CXX      google/protobuf/compiler/plugin.pb.lo
  495.  CXX      google/protobuf/compiler/subprocess.lo
  496.  CXX      google/protobuf/compiler/zip_writer.lo
  497.  CXX      google/protobuf/compiler/main.o
  498.  CXX      google/protobuf/stubs/bytestream.lo
  499.  CXX      google/protobuf/stubs/common.lo
  500.  CXX      google/protobuf/stubs/int128.lo
  501.  CXX      google/protobuf/io/io_win32.lo
  502.  CXX      google/protobuf/stubs/status.lo
  503.  CXX      google/protobuf/stubs/statusor.lo
  504.  CXX      google/protobuf/stubs/stringpiece.lo
  505.  CXX      google/protobuf/stubs/stringprintf.lo
  506.  CXX      google/protobuf/stubs/structurally_valid.lo
  507.  CXX      google/protobuf/stubs/strutil.lo
  508.  CXX      google/protobuf/stubs/time.lo
  509.  CXX      google/protobuf/any_lite.lo
  510.  CXX      google/protobuf/arena.lo
  511.  CXX      google/protobuf/arenastring.lo
  512.  CXX      google/protobuf/extension_set.lo
  513.  CXX      google/protobuf/field_access_listener.lo
  514.  CXX      google/protobuf/generated_enum_util.lo
  515.  CXX      google/protobuf/generated_message_util.lo
  516.  CXX      google/protobuf/generated_message_table_driven_lite.lo
  517.  CXX      google/protobuf/implicit_weak_message.lo
  518.  CXX      google/protobuf/map.lo
  519.  CXX      google/protobuf/message_lite.lo
  520.  CXX      google/protobuf/parse_context.lo
  521.  CXX      google/protobuf/repeated_field.lo
  522.  CXX      google/protobuf/wire_format_lite.lo
  523.  CXX      google/protobuf/io/coded_stream.lo
  524.  CXX      google/protobuf/io/strtod.lo
  525.  CXX      google/protobuf/io/zero_copy_stream.lo
  526.  CXX      google/protobuf/io/zero_copy_stream_impl.lo
  527.  CXX      google/protobuf/io/zero_copy_stream_impl_lite.lo
  528.  CXX      google/protobuf/any.pb.lo
  529.  CXX      google/protobuf/api.pb.lo
  530.  CXX      google/protobuf/any.lo
  531.  CXX      google/protobuf/descriptor.lo
  532.  CXX      google/protobuf/descriptor_database.lo
  533.  CXX      google/protobuf/descriptor.pb.lo
  534.  CXX      google/protobuf/duration.pb.lo
  535.  CXX      google/protobuf/dynamic_message.lo
  536.  CXX      google/protobuf/empty.pb.lo
  537.  CXX      google/protobuf/extension_set_heavy.lo
  538.  CXX      google/protobuf/field_mask.pb.lo
  539.  CXX      google/protobuf/generated_message_reflection.lo
  540.  CXX      google/protobuf/generated_message_table_driven.lo
  541.  CXX      google/protobuf/map_field.lo
  542.  CXX      google/protobuf/message.lo
  543.  CXX      google/protobuf/reflection_ops.lo
  544.  CXX      google/protobuf/service.lo
  545.  CXX      google/protobuf/source_context.pb.lo
  546.  CXX      google/protobuf/struct.pb.lo
  547.  CXX      google/protobuf/stubs/substitute.lo
  548.  CXX      google/protobuf/text_format.lo
  549.  CXX      google/protobuf/timestamp.pb.lo
  550.  CXX      google/protobuf/type.pb.lo
  551.  CXX      google/protobuf/unknown_field_set.lo
  552.  CXX      google/protobuf/wire_format.lo
  553.  CXX      google/protobuf/wrappers.pb.lo
  554.  CXX      google/protobuf/io/gzip_stream.lo
  555.  CXX      google/protobuf/io/printer.lo
  556.  CXX      google/protobuf/io/tokenizer.lo
  557.  CXX      google/protobuf/compiler/importer.lo
  558.  CXX      google/protobuf/compiler/parser.lo
  559.  CXX      google/protobuf/util/delimited_message_util.lo
  560.  CXX      google/protobuf/util/field_comparator.lo
  561.  CXX      google/protobuf/util/field_mask_util.lo
  562.  CXX      google/protobuf/util/internal/datapiece.lo
  563.  CXX      google/protobuf/util/internal/default_value_objectwriter.lo
  564.  CXX      google/protobuf/util/internal/error_listener.lo
  565.  CXX      google/protobuf/util/internal/field_mask_utility.lo
  566.  CXX      google/protobuf/util/internal/json_escaping.lo
  567.  CXX      google/protobuf/util/internal/json_objectwriter.lo
  568.  CXX      google/protobuf/util/internal/json_stream_parser.lo
  569.  CXX      google/protobuf/util/internal/object_writer.lo
  570.  CXX      google/protobuf/util/internal/protostream_objectsource.lo
  571.  CXX      google/protobuf/util/internal/protostream_objectwriter.lo
  572.  CXX      google/protobuf/util/internal/proto_writer.lo
  573.  CXX      google/protobuf/util/internal/type_info.lo
  574.  CXX      google/protobuf/util/internal/type_info_test_helper.lo
  575.  CXX      google/protobuf/util/internal/utility.lo
  576.  CXX      google/protobuf/util/json_util.lo
  577.  CXX      google/protobuf/util/message_differencer.lo
  578.  CXX      google/protobuf/util/time_util.lo
  579.  CXX      google/protobuf/util/type_resolver_util.lo
  580.  CXX      google/protobuf/compiler/cpp/cpp_enum.lo
  581.  CXX      google/protobuf/compiler/cpp/cpp_enum_field.lo
  582.  CXX      google/protobuf/compiler/cpp/cpp_extension.lo
  583.  CXX      google/protobuf/compiler/cpp/cpp_field.lo
  584.  CXX      google/protobuf/compiler/cpp/cpp_file.lo
  585.  CXX      google/protobuf/compiler/cpp/cpp_generator.lo
  586.  CXX      google/protobuf/compiler/cpp/cpp_helpers.lo
  587.  CXX      google/protobuf/compiler/cpp/cpp_map_field.lo
  588.  CXX      google/protobuf/compiler/cpp/cpp_message.lo
  589.  CXX      google/protobuf/compiler/cpp/cpp_message_field.lo
  590. google/protobuf/compiler/cpp/cpp_helpers.cc:173:6: warning: function 'Base63Char' is not needed and will not be emitted
  591.      [-Wunneeded-internal-declaration]
  592. char Base63Char(int value) {
  593.     ^
  594.  CXX      google/protobuf/compiler/cpp/cpp_padding_optimizer.lo
  595. 1 warning generated.
  596.  CXX      google/protobuf/compiler/cpp/cpp_parse_function_generator.lo
  597.  CXX      google/protobuf/compiler/cpp/cpp_primitive_field.lo
  598.  CXX      google/protobuf/compiler/cpp/cpp_service.lo
  599.  CXX      google/protobuf/compiler/cpp/cpp_string_field.lo
  600.  CXX      google/protobuf/compiler/java/java_context.lo
  601.  CXX      google/protobuf/compiler/java/java_enum.lo
  602.  CXX      google/protobuf/compiler/java/java_enum_lite.lo
  603.  CXX      google/protobuf/compiler/java/java_enum_field.lo
  604.  CXX      google/protobuf/compiler/java/java_enum_field_lite.lo
  605.  CXX      google/protobuf/compiler/java/java_extension.lo
  606.  CXX      google/protobuf/compiler/java/java_extension_lite.lo
  607.  CXX      google/protobuf/compiler/java/java_field.lo
  608.  CXX      google/protobuf/compiler/java/java_file.lo
  609.  CXX      google/protobuf/compiler/java/java_generator.lo
  610. In file included from google/protobuf/compiler/java/java_field.cc:45:
  611. ./google/protobuf/compiler/java/java_map_field.h:68:15: warning: 'GetBoxedType' overrides a member function but is not
  612.      marked 'override' [-Winconsistent-missing-override]
  613.  std::string GetBoxedType() const;
  614.              ^
  615. ./google/protobuf/compiler/java/java_field.h:92:23: note: overridden virtual function is here
  616.  virtual std::string GetBoxedType() const = 0;
  617.                      ^
  618.  CXX      google/protobuf/compiler/java/java_generator_factory.lo
  619. 1 warning generated.
  620.  CXX      google/protobuf/compiler/java/java_helpers.lo
  621.  CXX      google/protobuf/compiler/java/java_kotlin_generator.lo
  622. In file included from google/protobuf/compiler/java/java_generator_factory.cc:42:
  623. ./google/protobuf/compiler/java/java_message_lite.h:53:16: warning: 'Generate' overrides a member function but is not
  624.      marked 'override' [-Winconsistent-missing-override]
  625.  virtual void Generate(io::Printer* printer);
  626.               ^
  627. ./google/protobuf/compiler/java/java_message.h:79:16: note: overridden virtual function is here
  628.  virtual void Generate(io::Printer* printer) = 0;
  629.               ^
  630. In file included from google/protobuf/compiler/java/java_generator_factory.cc:42:
  631. ./google/protobuf/compiler/java/java_message_lite.h:54:16: warning: 'GenerateInterface' overrides a member function but is
  632.      not marked 'override' [-Winconsistent-missing-override]
  633.  virtual void GenerateInterface(io::Printer* printer);
  634.               ^
  635. ./google/protobuf/compiler/java/java_message.h:83:16: note: overridden virtual function is here
  636.  virtual void GenerateInterface(io::Printer* printer) = 0;
  637.               ^
  638. In file included from google/protobuf/compiler/java/java_generator_factory.cc:42:
  639. ./google/protobuf/compiler/java/java_message_lite.h:55:16: warning: 'GenerateExtensionRegistrationCode' overrides a member
  640.      function but is not marked 'override' [-Winconsistent-missing-override]
  641.  virtual void GenerateExtensionRegistrationCode(io::Printer* printer);
  642.               ^
  643. ./google/protobuf/compiler/java/java_message.h:87:16: note: overridden virtual function is here
  644.  virtual void GenerateExtensionRegistrationCode(io::Printer* printer) = 0;
  645.               ^
  646. In file included from google/protobuf/compiler/java/java_generator_factory.cc:42:
  647. ./google/protobuf/compiler/java/java_message_lite.h:56:16: warning: 'GenerateStaticVariables' overrides a member function
  648.      but is not marked 'override' [-Winconsistent-missing-override]
  649.  virtual void GenerateStaticVariables(io::Printer* printer,
  650.               ^
  651. ./google/protobuf/compiler/java/java_message.h:71:16: note: overridden virtual function is here
  652.  virtual void GenerateStaticVariables(io::Printer* printer,
  653.               ^
  654. In file included from google/protobuf/compiler/java/java_generator_factory.cc:42:
  655. ./google/protobuf/compiler/java/java_message_lite.h:58:15: warning: 'GenerateStaticVariableInitializers' overrides a member
  656.      function but is not marked 'override' [-Winconsistent-missing-override]
  657.  virtual int GenerateStaticVariableInitializers(io::Printer* printer);
  658.              ^
  659. ./google/protobuf/compiler/java/java_message.h:76:15: note: overridden virtual function is here
  660.  virtual int GenerateStaticVariableInitializers(io::Printer* printer) = 0;
  661.              ^
  662. 5 warnings generated.
  663.  CXX      google/protobuf/compiler/java/java_map_field.lo
  664.  CXX      google/protobuf/compiler/java/java_map_field_lite.lo
  665.  CXX      google/protobuf/compiler/java/java_message.lo
  666. In file included from google/protobuf/compiler/java/java_map_field.cc:31:
  667. ./google/protobuf/compiler/java/java_map_field.h:68:15: warning: 'GetBoxedType' overrides a member function but is not
  668.      marked 'override' [-Winconsistent-missing-override]
  669.  std::string GetBoxedType() const;
  670.              ^
  671. ./google/protobuf/compiler/java/java_field.h:92:23: note: overridden virtual function is here
  672.  virtual std::string GetBoxedType() const = 0;
  673.                      ^
  674.  CXX      google/protobuf/compiler/java/java_message_lite.lo
  675. 1 warning generated.
  676.  CXX      google/protobuf/compiler/java/java_message_builder.lo
  677.  CXX      google/protobuf/compiler/java/java_message_builder_lite.lo
  678. In file included from google/protobuf/compiler/java/java_message_lite.cc:35:
  679. ./google/protobuf/compiler/java/java_message_lite.h:53:16: warning: 'Generate' overrides a member function but is not
  680.      marked 'override' [-Winconsistent-missing-override]
  681.  virtual void Generate(io::Printer* printer);
  682.               ^
  683. ./google/protobuf/compiler/java/java_message.h:79:16: note: overridden virtual function is here
  684.  virtual void Generate(io::Printer* printer) = 0;
  685.               ^
  686. In file included from google/protobuf/compiler/java/java_message_lite.cc:35:
  687. ./google/protobuf/compiler/java/java_message_lite.h:54:16: warning: 'GenerateInterface' overrides a member function but is
  688.      not marked 'override' [-Winconsistent-missing-override]
  689.  virtual void GenerateInterface(io::Printer* printer);
  690.               ^
  691. ./google/protobuf/compiler/java/java_message.h:83:16: note: overridden virtual function is here
  692.  virtual void GenerateInterface(io::Printer* printer) = 0;
  693.               ^
  694. In file included from google/protobuf/compiler/java/java_message_lite.cc:35:
  695. ./google/protobuf/compiler/java/java_message_lite.h:55:16: warning: 'GenerateExtensionRegistrationCode' overrides a member
  696.      function but is not marked 'override' [-Winconsistent-missing-override]
  697.  virtual void GenerateExtensionRegistrationCode(io::Printer* printer);
  698.               ^
  699. ./google/protobuf/compiler/java/java_message.h:87:16: note: overridden virtual function is here
  700.  virtual void GenerateExtensionRegistrationCode(io::Printer* printer) = 0;
  701.               ^
  702. In file included from google/protobuf/compiler/java/java_message_lite.cc:35:
  703. ./google/protobuf/compiler/java/java_message_lite.h:56:16: warning: 'GenerateStaticVariables' overrides a member function
  704.      but is not marked 'override' [-Winconsistent-missing-override]
  705.  virtual void GenerateStaticVariables(io::Printer* printer,
  706.               ^
  707. ./google/protobuf/compiler/java/java_message.h:71:16: note: overridden virtual function is here
  708.  virtual void GenerateStaticVariables(io::Printer* printer,
  709.               ^
  710. In file included from google/protobuf/compiler/java/java_message_lite.cc:35:
  711. ./google/protobuf/compiler/java/java_message_lite.h:58:15: warning: 'GenerateStaticVariableInitializers' overrides a member
  712.      function but is not marked 'override' [-Winconsistent-missing-override]
  713.  virtual int GenerateStaticVariableInitializers(io::Printer* printer);
  714.              ^
  715. ./google/protobuf/compiler/java/java_message.h:76:15: note: overridden virtual function is here
  716.  virtual int GenerateStaticVariableInitializers(io::Printer* printer) = 0;
  717.              ^
  718.  CXX      google/protobuf/compiler/java/java_message_field.lo
  719. 5 warnings generated.
  720.  CXX      google/protobuf/compiler/java/java_message_field_lite.lo
  721.  CXX      google/protobuf/compiler/java/java_name_resolver.lo
  722.  CXX      google/protobuf/compiler/java/java_primitive_field.lo
  723.  CXX      google/protobuf/compiler/java/java_primitive_field_lite.lo
  724.  CXX      google/protobuf/compiler/java/java_shared_code_generator.lo
  725.  CXX      google/protobuf/compiler/java/java_service.lo
  726.  CXX      google/protobuf/compiler/java/java_string_field.lo
  727.  CXX      google/protobuf/compiler/java/java_string_field_lite.lo
  728.  CXX      google/protobuf/compiler/java/java_doc_comment.lo
  729.  CXX      google/protobuf/compiler/js/js_generator.lo
  730.  CXX      google/protobuf/compiler/js/well_known_types_embed.lo
  731.  CXX      google/protobuf/compiler/objectivec/objectivec_enum.lo
  732.  CXX      google/protobuf/compiler/objectivec/objectivec_enum_field.lo
  733.  CXX      google/protobuf/compiler/objectivec/objectivec_extension.lo
  734.  CXX      google/protobuf/compiler/objectivec/objectivec_field.lo
  735. google/protobuf/compiler/js/js_generator.cc:97:6: warning: unused function 'StrEndsWith' [-Wunused-function]
  736. bool StrEndsWith(StringPiece sp, StringPiece x) {
  737.     ^
  738.  CXX      google/protobuf/compiler/objectivec/objectivec_file.lo
  739.  CXX      google/protobuf/compiler/objectivec/objectivec_generator.lo
  740. 1 warning generated.
  741.  CXX      google/protobuf/compiler/objectivec/objectivec_helpers.lo
  742.  CXX      google/protobuf/compiler/objectivec/objectivec_map_field.lo
  743.  CXX      google/protobuf/compiler/objectivec/objectivec_message.lo
  744.  CXX      google/protobuf/compiler/objectivec/objectivec_message_field.lo
  745.  CXX      google/protobuf/compiler/objectivec/objectivec_oneof.lo
  746.  CXX      google/protobuf/compiler/objectivec/objectivec_primitive_field.lo
  747.  CXX      google/protobuf/compiler/php/php_generator.lo
  748.  CXX      google/protobuf/compiler/python/python_generator.lo
  749.  CXX      google/protobuf/compiler/ruby/ruby_generator.lo
  750.  CXX      google/protobuf/compiler/csharp/csharp_doc_comment.lo
  751.  CXX      google/protobuf/compiler/csharp/csharp_enum.lo
  752.  CXX      google/protobuf/compiler/csharp/csharp_enum_field.lo
  753.  CXX      google/protobuf/compiler/csharp/csharp_field_base.lo
  754.  CXX      google/protobuf/compiler/csharp/csharp_generator.lo
  755.  CXX      google/protobuf/compiler/csharp/csharp_helpers.lo
  756.  CXX      google/protobuf/compiler/csharp/csharp_map_field.lo
  757.  CXX      google/protobuf/compiler/csharp/csharp_message.lo
  758.  CXX      google/protobuf/compiler/csharp/csharp_message_field.lo
  759.  CXX      google/protobuf/compiler/csharp/csharp_primitive_field.lo
  760.  CXX      google/protobuf/compiler/csharp/csharp_reflection_class.lo
  761.  CXX      google/protobuf/compiler/csharp/csharp_repeated_enum_field.lo
  762.  CXX      google/protobuf/compiler/csharp/csharp_repeated_message_field.lo
  763.  CXX      google/protobuf/compiler/csharp/csharp_repeated_primitive_field.lo
  764.  CXX      google/protobuf/compiler/csharp/csharp_source_generator_base.lo
  765.  CXX      google/protobuf/compiler/csharp/csharp_wrapper_field.lo
  766.  CXXLD    libprotobuf-lite.la
  767. /Applications/Xcode.app/Contents/Developer/Toolchains/XcodeDefault.xctoolchain/usr/bin/ranlib: file: .libs/libprotobuf-lite.a(io_win32.o) has no symbols
  768. /Applications/Xcode.app/Contents/Developer/Toolchains/XcodeDefault.xctoolchain/usr/bin/ranlib: file: .libs/libprotobuf-lite.a(io_win32.o) has no symbols
  769.  CXXLD    libprotobuf.la
  770. /Applications/Xcode.app/Contents/Developer/Toolchains/XcodeDefault.xctoolchain/usr/bin/ranlib: file: .libs/libprotobuf.a(io_win32.o) has no symbols
  771. /Applications/Xcode.app/Contents/Developer/Toolchains/XcodeDefault.xctoolchain/usr/bin/ranlib: file: .libs/libprotobuf.a(gzip_stream.o) has no symbols
  772. /Applications/Xcode.app/Contents/Developer/Toolchains/XcodeDefault.xctoolchain/usr/bin/ranlib: file: .libs/libprotobuf.a(error_listener.o) has no symbols
  773. /Applications/Xcode.app/Contents/Developer/Toolchains/XcodeDefault.xctoolchain/usr/bin/ranlib: file: .libs/libprotobuf.a(io_win32.o) has no symbols
  774. /Applications/Xcode.app/Contents/Developer/Toolchains/XcodeDefault.xctoolchain/usr/bin/ranlib: file: .libs/libprotobuf.a(gzip_stream.o) has no symbols
  775. /Applications/Xcode.app/Contents/Developer/Toolchains/XcodeDefault.xctoolchain/usr/bin/ranlib: file: .libs/libprotobuf.a(error_listener.o) has no symbols
  776. In file included from google/protobuf/compiler/csharp/csharp_source_generator_base.cc:39:
  777. ./google/protobuf/compiler/csharp/csharp_source_generator_base.h:62:25: warning: private field 'descriptor_' is not used
  778.      [-Wunused-private-field]
  779.  const FileDescriptor* descriptor_;
  780.                        ^
  781. 1 warning generated.
  782.  CXXLD    libprotoc.la
  783.  CXXLD    protoc
  784. OK  
  785.  
  786. [/var/folders/zz/zyxvpxvq6csfxvn_n0000000000000/T/netdata-updater-XXXXXXXXXX.IEZCYuie/netdata-v1.33.1-78-g9ef13f190]# mkdir -p /var/folders/zz/zyxvpxvq6csfxvn_n0000000000000/T/netdata-updater-XXXXXXXXXX.IEZCYuie/netdata-v1.33.1-78-g9ef13f190/externaldeps/protobuf
  787. OK  
  788.  
  789. [/var/folders/zz/zyxvpxvq6csfxvn_n0000000000000/T/netdata-updater-XXXXXXXXXX.IEZCYuie/netdata-v1.33.1-78-g9ef13f190]# cp -a /var/folders/zz/zyxvpxvq6csfxvn_n0000000000000/T/netdata-protobuf-XXXXXX.8Hl3OmKD/protobuf-3.17.3/src /var/folders/zz/zyxvpxvq6csfxvn_n0000000000000/T/netdata-updater-XXXXXXXXXX.IEZCYuie/netdata-v1.33.1-78-g9ef13f190/externaldeps/protobuf
  790. OK  
  791.  
  792. OK  protobuf built and prepared.
  793.  
  794. --- /usr/include/Judy.h does not exist, but we need libJudy, building our own copy ---
  795. --- Prepare libJudy ---
  796. [/var/folders/zz/zyxvpxvq6csfxvn_n0000000000000/T/netdata-updater-XXXXXXXXXX.IEZCYuie/netdata-v1.33.1-78-g9ef13f190]# curl -q -sSL --connect-timeout 10 --retry 3 --output /var/folders/zz/zyxvpxvq6csfxvn_n0000000000000/T/netdata-judy-XXXXXX.Zd3J08rf/v1.0.5-netdata2.tar.gz https://github.com/netdata/libjudy/archive/v1.0.5-netdata2.tar.gz
  797. OK  
  798.  
  799. v1.0.5-netdata2.tar.gz: OK
  800. [/var/folders/zz/zyxvpxvq6csfxvn_n0000000000000/T/netdata-updater-XXXXXXXXXX.IEZCYuie/netdata-v1.33.1-78-g9ef13f190]# tar --no-same-owner -xf /var/folders/zz/zyxvpxvq6csfxvn_n0000000000000/T/netdata-judy-XXXXXX.Zd3J08rf/v1.0.5-netdata2.tar.gz -C /var/folders/zz/zyxvpxvq6csfxvn_n0000000000000/T/netdata-judy-XXXXXX.Zd3J08rf
  801. OK  
  802.  
  803. [/var/folders/zz/zyxvpxvq6csfxvn_n0000000000000/T/netdata-judy-XXXXXX.Zd3J08rf/libjudy-1.0.5-netdata2]# env CFLAGS=-fPIC CXXFLAGS= LDFLAGS= glibtoolize --force --copy
  804. glibtoolize: putting auxiliary files in '.'.
  805. glibtoolize: copying file './ltmain.sh'
  806. glibtoolize: You should add the contents of the following files to 'aclocal.m4':
  807. glibtoolize:   '/usr/local/Cellar/libtool/2.4.6_4/share/aclocal/libtool.m4'
  808. glibtoolize:   '/usr/local/Cellar/libtool/2.4.6_4/share/aclocal/ltoptions.m4'
  809. glibtoolize:   '/usr/local/Cellar/libtool/2.4.6_4/share/aclocal/ltsugar.m4'
  810. glibtoolize:   '/usr/local/Cellar/libtool/2.4.6_4/share/aclocal/ltversion.m4'
  811. glibtoolize:   '/usr/local/Cellar/libtool/2.4.6_4/share/aclocal/lt~obsolete.m4'
  812. glibtoolize: Consider adding 'AC_CONFIG_MACRO_DIRS([m4])' to configure.ac,
  813. glibtoolize: and rerunning glibtoolize and aclocal.
  814. glibtoolize: Consider adding '-I m4' to ACLOCAL_AMFLAGS in Makefile.am.
  815. OK  
  816.  
  817. [/var/folders/zz/zyxvpxvq6csfxvn_n0000000000000/T/netdata-judy-XXXXXX.Zd3J08rf/libjudy-1.0.5-netdata2]# env CFLAGS=-fPIC CXXFLAGS= LDFLAGS= aclocal
  818. OK  
  819.  
  820. [/var/folders/zz/zyxvpxvq6csfxvn_n0000000000000/T/netdata-judy-XXXXXX.Zd3J08rf/libjudy-1.0.5-netdata2]# env CFLAGS=-fPIC CXXFLAGS= LDFLAGS= autoheader
  821. OK  
  822.  
  823. [/var/folders/zz/zyxvpxvq6csfxvn_n0000000000000/T/netdata-judy-XXXXXX.Zd3J08rf/libjudy-1.0.5-netdata2]# env CFLAGS=-fPIC CXXFLAGS= LDFLAGS= automake --add-missing --force --copy --include-deps
  824. configure.ac:7: warning: AM_INIT_AUTOMAKE: two- and three-arguments forms are deprecated.  For more info, see:
  825. configure.ac:7: https://www.gnu.org/software/automake/manual/automake.html#Modernize-AM_005fINIT_005fAUTOMAKE-invocation
  826. configure.ac:147: installing './compile'
  827. configure.ac:223: installing './config.guess'
  828. configure.ac:223: installing './config.sub'
  829. configure.ac:7: installing './install-sh'
  830. configure.ac:7: installing './missing'
  831. src/Judy1/Makefile.am:1: warning: 'INCLUDES' is the old name for 'AM_CPPFLAGS' (or '*_CPPFLAGS')
  832. src/Judy1/Makefile.am: installing './depcomp'
  833. src/JudyCommon/Makefile.am:1: warning: 'INCLUDES' is the old name for 'AM_CPPFLAGS' (or '*_CPPFLAGS')
  834. src/JudyHS/Makefile.am:1: warning: 'INCLUDES' is the old name for 'AM_CPPFLAGS' (or '*_CPPFLAGS')
  835. src/JudyL/Makefile.am:1: warning: 'INCLUDES' is the old name for 'AM_CPPFLAGS' (or '*_CPPFLAGS')
  836. src/JudySL/Makefile.am:1: warning: 'INCLUDES' is the old name for 'AM_CPPFLAGS' (or '*_CPPFLAGS')
  837. src/Makefile.am:1: warning: naming a subdirectory 'obj' causes troubles with BSD make
  838. parallel-tests: installing './test-driver'
  839. tool/Makefile.am:1: warning: 'INCLUDES' is the old name for 'AM_CPPFLAGS' (or '*_CPPFLAGS')
  840. OK  
  841.  
  842. [/var/folders/zz/zyxvpxvq6csfxvn_n0000000000000/T/netdata-judy-XXXXXX.Zd3J08rf/libjudy-1.0.5-netdata2]# env CFLAGS=-fPIC CXXFLAGS= LDFLAGS= autoconf
  843. configure.ac:7: warning: AM_INIT_AUTOMAKE: two- and three-arguments forms are deprecated.
  844. ./lib/autoconf/general.m4:2434: AC_DIAGNOSE is expanded from...
  845. aclocal.m4:9453: AM_INIT_AUTOMAKE is expanded from...
  846. configure.ac:7: the top level
  847. configure.ac:12: warning: 'AM_CONFIG_HEADER': this macro is obsolete.
  848. configure.ac:12: You should use the 'AC_CONFIG_HEADERS' macro instead.
  849. ./lib/autoconf/general.m4:2434: AC_DIAGNOSE is expanded from...
  850. aclocal.m4:9805: AM_CONFIG_HEADER is expanded from...
  851. configure.ac:12: the top level
  852. configure.ac:110: warning: The macro `AC_HELP_STRING' is obsolete.
  853. configure.ac:110: You should run autoupdate.
  854. ./lib/autoconf/general.m4:204: AC_HELP_STRING is expanded from...
  855. configure.ac:110: the top level
  856. configure.ac:119: warning: The macro `AC_HELP_STRING' is obsolete.
  857. configure.ac:119: You should run autoupdate.
  858. ./lib/autoconf/general.m4:204: AC_HELP_STRING is expanded from...
  859. configure.ac:119: the top level
  860. configure.ac:156: warning: The macro `AC_HEADER_STDC' is obsolete.
  861. configure.ac:156: You should run autoupdate.
  862. ./lib/autoconf/headers.m4:704: AC_HEADER_STDC is expanded from...
  863. configure.ac:156: the top level
  864. configure.ac:168: warning: The macro `AC_HEADER_TIME' is obsolete.
  865. configure.ac:168: You should run autoupdate.
  866. ./lib/autoconf/headers.m4:743: AC_HEADER_TIME is expanded from...
  867. configure.ac:168: the top level
  868. configure.ac:238: warning: The macro `AM_PROG_LIBTOOL' is obsolete.
  869. configure.ac:238: You should run autoupdate.
  870. aclocal.m4:122: AM_PROG_LIBTOOL is expanded from...
  871. configure.ac:238: the top level
  872.  OK  
  873.  
  874. [/var/folders/zz/zyxvpxvq6csfxvn_n0000000000000/T/netdata-judy-XXXXXX.Zd3J08rf/libjudy-1.0.5-netdata2]# env CFLAGS=-fPIC CXXFLAGS= LDFLAGS= ./configure
  875. checking whether to enable maintainer-specific portions of Makefiles... no
  876. checking for a BSD-compatible install... /usr/bin/install -c
  877. checking whether build environment is sane... yes
  878. checking for a race-free mkdir -p... ./install-sh -c -d
  879. checking for gawk... no
  880. checking for mawk... no
  881. checking for nawk... no
  882. checking for awk... awk
  883. checking whether make sets $(MAKE)... yes
  884. checking whether make supports nested variables... yes
  885. checking which flavor to build... product
  886. checking for gcc... gcc
  887. checking whether the C compiler works... yes
  888. checking for C compiler default output file name... a.out
  889. checking for suffix of executables...
  890. checking whether we are cross compiling... no
  891. checking for suffix of object files... o
  892. checking whether the compiler supports GNU C... yes
  893. checking whether gcc accepts -g... yes
  894. checking for gcc option to enable C11 features... none needed
  895. checking whether gcc understands -c and -o together... yes
  896. checking whether make supports the include directive... yes (GNU style)
  897. checking dependency style of gcc... gcc3
  898. checking how to run the C preprocessor... gcc -E
  899. checking whether ln -s works... yes
  900. checking whether make sets $(MAKE)... (cached) yes
  901. checking for stdio.h... yes
  902. checking for stdlib.h... yes
  903. checking for string.h... yes
  904. checking for inttypes.h... yes
  905. checking for stdint.h... yes
  906. checking for strings.h... yes
  907. checking for sys/stat.h... yes
  908. checking for sys/types.h... yes
  909. checking for unistd.h... yes
  910. checking for sys/time.h... yes
  911. checking for sys/param.h... yes
  912. checking for grep that handles long lines and -e... /usr/bin/grep
  913. checking for egrep... /usr/bin/grep -E
  914. checking for fcntl.h... yes
  915. checking for inttypes.h... (cached) yes
  916. checking for limits.h... yes
  917. checking for malloc.h... no
  918. checking for stddef.h... yes
  919. checking for stdint.h... (cached) yes
  920. checking for stdlib.h... (cached) yes
  921. checking for string.h... (cached) yes
  922. checking for strings.h... (cached) yes
  923. checking for sys/param.h... (cached) yes
  924. checking for sys/time.h... (cached) yes
  925. checking for unistd.h... (cached) yes
  926. checking for _Bool... yes
  927. checking for stdbool.h that conforms to C99... yes
  928. checking for an ANSI C-conforming const... yes
  929. checking for inline... inline
  930. checking for size_t... yes
  931. checking whether struct tm is in sys/time.h or time.h... time.h
  932. checking for working volatile... yes
  933. checking for ptrdiff_t... yes
  934. checking whether byte ordering is bigendian... no
  935. checking size of void *... 8
  936. Detected 64-bit Build Environment
  937. checking for error_at_line... no
  938. checking build system type... x86_64-apple-darwin19.6.0
  939. checking host system type... x86_64-apple-darwin19.6.0
  940. checking for GNU libc compatible malloc... yes
  941. checking for working memcmp... yes
  942. checking for getpagesize... yes
  943. checking for vprintf... yes
  944. checking for working mmap... yes
  945. checking whether lstat correctly handles trailing slash... no
  946. checking whether stat accepts an empty string... no
  947. checking for getpagesize... (cached) yes
  948. checking for gettimeofday... yes
  949. checking for memset... yes
  950. checking for munmap... yes
  951. checking for pow... yes
  952. checking for strchr... yes
  953. checking for strcspn... yes
  954. checking for strerror... yes
  955. checking for strstr... yes
  956. checking for strtoul... yes
  957. checking for uname... yes
  958. checking for ar... ar
  959. checking for ld... ld
  960. checking for ranlib... ranlib
  961. checking how to print strings... printf
  962. checking for a sed that does not truncate output... /usr/bin/sed
  963. checking for fgrep... /usr/bin/grep -F
  964. checking for ld used by gcc... ld
  965. checking if the linker (ld) is GNU ld... no
  966. checking for BSD- or MS-compatible name lister (nm)... /usr/bin/nm -B
  967. checking the name lister (/usr/bin/nm -B) interface... BSD nm
  968. checking the maximum length of command line arguments... 196608
  969. checking how to convert x86_64-apple-darwin19.6.0 file names to x86_64-apple-darwin19.6.0 format... func_convert_file_noop
  970. checking how to convert x86_64-apple-darwin19.6.0 file names to toolchain format... func_convert_file_noop
  971. checking for ld option to reload object files... -r
  972. checking for objdump... objdump
  973. checking how to recognize dependent libraries... pass_all
  974. checking for dlltool... no
  975. checking how to associate runtime and link libraries... printf %s\n
  976. checking for archiver @FILE support... no
  977. checking for strip... strip
  978. checking for ranlib... (cached) ranlib
  979. checking command to parse /usr/bin/nm -B output from gcc object... ok
  980. checking for sysroot... no
  981. checking for a working dd... /bin/dd
  982. checking how to truncate binary pipes... /bin/dd bs=4096 count=1
  983. checking for mt... no
  984. checking if : is a manifest tool... no
  985. checking for dsymutil... dsymutil
  986. checking for nmedit... nmedit
  987. checking for lipo... lipo
  988. checking for otool... otool
  989. checking for otool64... no
  990. checking for -single_module linker flag... yes
  991. checking for -exported_symbols_list linker flag... yes
  992. checking for -force_load linker flag... yes
  993. checking for dlfcn.h... yes
  994. checking for objdir... .libs
  995. checking if gcc supports -fno-rtti -fno-exceptions... yes
  996. checking for gcc option to produce PIC... -fno-common -DPIC
  997. checking if gcc PIC flag -fno-common -DPIC works... yes
  998. checking if gcc static flag -static works... no
  999. checking if gcc supports -c -o file.o... yes
  1000. checking if gcc supports -c -o file.o... (cached) yes
  1001. checking whether the gcc linker (ld) supports shared libraries... yes
  1002. checking dynamic linker characteristics... darwin19.6.0 dyld
  1003. checking how to hardcode library paths into programs... immediate
  1004. checking whether stripping libraries is possible... yes
  1005. checking if libtool supports shared libraries... yes
  1006. checking whether to build shared libraries... yes
  1007. checking whether to build static libraries... yes
  1008. checking that generated files are newer than configure... done
  1009. configure: creating ./config.status
  1010. config.status: creating Makefile
  1011. config.status: creating src/Judy1/Makefile
  1012. config.status: creating src/JudyCommon/Makefile
  1013. config.status: creating src/JudyHS/Makefile
  1014. config.status: creating src/JudyL/Makefile
  1015. config.status: creating src/JudySL/Makefile
  1016. config.status: creating src/Makefile
  1017. config.status: creating src/obj/Makefile
  1018. config.status: creating tool/Makefile
  1019. config.status: creating doc/Makefile
  1020. config.status: creating test/Makefile
  1021. config.status: creating config.h
  1022. config.status: executing depfiles commands
  1023. config.status: executing libtool commands
  1024.  OK  
  1025.  
  1026. [/var/folders/zz/zyxvpxvq6csfxvn_n0000000000000/T/netdata-judy-XXXXXX.Zd3J08rf/libjudy-1.0.5-netdata2]# env CFLAGS=-fPIC CXXFLAGS= LDFLAGS= make -j4 -C src
  1027. Making all in .
  1028. make[1]: Nothing to be done for `all-am'.
  1029. Making all in JudyCommon
  1030. /bin/sh ../../libtool  --tag=CC   --mode=compile gcc -DHAVE_CONFIG_H -I. -I../.. -I. -I..   -fPIC -DJU_64BIT   -fPIC -DJU_64BIT -MT JudyMalloc.lo -MD -MP -MF .deps/JudyMalloc.Tpo -c -o JudyMalloc.lo JudyMalloc.c
  1031. libtool: compile:  gcc -DHAVE_CONFIG_H -I. -I../.. -I. -I.. -fPIC -DJU_64BIT -fPIC -DJU_64BIT -MT JudyMalloc.lo -MD -MP -MF .deps/JudyMalloc.Tpo -c JudyMalloc.c  -fno-common -DPIC -o .libs/JudyMalloc.o
  1032. libtool: compile:  gcc -DHAVE_CONFIG_H -I. -I../.. -I. -I.. -fPIC -DJU_64BIT -fPIC -DJU_64BIT -MT JudyMalloc.lo -MD -MP -MF .deps/JudyMalloc.Tpo -c JudyMalloc.c -o JudyMalloc.o >/dev/null 2>&1
  1033. mv -f .deps/JudyMalloc.Tpo .deps/JudyMalloc.Plo
  1034. /bin/sh ../../libtool  --tag=CC   --mode=link gcc -fPIC -DJU_64BIT   -fPIC -DJU_64BIT   -o libJudyMalloc.la  JudyMalloc.lo  
  1035. libtool: link: ar cru .libs/libJudyMalloc.a .libs/JudyMalloc.o
  1036. libtool: link: ranlib .libs/libJudyMalloc.a
  1037. libtool: link: ( cd ".libs" && rm -f "libJudyMalloc.la" && ln -s "../libJudyMalloc.la" "libJudyMalloc.la" )
  1038. Making all in JudyL
  1039. cp -f ../JudyCommon/JudyCascade.c           JudyLCascade.c
  1040. cp -f ../JudyCommon/JudyTables.c            JudyLTablesGen.c
  1041. cp -f ../JudyCommon/JudyCount.c             JudyLCount.c
  1042. cp -f ../JudyCommon/JudyCreateBranch.c      JudyLCreateBranch.c
  1043. cp -f ../JudyCommon/JudyDecascade.c         JudyLDecascade.c
  1044. cp -f ../JudyCommon/JudyDel.c               JudyLDel.c
  1045. cp -f ../JudyCommon/JudyFirst.c             JudyLFirst.c
  1046. cp -f ../JudyCommon/JudyFreeArray.c         JudyLFreeArray.c
  1047. cp -f ../JudyCommon/JudyGet.c               JudyLGet.c
  1048. cp -f ../JudyCommon/JudyInsArray.c          JudyLInsArray.c
  1049. cp -f ../JudyCommon/JudyIns.c               JudyLIns.c
  1050. cp -f ../JudyCommon/JudyInsertBranch.c      JudyLInsertBranch.c
  1051. cp -f ../JudyCommon/JudyMallocIF.c          JudyLMallocIF.c
  1052. cp -f ../JudyCommon/JudyMemActive.c         JudyLMemActive.c
  1053. cp -f ../JudyCommon/JudyMemUsed.c           JudyLMemUsed.c
  1054. cp -f ../JudyCommon/JudyPrevNext.c          JudyLNext.c
  1055. cp -f ../JudyCommon/JudyPrevNextEmpty.c     JudyLNextEmpty.c
  1056. cp -f ../JudyCommon/JudyPrevNext.c          JudyLPrev.c
  1057. cp -f ../JudyCommon/JudyPrevNextEmpty.c     JudyLPrevEmpty.c
  1058. cp -f ../JudyCommon/JudyByCount.c           JudyLByCount.c  
  1059. cp -f ../JudyCommon/JudyGet.c               j__udyLGet.c
  1060. /bin/sh ../../libtool  --tag=CC   --mode=compile gcc -DHAVE_CONFIG_H -I. -I../.. -I. -I.. -I../JudyCommon/    -DJUDYL   -fPIC -DJU_64BIT -MT JudyLCascade.lo -MD -MP -MF .deps/JudyLCascade.Tpo -c -o JudyLCascade.lo JudyLCascade.c
  1061. gcc -I. -I.. -I../JudyCommon/  -DJUDYL   -fPIC -DJU_64BIT -o JudyLTablesGen JudyLTablesGen.c; ./JudyLTablesGen
  1062. /bin/sh ../../libtool  --tag=CC   --mode=compile gcc -DHAVE_CONFIG_H -I. -I../.. -I. -I.. -I../JudyCommon/    -DJUDYL   -fPIC -DJU_64BIT -MT JudyLCount.lo -MD -MP -MF .deps/JudyLCount.Tpo -c -o JudyLCount.lo JudyLCount.c
  1063. /bin/sh ../../libtool  --tag=CC   --mode=compile gcc -DHAVE_CONFIG_H -I. -I../.. -I. -I.. -I../JudyCommon/    -DJUDYL   -fPIC -DJU_64BIT -MT JudyLCreateBranch.lo -MD -MP -MF .deps/JudyLCreateBranch.Tpo -c -o JudyLCreateBranch.lo JudyLCreateBranch.c
  1064. libtool: compile:  gcc -DHAVE_CONFIG_H -I. -I../.. -I. -I.. -I../JudyCommon/ -DJUDYL -fPIC -DJU_64BIT -MT JudyLCascade.lo -MD -MP -MF .deps/JudyLCascade.Tpo -c JudyLCascade.c  -fno-common -DPIC -o .libs/JudyLCascade.o
  1065. libtool: compile:  gcc -DHAVE_CONFIG_H -I. -I../.. -I. -I.. -I../JudyCommon/ -DJUDYL -fPIC -DJU_64BIT -MT JudyLCount.lo -MD -MP -MF .deps/JudyLCount.Tpo -c JudyLCount.c  -fno-common -DPIC -o .libs/JudyLCount.o
  1066. libtool: compile:  gcc -DHAVE_CONFIG_H -I. -I../.. -I. -I.. -I../JudyCommon/ -DJUDYL -fPIC -DJU_64BIT -MT JudyLCreateBranch.lo -MD -MP -MF .deps/JudyLCreateBranch.Tpo -c JudyLCreateBranch.c  -fno-common -DPIC -o .libs/JudyLCreateBranch.o
  1067. libtool: compile:  gcc -DHAVE_CONFIG_H -I. -I../.. -I. -I.. -I../JudyCommon/ -DJUDYL -fPIC -DJU_64BIT -MT JudyLCreateBranch.lo -MD -MP -MF .deps/JudyLCreateBranch.Tpo -c JudyLCreateBranch.c -o JudyLCreateBranch.o >/dev/null 2>&1
  1068. libtool: compile:  gcc -DHAVE_CONFIG_H -I. -I../.. -I. -I.. -I../JudyCommon/ -DJUDYL -fPIC -DJU_64BIT -MT JudyLCount.lo -MD -MP -MF .deps/JudyLCount.Tpo -c JudyLCount.c -o JudyLCount.o >/dev/null 2>&1
  1069. /bin/sh ../../libtool  --tag=CC   --mode=compile gcc -DHAVE_CONFIG_H -I. -I../.. -I. -I.. -I../JudyCommon/    -DJUDYL   -fPIC -DJU_64BIT -MT JudyLDecascade.lo -MD -MP -MF .deps/JudyLDecascade.Tpo -c -o JudyLDecascade.lo JudyLDecascade.c
  1070. libtool: compile:  gcc -DHAVE_CONFIG_H -I. -I../.. -I. -I.. -I../JudyCommon/ -DJUDYL -fPIC -DJU_64BIT -MT JudyLCascade.lo -MD -MP -MF .deps/JudyLCascade.Tpo -c JudyLCascade.c -o JudyLCascade.o >/dev/null 2>&1
  1071. mv -f .deps/JudyLCreateBranch.Tpo .deps/JudyLCreateBranch.Plo
  1072. /bin/sh ../../libtool  --tag=CC   --mode=compile gcc -DHAVE_CONFIG_H -I. -I../.. -I. -I.. -I../JudyCommon/    -DJUDYL   -fPIC -DJU_64BIT -MT JudyLDel.lo -MD -MP -MF .deps/JudyLDel.Tpo -c -o JudyLDel.lo JudyLDel.c
  1073. mv -f .deps/JudyLCount.Tpo .deps/JudyLCount.Plo
  1074. /bin/sh ../../libtool  --tag=CC   --mode=compile gcc -DHAVE_CONFIG_H -I. -I../.. -I. -I.. -I../JudyCommon/    -DJUDYL   -fPIC -DJU_64BIT -MT JudyLFirst.lo -MD -MP -MF .deps/JudyLFirst.Tpo -c -o JudyLFirst.lo JudyLFirst.c
  1075. libtool: compile:  gcc -DHAVE_CONFIG_H -I. -I../.. -I. -I.. -I../JudyCommon/ -DJUDYL -fPIC -DJU_64BIT -MT JudyLDecascade.lo -MD -MP -MF .deps/JudyLDecascade.Tpo -c JudyLDecascade.c  -fno-common -DPIC -o .libs/JudyLDecascade.o
  1076. mv -f .deps/JudyLCascade.Tpo .deps/JudyLCascade.Plo
  1077. /bin/sh ../../libtool  --tag=CC   --mode=compile gcc -DHAVE_CONFIG_H -I. -I../.. -I. -I.. -I../JudyCommon/    -DJUDYL   -fPIC -DJU_64BIT -MT JudyLFreeArray.lo -MD -MP -MF .deps/JudyLFreeArray.Tpo -c -o JudyLFreeArray.lo JudyLFreeArray.c
  1078. libtool: compile:  gcc -DHAVE_CONFIG_H -I. -I../.. -I. -I.. -I../JudyCommon/ -DJUDYL -fPIC -DJU_64BIT -MT JudyLDel.lo -MD -MP -MF .deps/JudyLDel.Tpo -c JudyLDel.c  -fno-common -DPIC -o .libs/JudyLDel.o
  1079. libtool: compile:  gcc -DHAVE_CONFIG_H -I. -I../.. -I. -I.. -I../JudyCommon/ -DJUDYL -fPIC -DJU_64BIT -MT JudyLFirst.lo -MD -MP -MF .deps/JudyLFirst.Tpo -c JudyLFirst.c  -fno-common -DPIC -o .libs/JudyLFirst.o
  1080. libtool: compile:  gcc -DHAVE_CONFIG_H -I. -I../.. -I. -I.. -I../JudyCommon/ -DJUDYL -fPIC -DJU_64BIT -MT JudyLDecascade.lo -MD -MP -MF .deps/JudyLDecascade.Tpo -c JudyLDecascade.c -o JudyLDecascade.o >/dev/null 2>&1
  1081. libtool: compile:  gcc -DHAVE_CONFIG_H -I. -I../.. -I. -I.. -I../JudyCommon/ -DJUDYL -fPIC -DJU_64BIT -MT JudyLFirst.lo -MD -MP -MF .deps/JudyLFirst.Tpo -c JudyLFirst.c -o JudyLFirst.o >/dev/null 2>&1
  1082. libtool: compile:  gcc -DHAVE_CONFIG_H -I. -I../.. -I. -I.. -I../JudyCommon/ -DJUDYL -fPIC -DJU_64BIT -MT JudyLFreeArray.lo -MD -MP -MF .deps/JudyLFreeArray.Tpo -c JudyLFreeArray.c  -fno-common -DPIC -o .libs/JudyLFreeArray.o
  1083. libtool: compile:  gcc -DHAVE_CONFIG_H -I. -I../.. -I. -I.. -I../JudyCommon/ -DJUDYL -fPIC -DJU_64BIT -MT JudyLFreeArray.lo -MD -MP -MF .deps/JudyLFreeArray.Tpo -c JudyLFreeArray.c -o JudyLFreeArray.o >/dev/null 2>&1
  1084. mv -f .deps/JudyLDecascade.Tpo .deps/JudyLDecascade.Plo
  1085. mv -f .deps/JudyLFirst.Tpo .deps/JudyLFirst.Plo
  1086. /bin/sh ../../libtool  --tag=CC   --mode=compile gcc -DHAVE_CONFIG_H -I. -I../.. -I. -I.. -I../JudyCommon/    -DJUDYL   -fPIC -DJU_64BIT -MT JudyLGet.lo -MD -MP -MF .deps/JudyLGet.Tpo -c -o JudyLGet.lo JudyLGet.c
  1087. /bin/sh ../../libtool  --tag=CC   --mode=compile gcc -DHAVE_CONFIG_H -I. -I../.. -I. -I.. -I../JudyCommon/    -DJUDYL   -fPIC -DJU_64BIT -MT JudyLInsArray.lo -MD -MP -MF .deps/JudyLInsArray.Tpo -c -o JudyLInsArray.lo JudyLInsArray.c
  1088. libtool: compile:  gcc -DHAVE_CONFIG_H -I. -I../.. -I. -I.. -I../JudyCommon/ -DJUDYL -fPIC -DJU_64BIT -MT JudyLDel.lo -MD -MP -MF .deps/JudyLDel.Tpo -c JudyLDel.c -o JudyLDel.o >/dev/null 2>&1
  1089. mv -f .deps/JudyLFreeArray.Tpo .deps/JudyLFreeArray.Plo
  1090. /bin/sh ../../libtool  --tag=CC   --mode=compile gcc -DHAVE_CONFIG_H -I. -I../.. -I. -I.. -I../JudyCommon/    -DJUDYL   -fPIC -DJU_64BIT -MT JudyLIns.lo -MD -MP -MF .deps/JudyLIns.Tpo -c -o JudyLIns.lo JudyLIns.c
  1091. libtool: compile:  gcc -DHAVE_CONFIG_H -I. -I../.. -I. -I.. -I../JudyCommon/ -DJUDYL -fPIC -DJU_64BIT -MT JudyLInsArray.lo -MD -MP -MF .deps/JudyLInsArray.Tpo -c JudyLInsArray.c  -fno-common -DPIC -o .libs/JudyLInsArray.o
  1092. libtool: compile:  gcc -DHAVE_CONFIG_H -I. -I../.. -I. -I.. -I../JudyCommon/ -DJUDYL -fPIC -DJU_64BIT -MT JudyLGet.lo -MD -MP -MF .deps/JudyLGet.Tpo -c JudyLGet.c  -fno-common -DPIC -o .libs/JudyLGet.o
  1093. libtool: compile:  gcc -DHAVE_CONFIG_H -I. -I../.. -I. -I.. -I../JudyCommon/ -DJUDYL -fPIC -DJU_64BIT -MT JudyLIns.lo -MD -MP -MF .deps/JudyLIns.Tpo -c JudyLIns.c  -fno-common -DPIC -o .libs/JudyLIns.o
  1094. libtool: compile:  gcc -DHAVE_CONFIG_H -I. -I../.. -I. -I.. -I../JudyCommon/ -DJUDYL -fPIC -DJU_64BIT -MT JudyLGet.lo -MD -MP -MF .deps/JudyLGet.Tpo -c JudyLGet.c -o JudyLGet.o >/dev/null 2>&1
  1095. libtool: compile:  gcc -DHAVE_CONFIG_H -I. -I../.. -I. -I.. -I../JudyCommon/ -DJUDYL -fPIC -DJU_64BIT -MT JudyLInsArray.lo -MD -MP -MF .deps/JudyLInsArray.Tpo -c JudyLInsArray.c -o JudyLInsArray.o >/dev/null 2>&1
  1096. mv -f .deps/JudyLDel.Tpo .deps/JudyLDel.Plo
  1097. /bin/sh ../../libtool  --tag=CC   --mode=compile gcc -DHAVE_CONFIG_H -I. -I../.. -I. -I.. -I../JudyCommon/    -DJUDYL   -fPIC -DJU_64BIT -MT JudyLInsertBranch.lo -MD -MP -MF .deps/JudyLInsertBranch.Tpo -c -o JudyLInsertBranch.lo JudyLInsertBranch.c
  1098. mv -f .deps/JudyLGet.Tpo .deps/JudyLGet.Plo
  1099. /bin/sh ../../libtool  --tag=CC   --mode=compile gcc -DHAVE_CONFIG_H -I. -I../.. -I. -I.. -I../JudyCommon/    -DJUDYL   -fPIC -DJU_64BIT -MT JudyLMallocIF.lo -MD -MP -MF .deps/JudyLMallocIF.Tpo -c -o JudyLMallocIF.lo JudyLMallocIF.c
  1100. mv -f .deps/JudyLInsArray.Tpo .deps/JudyLInsArray.Plo
  1101. /bin/sh ../../libtool  --tag=CC   --mode=compile gcc -DHAVE_CONFIG_H -I. -I../.. -I. -I.. -I../JudyCommon/    -DJUDYL   -fPIC -DJU_64BIT -MT JudyLMemActive.lo -MD -MP -MF .deps/JudyLMemActive.Tpo -c -o JudyLMemActive.lo JudyLMemActive.c
  1102. libtool: compile:  gcc -DHAVE_CONFIG_H -I. -I../.. -I. -I.. -I../JudyCommon/ -DJUDYL -fPIC -DJU_64BIT -MT JudyLIns.lo -MD -MP -MF .deps/JudyLIns.Tpo -c JudyLIns.c -o JudyLIns.o >/dev/null 2>&1
  1103. libtool: compile:  gcc -DHAVE_CONFIG_H -I. -I../.. -I. -I.. -I../JudyCommon/ -DJUDYL -fPIC -DJU_64BIT -MT JudyLInsertBranch.lo -MD -MP -MF .deps/JudyLInsertBranch.Tpo -c JudyLInsertBranch.c  -fno-common -DPIC -o .libs/JudyLInsertBranch.o
  1104. libtool: compile:  gcc -DHAVE_CONFIG_H -I. -I../.. -I. -I.. -I../JudyCommon/ -DJUDYL -fPIC -DJU_64BIT -MT JudyLMallocIF.lo -MD -MP -MF .deps/JudyLMallocIF.Tpo -c JudyLMallocIF.c  -fno-common -DPIC -o .libs/JudyLMallocIF.o
  1105. libtool: compile:  gcc -DHAVE_CONFIG_H -I. -I../.. -I. -I.. -I../JudyCommon/ -DJUDYL -fPIC -DJU_64BIT -MT JudyLMemActive.lo -MD -MP -MF .deps/JudyLMemActive.Tpo -c JudyLMemActive.c  -fno-common -DPIC -o .libs/JudyLMemActive.o
  1106. libtool: compile:  gcc -DHAVE_CONFIG_H -I. -I../.. -I. -I.. -I../JudyCommon/ -DJUDYL -fPIC -DJU_64BIT -MT JudyLInsertBranch.lo -MD -MP -MF .deps/JudyLInsertBranch.Tpo -c JudyLInsertBranch.c -o JudyLInsertBranch.o >/dev/null 2>&1
  1107. libtool: compile:  gcc -DHAVE_CONFIG_H -I. -I../.. -I. -I.. -I../JudyCommon/ -DJUDYL -fPIC -DJU_64BIT -MT JudyLMallocIF.lo -MD -MP -MF .deps/JudyLMallocIF.Tpo -c JudyLMallocIF.c -o JudyLMallocIF.o >/dev/null 2>&1
  1108. libtool: compile:  gcc -DHAVE_CONFIG_H -I. -I../.. -I. -I.. -I../JudyCommon/ -DJUDYL -fPIC -DJU_64BIT -MT JudyLMemActive.lo -MD -MP -MF .deps/JudyLMemActive.Tpo -c JudyLMemActive.c -o JudyLMemActive.o >/dev/null 2>&1
  1109. mv -f .deps/JudyLInsertBranch.Tpo .deps/JudyLInsertBranch.Plo
  1110. /bin/sh ../../libtool  --tag=CC   --mode=compile gcc -DHAVE_CONFIG_H -I. -I../.. -I. -I.. -I../JudyCommon/    -DJUDYL   -fPIC -DJU_64BIT -MT JudyLMemUsed.lo -MD -MP -MF .deps/JudyLMemUsed.Tpo -c -o JudyLMemUsed.lo JudyLMemUsed.c
  1111. mv -f .deps/JudyLIns.Tpo .deps/JudyLIns.Plo
  1112. /bin/sh ../../libtool  --tag=CC   --mode=compile gcc -DHAVE_CONFIG_H -I. -I../.. -I. -I.. -I../JudyCommon/    -DJUDYL   -DJUDYNEXT -fPIC -DJU_64BIT -MT libnext_la-JudyLNext.lo -MD -MP -MF .deps/libnext_la-JudyLNext.Tpo -c -o libnext_la-JudyLNext.lo `test -f 'JudyLNext.c' || echo './'`JudyLNext.c
  1113. mv -f .deps/JudyLMemActive.Tpo .deps/JudyLMemActive.Plo
  1114. /bin/sh ../../libtool  --tag=CC   --mode=compile gcc -DHAVE_CONFIG_H -I. -I../.. -I. -I.. -I../JudyCommon/    -DJUDYL   -DJUDYNEXT -fPIC -DJU_64BIT -MT libnext_la-JudyLNextEmpty.lo -MD -MP -MF .deps/libnext_la-JudyLNextEmpty.Tpo -c -o libnext_la-JudyLNextEmpty.lo `test -f 'JudyLNextEmpty.c' || echo './'`JudyLNextEmpty.c
  1115. mv -f .deps/JudyLMallocIF.Tpo .deps/JudyLMallocIF.Plo
  1116. /bin/sh ../../libtool  --tag=CC   --mode=compile gcc -DHAVE_CONFIG_H -I. -I../.. -I. -I.. -I../JudyCommon/    -DJUDYL   -DJUDYPREV -fPIC -DJU_64BIT -MT libprev_la-JudyLPrev.lo -MD -MP -MF .deps/libprev_la-JudyLPrev.Tpo -c -o libprev_la-JudyLPrev.lo `test -f 'JudyLPrev.c' || echo './'`JudyLPrev.c
  1117. libtool: compile:  gcc -DHAVE_CONFIG_H -I. -I../.. -I. -I.. -I../JudyCommon/ -DJUDYL -fPIC -DJU_64BIT -MT JudyLMemUsed.lo -MD -MP -MF .deps/JudyLMemUsed.Tpo -c JudyLMemUsed.c  -fno-common -DPIC -o .libs/JudyLMemUsed.o
  1118. libtool: compile:  gcc -DHAVE_CONFIG_H -I. -I../.. -I. -I.. -I../JudyCommon/ -DJUDYL -DJUDYNEXT -fPIC -DJU_64BIT -MT libnext_la-JudyLNext.lo -MD -MP -MF .deps/libnext_la-JudyLNext.Tpo -c JudyLNext.c  -fno-common -DPIC -o .libs/libnext_la-JudyLNext.o
  1119. libtool: compile:  gcc -DHAVE_CONFIG_H -I. -I../.. -I. -I.. -I../JudyCommon/ -DJUDYL -DJUDYNEXT -fPIC -DJU_64BIT -MT libnext_la-JudyLNextEmpty.lo -MD -MP -MF .deps/libnext_la-JudyLNextEmpty.Tpo -c JudyLNextEmpty.c  -fno-common -DPIC -o .libs/libnext_la-JudyLNextEmpty.o
  1120. libtool: compile:  gcc -DHAVE_CONFIG_H -I. -I../.. -I. -I.. -I../JudyCommon/ -DJUDYL -fPIC -DJU_64BIT -MT JudyLMemUsed.lo -MD -MP -MF .deps/JudyLMemUsed.Tpo -c JudyLMemUsed.c -o JudyLMemUsed.o >/dev/null 2>&1
  1121. libtool: compile:  gcc -DHAVE_CONFIG_H -I. -I../.. -I. -I.. -I../JudyCommon/ -DJUDYL -DJUDYPREV -fPIC -DJU_64BIT -MT libprev_la-JudyLPrev.lo -MD -MP -MF .deps/libprev_la-JudyLPrev.Tpo -c JudyLPrev.c  -fno-common -DPIC -o .libs/libprev_la-JudyLPrev.o
  1122. mv -f .deps/JudyLMemUsed.Tpo .deps/JudyLMemUsed.Plo
  1123. /bin/sh ../../libtool  --tag=CC   --mode=compile gcc -DHAVE_CONFIG_H -I. -I../.. -I. -I.. -I../JudyCommon/    -DJUDYL   -DJUDYPREV -fPIC -DJU_64BIT -MT libprev_la-JudyLPrevEmpty.lo -MD -MP -MF .deps/libprev_la-JudyLPrevEmpty.Tpo -c -o libprev_la-JudyLPrevEmpty.lo `test -f 'JudyLPrevEmpty.c' || echo './'`JudyLPrevEmpty.c
  1124. libtool: compile:  gcc -DHAVE_CONFIG_H -I. -I../.. -I. -I.. -I../JudyCommon/ -DJUDYL -DJUDYNEXT -fPIC -DJU_64BIT -MT libnext_la-JudyLNextEmpty.lo -MD -MP -MF .deps/libnext_la-JudyLNextEmpty.Tpo -c JudyLNextEmpty.c -o libnext_la-JudyLNextEmpty.o >/dev/null 2>&1
  1125. libtool: compile:  gcc -DHAVE_CONFIG_H -I. -I../.. -I. -I.. -I../JudyCommon/ -DJUDYL -DJUDYNEXT -fPIC -DJU_64BIT -MT libnext_la-JudyLNext.lo -MD -MP -MF .deps/libnext_la-JudyLNext.Tpo -c JudyLNext.c -o libnext_la-JudyLNext.o >/dev/null 2>&1
  1126. libtool: compile:  gcc -DHAVE_CONFIG_H -I. -I../.. -I. -I.. -I../JudyCommon/ -DJUDYL -DJUDYPREV -fPIC -DJU_64BIT -MT libprev_la-JudyLPrev.lo -MD -MP -MF .deps/libprev_la-JudyLPrev.Tpo -c JudyLPrev.c -o libprev_la-JudyLPrev.o >/dev/null 2>&1
  1127. libtool: compile:  gcc -DHAVE_CONFIG_H -I. -I../.. -I. -I.. -I../JudyCommon/ -DJUDYL -DJUDYPREV -fPIC -DJU_64BIT -MT libprev_la-JudyLPrevEmpty.lo -MD -MP -MF .deps/libprev_la-JudyLPrevEmpty.Tpo -c JudyLPrevEmpty.c  -fno-common -DPIC -o .libs/libprev_la-JudyLPrevEmpty.o
  1128. mv -f .deps/libnext_la-JudyLNextEmpty.Tpo .deps/libnext_la-JudyLNextEmpty.Plo
  1129. /bin/sh ../../libtool  --tag=CC   --mode=compile gcc -DHAVE_CONFIG_H -I. -I../.. -I. -I.. -I../JudyCommon/    -DJUDYL   -DNOSMARTJBB -DNOSMARTJBU -DNOSMARTJLB -fPIC -DJU_64BIT -MT libcount_la-JudyLByCount.lo -MD -MP -MF .deps/libcount_la-JudyLByCount.Tpo -c -o libcount_la-JudyLByCount.lo `test -f 'JudyLByCount.c' || echo './'`JudyLByCount.c
  1130. mv -f .deps/libnext_la-JudyLNext.Tpo .deps/libnext_la-JudyLNext.Plo
  1131. /bin/sh ../../libtool  --tag=CC   --mode=compile gcc -DHAVE_CONFIG_H -I. -I../.. -I. -I.. -I../JudyCommon/    -DJUDYL   -DJUDYGETINLINE -fPIC -DJU_64BIT -MT libinline_la-j__udyLGet.lo -MD -MP -MF .deps/libinline_la-j__udyLGet.Tpo -c -o libinline_la-j__udyLGet.lo `test -f 'j__udyLGet.c' || echo './'`j__udyLGet.c
  1132. mv -f .deps/libprev_la-JudyLPrev.Tpo .deps/libprev_la-JudyLPrev.Plo
  1133. libtool: compile:  gcc -DHAVE_CONFIG_H -I. -I../.. -I. -I.. -I../JudyCommon/ -DJUDYL -DJUDYPREV -fPIC -DJU_64BIT -MT libprev_la-JudyLPrevEmpty.lo -MD -MP -MF .deps/libprev_la-JudyLPrevEmpty.Tpo -c JudyLPrevEmpty.c -o libprev_la-JudyLPrevEmpty.o >/dev/null 2>&1
  1134. /bin/sh ../../libtool  --tag=CC   --mode=compile gcc -DHAVE_CONFIG_H -I. -I../.. -I. -I.. -I../JudyCommon/    -DJUDYL   -fPIC -DJU_64BIT -MT JudyLTables.lo -MD -MP -MF .deps/JudyLTables.Tpo -c -o JudyLTables.lo JudyLTables.c
  1135. libtool: compile:  gcc -DHAVE_CONFIG_H -I. -I../.. -I. -I.. -I../JudyCommon/ -DJUDYL -DNOSMARTJBB -DNOSMARTJBU -DNOSMARTJLB -fPIC -DJU_64BIT -MT libcount_la-JudyLByCount.lo -MD -MP -MF .deps/libcount_la-JudyLByCount.Tpo -c JudyLByCount.c  -fno-common -DPIC -o .libs/libcount_la-JudyLByCount.o
  1136. libtool: compile:  gcc -DHAVE_CONFIG_H -I. -I../.. -I. -I.. -I../JudyCommon/ -DJUDYL -DJUDYGETINLINE -fPIC -DJU_64BIT -MT libinline_la-j__udyLGet.lo -MD -MP -MF .deps/libinline_la-j__udyLGet.Tpo -c j__udyLGet.c  -fno-common -DPIC -o .libs/libinline_la-j__udyLGet.o
  1137. libtool: compile:  gcc -DHAVE_CONFIG_H -I. -I../.. -I. -I.. -I../JudyCommon/ -DJUDYL -fPIC -DJU_64BIT -MT JudyLTables.lo -MD -MP -MF .deps/JudyLTables.Tpo -c JudyLTables.c  -fno-common -DPIC -o .libs/JudyLTables.o
  1138. mv -f .deps/libprev_la-JudyLPrevEmpty.Tpo .deps/libprev_la-JudyLPrevEmpty.Plo
  1139. /bin/sh ../../libtool  --tag=CC   --mode=link gcc -DJUDYL   -DJUDYNEXT -fPIC -DJU_64BIT   -o libnext.la  libnext_la-JudyLNext.lo libnext_la-JudyLNextEmpty.lo  
  1140. libtool: compile:  gcc -DHAVE_CONFIG_H -I. -I../.. -I. -I.. -I../JudyCommon/ -DJUDYL -DNOSMARTJBB -DNOSMARTJBU -DNOSMARTJLB -fPIC -DJU_64BIT -MT libcount_la-JudyLByCount.lo -MD -MP -MF .deps/libcount_la-JudyLByCount.Tpo -c JudyLByCount.c -o libcount_la-JudyLByCount.o >/dev/null 2>&1
  1141. libtool: compile:  gcc -DHAVE_CONFIG_H -I. -I../.. -I. -I.. -I../JudyCommon/ -DJUDYL -DJUDYGETINLINE -fPIC -DJU_64BIT -MT libinline_la-j__udyLGet.lo -MD -MP -MF .deps/libinline_la-j__udyLGet.Tpo -c j__udyLGet.c -o libinline_la-j__udyLGet.o >/dev/null 2>&1
  1142. libtool: compile:  gcc -DHAVE_CONFIG_H -I. -I../.. -I. -I.. -I../JudyCommon/ -DJUDYL -fPIC -DJU_64BIT -MT JudyLTables.lo -MD -MP -MF .deps/JudyLTables.Tpo -c JudyLTables.c -o JudyLTables.o >/dev/null 2>&1
  1143. mv -f .deps/libinline_la-j__udyLGet.Tpo .deps/libinline_la-j__udyLGet.Plo
  1144. mv -f .deps/JudyLTables.Tpo .deps/JudyLTables.Plo
  1145. /bin/sh ../../libtool  --tag=CC   --mode=link gcc -DJUDYL   -DJUDYPREV -fPIC -DJU_64BIT   -o libprev.la  libprev_la-JudyLPrev.lo libprev_la-JudyLPrevEmpty.lo  
  1146. /bin/sh ../../libtool  --tag=CC   --mode=link gcc -DJUDYL   -DJUDYGETINLINE -fPIC -DJU_64BIT   -o libinline.la  libinline_la-j__udyLGet.lo  
  1147. mv -f .deps/libcount_la-JudyLByCount.Tpo .deps/libcount_la-JudyLByCount.Plo
  1148. /bin/sh ../../libtool  --tag=CC   --mode=link gcc -DJUDYL   -fPIC -DJU_64BIT   -o libJudyL.la  JudyLCascade.lo JudyLTables.lo JudyLCount.lo JudyLCreateBranch.lo JudyLDecascade.lo JudyLDel.lo JudyLFirst.lo JudyLFreeArray.lo JudyLGet.lo JudyLInsArray.lo JudyLIns.lo JudyLInsertBranch.lo JudyLMallocIF.lo JudyLMemActive.lo JudyLMemUsed.lo  
  1149. libtool: link: ar cru .libs/libnext.a .libs/libnext_la-JudyLNext.o .libs/libnext_la-JudyLNextEmpty.o
  1150. libtool: link: ranlib .libs/libnext.a
  1151. libtool: link: ( cd ".libs" && rm -f "libnext.la" && ln -s "../libnext.la" "libnext.la" )
  1152. /bin/sh ../../libtool  --tag=CC   --mode=link gcc -DJUDYL   -DNOSMARTJBB -DNOSMARTJBU -DNOSMARTJLB -fPIC -DJU_64BIT   -o libcount.la  libcount_la-JudyLByCount.lo  
  1153. libtool: link: ar cru .libs/libinline.a .libs/libinline_la-j__udyLGet.o
  1154. libtool: link: ar cru .libs/libprev.a .libs/libprev_la-JudyLPrev.o .libs/libprev_la-JudyLPrevEmpty.o
  1155. libtool: link: ranlib .libs/libinline.a
  1156. libtool: link: ranlib .libs/libprev.a
  1157. libtool: link: ( cd ".libs" && rm -f "libinline.la" && ln -s "../libinline.la" "libinline.la" )
  1158. libtool: link: ( cd ".libs" && rm -f "libprev.la" && ln -s "../libprev.la" "libprev.la" )
  1159. libtool: link: ar cru .libs/libJudyL.a .libs/JudyLCascade.o .libs/JudyLTables.o .libs/JudyLCount.o .libs/JudyLCreateBranch.o .libs/JudyLDecascade.o .libs/JudyLDel.o .libs/JudyLFirst.o .libs/JudyLFreeArray.o .libs/JudyLGet.o .libs/JudyLInsArray.o .libs/JudyLIns.o .libs/JudyLInsertBranch.o .libs/JudyLMallocIF.o .libs/JudyLMemActive.o .libs/JudyLMemUsed.o
  1160. libtool: link: ranlib .libs/libJudyL.a
  1161. libtool: link: ( cd ".libs" && rm -f "libJudyL.la" && ln -s "../libJudyL.la" "libJudyL.la" )
  1162. libtool: link: ar cru .libs/libcount.a .libs/libcount_la-JudyLByCount.o
  1163. libtool: link: ranlib .libs/libcount.a
  1164. libtool: link: ( cd ".libs" && rm -f "libcount.la" && ln -s "../libcount.la" "libcount.la" )
  1165. Making all in Judy1
  1166. cp -f ../JudyCommon/JudyGet.c               Judy1Test.c
  1167. cp -f ../JudyCommon/JudyTables.c            Judy1TablesGen.c
  1168. cp -f ../JudyCommon/JudyIns.c               Judy1Set.c
  1169. cp -f ../JudyCommon/JudyInsArray.c          Judy1SetArray.c
  1170. cp -f ../JudyCommon/JudyDel.c               Judy1Unset.c
  1171. cp -f ../JudyCommon/JudyCascade.c           Judy1Cascade.c
  1172. cp -f ../JudyCommon/JudyCount.c             Judy1Count.c
  1173. cp -f ../JudyCommon/JudyCreateBranch.c      Judy1CreateBranch.c
  1174. cp -f ../JudyCommon/JudyDecascade.c         Judy1Decascade.c
  1175. cp -f ../JudyCommon/JudyFirst.c             Judy1First.c
  1176. cp -f ../JudyCommon/JudyFreeArray.c         Judy1FreeArray.c
  1177. cp -f ../JudyCommon/JudyInsertBranch.c      Judy1InsertBranch.c
  1178. cp -f ../JudyCommon/JudyMallocIF.c          Judy1MallocIF.c
  1179. cp -f ../JudyCommon/JudyMemActive.c         Judy1MemActive.c
  1180. cp -f ../JudyCommon/JudyMemUsed.c           Judy1MemUsed.c
  1181. cp -f ../JudyCommon/JudyPrevNext.c          Judy1Next.c
  1182. cp -f ../JudyCommon/JudyPrevNextEmpty.c     Judy1NextEmpty.c
  1183. cp -f ../JudyCommon/JudyPrevNext.c          Judy1Prev.c
  1184. cp -f ../JudyCommon/JudyPrevNextEmpty.c     Judy1PrevEmpty.c
  1185. cp -f ../JudyCommon/JudyByCount.c           Judy1ByCount.c  
  1186. cp -f ../JudyCommon/JudyGet.c               j__udy1Test.c
  1187. /bin/sh ../../libtool  --tag=CC   --mode=compile gcc -DHAVE_CONFIG_H -I. -I../.. -I. -I.. -I../JudyCommon/    -DJUDY1   -fPIC -DJU_64BIT -MT Judy1Test.lo -MD -MP -MF .deps/Judy1Test.Tpo -c -o Judy1Test.lo Judy1Test.c
  1188. gcc -I. -I.. -I../JudyCommon/  -DJUDY1   -fPIC -DJU_64BIT -o Judy1TablesGen Judy1TablesGen.c; ./Judy1TablesGen
  1189. /bin/sh ../../libtool  --tag=CC   --mode=compile gcc -DHAVE_CONFIG_H -I. -I../.. -I. -I.. -I../JudyCommon/    -DJUDY1   -fPIC -DJU_64BIT -MT Judy1Set.lo -MD -MP -MF .deps/Judy1Set.Tpo -c -o Judy1Set.lo Judy1Set.c
  1190. /bin/sh ../../libtool  --tag=CC   --mode=compile gcc -DHAVE_CONFIG_H -I. -I../.. -I. -I.. -I../JudyCommon/    -DJUDY1   -fPIC -DJU_64BIT -MT Judy1SetArray.lo -MD -MP -MF .deps/Judy1SetArray.Tpo -c -o Judy1SetArray.lo Judy1SetArray.c
  1191. libtool: compile:  gcc -DHAVE_CONFIG_H -I. -I../.. -I. -I.. -I../JudyCommon/ -DJUDY1 -fPIC -DJU_64BIT -MT Judy1Set.lo -MD -MP -MF .deps/Judy1Set.Tpo -c Judy1Set.c  -fno-common -DPIC -o .libs/Judy1Set.o
  1192. libtool: compile:  gcc -DHAVE_CONFIG_H -I. -I../.. -I. -I.. -I../JudyCommon/ -DJUDY1 -fPIC -DJU_64BIT -MT Judy1Test.lo -MD -MP -MF .deps/Judy1Test.Tpo -c Judy1Test.c  -fno-common -DPIC -o .libs/Judy1Test.o
  1193. libtool: compile:  gcc -DHAVE_CONFIG_H -I. -I../.. -I. -I.. -I../JudyCommon/ -DJUDY1 -fPIC -DJU_64BIT -MT Judy1SetArray.lo -MD -MP -MF .deps/Judy1SetArray.Tpo -c Judy1SetArray.c  -fno-common -DPIC -o .libs/Judy1SetArray.o
  1194. libtool: compile:  gcc -DHAVE_CONFIG_H -I. -I../.. -I. -I.. -I../JudyCommon/ -DJUDY1 -fPIC -DJU_64BIT -MT Judy1Test.lo -MD -MP -MF .deps/Judy1Test.Tpo -c Judy1Test.c -o Judy1Test.o >/dev/null 2>&1
  1195. libtool: compile:  gcc -DHAVE_CONFIG_H -I. -I../.. -I. -I.. -I../JudyCommon/ -DJUDY1 -fPIC -DJU_64BIT -MT Judy1SetArray.lo -MD -MP -MF .deps/Judy1SetArray.Tpo -c Judy1SetArray.c -o Judy1SetArray.o >/dev/null 2>&1
  1196. /bin/sh ../../libtool  --tag=CC   --mode=compile gcc -DHAVE_CONFIG_H -I. -I../.. -I. -I.. -I../JudyCommon/    -DJUDY1   -fPIC -DJU_64BIT -MT Judy1Unset.lo -MD -MP -MF .deps/Judy1Unset.Tpo -c -o Judy1Unset.lo Judy1Unset.c
  1197. libtool: compile:  gcc -DHAVE_CONFIG_H -I. -I../.. -I. -I.. -I../JudyCommon/ -DJUDY1 -fPIC -DJU_64BIT -MT Judy1Set.lo -MD -MP -MF .deps/Judy1Set.Tpo -c Judy1Set.c -o Judy1Set.o >/dev/null 2>&1
  1198. mv -f .deps/Judy1Test.Tpo .deps/Judy1Test.Plo
  1199. /bin/sh ../../libtool  --tag=CC   --mode=compile gcc -DHAVE_CONFIG_H -I. -I../.. -I. -I.. -I../JudyCommon/    -DJUDY1   -fPIC -DJU_64BIT -MT Judy1Cascade.lo -MD -MP -MF .deps/Judy1Cascade.Tpo -c -o Judy1Cascade.lo Judy1Cascade.c
  1200. mv -f .deps/Judy1SetArray.Tpo .deps/Judy1SetArray.Plo
  1201. /bin/sh ../../libtool  --tag=CC   --mode=compile gcc -DHAVE_CONFIG_H -I. -I../.. -I. -I.. -I../JudyCommon/    -DJUDY1   -fPIC -DJU_64BIT -MT Judy1Count.lo -MD -MP -MF .deps/Judy1Count.Tpo -c -o Judy1Count.lo Judy1Count.c
  1202. libtool: compile:  gcc -DHAVE_CONFIG_H -I. -I../.. -I. -I.. -I../JudyCommon/ -DJUDY1 -fPIC -DJU_64BIT -MT Judy1Unset.lo -MD -MP -MF .deps/Judy1Unset.Tpo -c Judy1Unset.c  -fno-common -DPIC -o .libs/Judy1Unset.o
  1203. mv -f .deps/Judy1Set.Tpo .deps/Judy1Set.Plo
  1204. /bin/sh ../../libtool  --tag=CC   --mode=compile gcc -DHAVE_CONFIG_H -I. -I../.. -I. -I.. -I../JudyCommon/    -DJUDY1   -fPIC -DJU_64BIT -MT Judy1CreateBranch.lo -MD -MP -MF .deps/Judy1CreateBranch.Tpo -c -o Judy1CreateBranch.lo Judy1CreateBranch.c
  1205. libtool: compile:  gcc -DHAVE_CONFIG_H -I. -I../.. -I. -I.. -I../JudyCommon/ -DJUDY1 -fPIC -DJU_64BIT -MT Judy1Cascade.lo -MD -MP -MF .deps/Judy1Cascade.Tpo -c Judy1Cascade.c  -fno-common -DPIC -o .libs/Judy1Cascade.o
  1206. libtool: compile:  gcc -DHAVE_CONFIG_H -I. -I../.. -I. -I.. -I../JudyCommon/ -DJUDY1 -fPIC -DJU_64BIT -MT Judy1Count.lo -MD -MP -MF .deps/Judy1Count.Tpo -c Judy1Count.c  -fno-common -DPIC -o .libs/Judy1Count.o
  1207. libtool: compile:  gcc -DHAVE_CONFIG_H -I. -I../.. -I. -I.. -I../JudyCommon/ -DJUDY1 -fPIC -DJU_64BIT -MT Judy1Count.lo -MD -MP -MF .deps/Judy1Count.Tpo -c Judy1Count.c -o Judy1Count.o >/dev/null 2>&1
  1208. libtool: compile:  gcc -DHAVE_CONFIG_H -I. -I../.. -I. -I.. -I../JudyCommon/ -DJUDY1 -fPIC -DJU_64BIT -MT Judy1CreateBranch.lo -MD -MP -MF .deps/Judy1CreateBranch.Tpo -c Judy1CreateBranch.c  -fno-common -DPIC -o .libs/Judy1CreateBranch.o
  1209. libtool: compile:  gcc -DHAVE_CONFIG_H -I. -I../.. -I. -I.. -I../JudyCommon/ -DJUDY1 -fPIC -DJU_64BIT -MT Judy1Unset.lo -MD -MP -MF .deps/Judy1Unset.Tpo -c Judy1Unset.c -o Judy1Unset.o >/dev/null 2>&1
  1210. libtool: compile:  gcc -DHAVE_CONFIG_H -I. -I../.. -I. -I.. -I../JudyCommon/ -DJUDY1 -fPIC -DJU_64BIT -MT Judy1Cascade.lo -MD -MP -MF .deps/Judy1Cascade.Tpo -c Judy1Cascade.c -o Judy1Cascade.o >/dev/null 2>&1
  1211. libtool: compile:  gcc -DHAVE_CONFIG_H -I. -I../.. -I. -I.. -I../JudyCommon/ -DJUDY1 -fPIC -DJU_64BIT -MT Judy1CreateBranch.lo -MD -MP -MF .deps/Judy1CreateBranch.Tpo -c Judy1CreateBranch.c -o Judy1CreateBranch.o >/dev/null 2>&1
  1212. mv -f .deps/Judy1Count.Tpo .deps/Judy1Count.Plo
  1213. /bin/sh ../../libtool  --tag=CC   --mode=compile gcc -DHAVE_CONFIG_H -I. -I../.. -I. -I.. -I../JudyCommon/    -DJUDY1   -fPIC -DJU_64BIT -MT Judy1Decascade.lo -MD -MP -MF .deps/Judy1Decascade.Tpo -c -o Judy1Decascade.lo Judy1Decascade.c
  1214. mv -f .deps/Judy1Cascade.Tpo .deps/Judy1Cascade.Plo
  1215. /bin/sh ../../libtool  --tag=CC   --mode=compile gcc -DHAVE_CONFIG_H -I. -I../.. -I. -I.. -I../JudyCommon/    -DJUDY1   -fPIC -DJU_64BIT -MT Judy1First.lo -MD -MP -MF .deps/Judy1First.Tpo -c -o Judy1First.lo Judy1First.c
  1216. mv -f .deps/Judy1CreateBranch.Tpo .deps/Judy1CreateBranch.Plo
  1217. /bin/sh ../../libtool  --tag=CC   --mode=compile gcc -DHAVE_CONFIG_H -I. -I../.. -I. -I.. -I../JudyCommon/    -DJUDY1   -fPIC -DJU_64BIT -MT Judy1FreeArray.lo -MD -MP -MF .deps/Judy1FreeArray.Tpo -c -o Judy1FreeArray.lo Judy1FreeArray.c
  1218. mv -f .deps/Judy1Unset.Tpo .deps/Judy1Unset.Plo
  1219. /bin/sh ../../libtool  --tag=CC   --mode=compile gcc -DHAVE_CONFIG_H -I. -I../.. -I. -I.. -I../JudyCommon/    -DJUDY1   -fPIC -DJU_64BIT -MT Judy1InsertBranch.lo -MD -MP -MF .deps/Judy1InsertBranch.Tpo -c -o Judy1InsertBranch.lo Judy1InsertBranch.c
  1220. libtool: compile:  gcc -DHAVE_CONFIG_H -I. -I../.. -I. -I.. -I../JudyCommon/ -DJUDY1 -fPIC -DJU_64BIT -MT Judy1Decascade.lo -MD -MP -MF .deps/Judy1Decascade.Tpo -c Judy1Decascade.c  -fno-common -DPIC -o .libs/Judy1Decascade.o
  1221. libtool: compile:  gcc -DHAVE_CONFIG_H -I. -I../.. -I. -I.. -I../JudyCommon/ -DJUDY1 -fPIC -DJU_64BIT -MT Judy1First.lo -MD -MP -MF .deps/Judy1First.Tpo -c Judy1First.c  -fno-common -DPIC -o .libs/Judy1First.o
  1222. libtool: compile:  gcc -DHAVE_CONFIG_H -I. -I../.. -I. -I.. -I../JudyCommon/ -DJUDY1 -fPIC -DJU_64BIT -MT Judy1FreeArray.lo -MD -MP -MF .deps/Judy1FreeArray.Tpo -c Judy1FreeArray.c  -fno-common -DPIC -o .libs/Judy1FreeArray.o
  1223. libtool: compile:  gcc -DHAVE_CONFIG_H -I. -I../.. -I. -I.. -I../JudyCommon/ -DJUDY1 -fPIC -DJU_64BIT -MT Judy1InsertBranch.lo -MD -MP -MF .deps/Judy1InsertBranch.Tpo -c Judy1InsertBranch.c  -fno-common -DPIC -o .libs/Judy1InsertBranch.o
  1224. libtool: compile:  gcc -DHAVE_CONFIG_H -I. -I../.. -I. -I.. -I../JudyCommon/ -DJUDY1 -fPIC -DJU_64BIT -MT Judy1First.lo -MD -MP -MF .deps/Judy1First.Tpo -c Judy1First.c -o Judy1First.o >/dev/null 2>&1
  1225. libtool: compile:  gcc -DHAVE_CONFIG_H -I. -I../.. -I. -I.. -I../JudyCommon/ -DJUDY1 -fPIC -DJU_64BIT -MT Judy1Decascade.lo -MD -MP -MF .deps/Judy1Decascade.Tpo -c Judy1Decascade.c -o Judy1Decascade.o >/dev/null 2>&1
  1226. libtool: compile:  gcc -DHAVE_CONFIG_H -I. -I../.. -I. -I.. -I../JudyCommon/ -DJUDY1 -fPIC -DJU_64BIT -MT Judy1FreeArray.lo -MD -MP -MF .deps/Judy1FreeArray.Tpo -c Judy1FreeArray.c -o Judy1FreeArray.o >/dev/null 2>&1
  1227. libtool: compile:  gcc -DHAVE_CONFIG_H -I. -I../.. -I. -I.. -I../JudyCommon/ -DJUDY1 -fPIC -DJU_64BIT -MT Judy1InsertBranch.lo -MD -MP -MF .deps/Judy1InsertBranch.Tpo -c Judy1InsertBranch.c -o Judy1InsertBranch.o >/dev/null 2>&1
  1228. mv -f .deps/Judy1First.Tpo .deps/Judy1First.Plo
  1229. /bin/sh ../../libtool  --tag=CC   --mode=compile gcc -DHAVE_CONFIG_H -I. -I../.. -I. -I.. -I../JudyCommon/    -DJUDY1   -fPIC -DJU_64BIT -MT Judy1MallocIF.lo -MD -MP -MF .deps/Judy1MallocIF.Tpo -c -o Judy1MallocIF.lo Judy1MallocIF.c
  1230. mv -f .deps/Judy1FreeArray.Tpo .deps/Judy1FreeArray.Plo
  1231. /bin/sh ../../libtool  --tag=CC   --mode=compile gcc -DHAVE_CONFIG_H -I. -I../.. -I. -I.. -I../JudyCommon/    -DJUDY1   -fPIC -DJU_64BIT -MT Judy1MemActive.lo -MD -MP -MF .deps/Judy1MemActive.Tpo -c -o Judy1MemActive.lo Judy1MemActive.c
  1232. mv -f .deps/Judy1Decascade.Tpo .deps/Judy1Decascade.Plo
  1233. /bin/sh ../../libtool  --tag=CC   --mode=compile gcc -DHAVE_CONFIG_H -I. -I../.. -I. -I.. -I../JudyCommon/    -DJUDY1   -fPIC -DJU_64BIT -MT Judy1MemUsed.lo -MD -MP -MF .deps/Judy1MemUsed.Tpo -c -o Judy1MemUsed.lo Judy1MemUsed.c
  1234. mv -f .deps/Judy1InsertBranch.Tpo .deps/Judy1InsertBranch.Plo
  1235. /bin/sh ../../libtool  --tag=CC   --mode=compile gcc -DHAVE_CONFIG_H -I. -I../.. -I. -I.. -I../JudyCommon/    -DJUDY1   -DJUDYNEXT -fPIC -DJU_64BIT -MT libnext_la-Judy1Next.lo -MD -MP -MF .deps/libnext_la-Judy1Next.Tpo -c -o libnext_la-Judy1Next.lo `test -f 'Judy1Next.c' || echo './'`Judy1Next.c
  1236. libtool: compile:  gcc -DHAVE_CONFIG_H -I. -I../.. -I. -I.. -I../JudyCommon/ -DJUDY1 -fPIC -DJU_64BIT -MT Judy1MallocIF.lo -MD -MP -MF .deps/Judy1MallocIF.Tpo -c Judy1MallocIF.c  -fno-common -DPIC -o .libs/Judy1MallocIF.o
  1237. libtool: compile:  gcc -DHAVE_CONFIG_H -I. -I../.. -I. -I.. -I../JudyCommon/ -DJUDY1 -fPIC -DJU_64BIT -MT Judy1MemActive.lo -MD -MP -MF .deps/Judy1MemActive.Tpo -c Judy1MemActive.c  -fno-common -DPIC -o .libs/Judy1MemActive.o
  1238. libtool: compile:  gcc -DHAVE_CONFIG_H -I. -I../.. -I. -I.. -I../JudyCommon/ -DJUDY1 -fPIC -DJU_64BIT -MT Judy1MemUsed.lo -MD -MP -MF .deps/Judy1MemUsed.Tpo -c Judy1MemUsed.c  -fno-common -DPIC -o .libs/Judy1MemUsed.o
  1239. libtool: compile:  gcc -DHAVE_CONFIG_H -I. -I../.. -I. -I.. -I../JudyCommon/ -DJUDY1 -DJUDYNEXT -fPIC -DJU_64BIT -MT libnext_la-Judy1Next.lo -MD -MP -MF .deps/libnext_la-Judy1Next.Tpo -c Judy1Next.c  -fno-common -DPIC -o .libs/libnext_la-Judy1Next.o
  1240. libtool: compile:  gcc -DHAVE_CONFIG_H -I. -I../.. -I. -I.. -I../JudyCommon/ -DJUDY1 -fPIC -DJU_64BIT -MT Judy1MemActive.lo -MD -MP -MF .deps/Judy1MemActive.Tpo -c Judy1MemActive.c -o Judy1MemActive.o >/dev/null 2>&1
  1241. libtool: compile:  gcc -DHAVE_CONFIG_H -I. -I../.. -I. -I.. -I../JudyCommon/ -DJUDY1 -fPIC -DJU_64BIT -MT Judy1MallocIF.lo -MD -MP -MF .deps/Judy1MallocIF.Tpo -c Judy1MallocIF.c -o Judy1MallocIF.o >/dev/null 2>&1
  1242. libtool: compile:  gcc -DHAVE_CONFIG_H -I. -I../.. -I. -I.. -I../JudyCommon/ -DJUDY1 -fPIC -DJU_64BIT -MT Judy1MemUsed.lo -MD -MP -MF .deps/Judy1MemUsed.Tpo -c Judy1MemUsed.c -o Judy1MemUsed.o >/dev/null 2>&1
  1243. mv -f .deps/Judy1MemActive.Tpo .deps/Judy1MemActive.Plo
  1244. /bin/sh ../../libtool  --tag=CC   --mode=compile gcc -DHAVE_CONFIG_H -I. -I../.. -I. -I.. -I../JudyCommon/    -DJUDY1   -DJUDYNEXT -fPIC -DJU_64BIT -MT libnext_la-Judy1NextEmpty.lo -MD -MP -MF .deps/libnext_la-Judy1NextEmpty.Tpo -c -o libnext_la-Judy1NextEmpty.lo `test -f 'Judy1NextEmpty.c' || echo './'`Judy1NextEmpty.c
  1245. mv -f .deps/Judy1MemUsed.Tpo .deps/Judy1MemUsed.Plo
  1246. mv -f .deps/Judy1MallocIF.Tpo .deps/Judy1MallocIF.Plo
  1247. /bin/sh ../../libtool  --tag=CC   --mode=compile gcc -DHAVE_CONFIG_H -I. -I../.. -I. -I.. -I../JudyCommon/    -DJUDY1   -DJUDYPREV -fPIC -DJU_64BIT -MT libprev_la-Judy1Prev.lo -MD -MP -MF .deps/libprev_la-Judy1Prev.Tpo -c -o libprev_la-Judy1Prev.lo `test -f 'Judy1Prev.c' || echo './'`Judy1Prev.c
  1248. /bin/sh ../../libtool  --tag=CC   --mode=compile gcc -DHAVE_CONFIG_H -I. -I../.. -I. -I.. -I../JudyCommon/    -DJUDY1   -DJUDYPREV -fPIC -DJU_64BIT -MT libprev_la-Judy1PrevEmpty.lo -MD -MP -MF .deps/libprev_la-Judy1PrevEmpty.Tpo -c -o libprev_la-Judy1PrevEmpty.lo `test -f 'Judy1PrevEmpty.c' || echo './'`Judy1PrevEmpty.c
  1249. libtool: compile:  gcc -DHAVE_CONFIG_H -I. -I../.. -I. -I.. -I../JudyCommon/ -DJUDY1 -DJUDYNEXT -fPIC -DJU_64BIT -MT libnext_la-Judy1Next.lo -MD -MP -MF .deps/libnext_la-Judy1Next.Tpo -c Judy1Next.c -o libnext_la-Judy1Next.o >/dev/null 2>&1
  1250. libtool: compile:  gcc -DHAVE_CONFIG_H -I. -I../.. -I. -I.. -I../JudyCommon/ -DJUDY1 -DJUDYNEXT -fPIC -DJU_64BIT -MT libnext_la-Judy1NextEmpty.lo -MD -MP -MF .deps/libnext_la-Judy1NextEmpty.Tpo -c Judy1NextEmpty.c  -fno-common -DPIC -o .libs/libnext_la-Judy1NextEmpty.o
  1251. libtool: compile:  gcc -DHAVE_CONFIG_H -I. -I../.. -I. -I.. -I../JudyCommon/ -DJUDY1 -DJUDYPREV -fPIC -DJU_64BIT -MT libprev_la-Judy1Prev.lo -MD -MP -MF .deps/libprev_la-Judy1Prev.Tpo -c Judy1Prev.c  -fno-common -DPIC -o .libs/libprev_la-Judy1Prev.o
  1252. libtool: compile:  gcc -DHAVE_CONFIG_H -I. -I../.. -I. -I.. -I../JudyCommon/ -DJUDY1 -DJUDYPREV -fPIC -DJU_64BIT -MT libprev_la-Judy1PrevEmpty.lo -MD -MP -MF .deps/libprev_la-Judy1PrevEmpty.Tpo -c Judy1PrevEmpty.c  -fno-common -DPIC -o .libs/libprev_la-Judy1PrevEmpty.o
  1253. mv -f .deps/libnext_la-Judy1Next.Tpo .deps/libnext_la-Judy1Next.Plo
  1254. /bin/sh ../../libtool  --tag=CC   --mode=compile gcc -DHAVE_CONFIG_H -I. -I../.. -I. -I.. -I../JudyCommon/    -DJUDY1   -DNOSMARTJBB -DNOSMARTJBU -DNOSMARTJLB -fPIC -DJU_64BIT -MT libcount_la-Judy1ByCount.lo -MD -MP -MF .deps/libcount_la-Judy1ByCount.Tpo -c -o libcount_la-Judy1ByCount.lo `test -f 'Judy1ByCount.c' || echo './'`Judy1ByCount.c
  1255. libtool: compile:  gcc -DHAVE_CONFIG_H -I. -I../.. -I. -I.. -I../JudyCommon/ -DJUDY1 -DJUDYNEXT -fPIC -DJU_64BIT -MT libnext_la-Judy1NextEmpty.lo -MD -MP -MF .deps/libnext_la-Judy1NextEmpty.Tpo -c Judy1NextEmpty.c -o libnext_la-Judy1NextEmpty.o >/dev/null 2>&1
  1256. libtool: compile:  gcc -DHAVE_CONFIG_H -I. -I../.. -I. -I.. -I../JudyCommon/ -DJUDY1 -DJUDYPREV -fPIC -DJU_64BIT -MT libprev_la-Judy1PrevEmpty.lo -MD -MP -MF .deps/libprev_la-Judy1PrevEmpty.Tpo -c Judy1PrevEmpty.c -o libprev_la-Judy1PrevEmpty.o >/dev/null 2>&1
  1257. libtool: compile:  gcc -DHAVE_CONFIG_H -I. -I../.. -I. -I.. -I../JudyCommon/ -DJUDY1 -DJUDYPREV -fPIC -DJU_64BIT -MT libprev_la-Judy1Prev.lo -MD -MP -MF .deps/libprev_la-Judy1Prev.Tpo -c Judy1Prev.c -o libprev_la-Judy1Prev.o >/dev/null 2>&1
  1258. libtool: compile:  gcc -DHAVE_CONFIG_H -I. -I../.. -I. -I.. -I../JudyCommon/ -DJUDY1 -DNOSMARTJBB -DNOSMARTJBU -DNOSMARTJLB -fPIC -DJU_64BIT -MT libcount_la-Judy1ByCount.lo -MD -MP -MF .deps/libcount_la-Judy1ByCount.Tpo -c Judy1ByCount.c  -fno-common -DPIC -o .libs/libcount_la-Judy1ByCount.o
  1259. mv -f .deps/libnext_la-Judy1NextEmpty.Tpo .deps/libnext_la-Judy1NextEmpty.Plo
  1260. /bin/sh ../../libtool  --tag=CC   --mode=compile gcc -DHAVE_CONFIG_H -I. -I../.. -I. -I.. -I../JudyCommon/    -DJUDY1   -DJUDYGETINLINE -fPIC -DJU_64BIT -MT libinline_la-j__udy1Test.lo -MD -MP -MF .deps/libinline_la-j__udy1Test.Tpo -c -o libinline_la-j__udy1Test.lo `test -f 'j__udy1Test.c' || echo './'`j__udy1Test.c
  1261. mv -f .deps/libprev_la-Judy1PrevEmpty.Tpo .deps/libprev_la-Judy1PrevEmpty.Plo
  1262. /bin/sh ../../libtool  --tag=CC   --mode=compile gcc -DHAVE_CONFIG_H -I. -I../.. -I. -I.. -I../JudyCommon/    -DJUDY1   -fPIC -DJU_64BIT -MT Judy1Tables.lo -MD -MP -MF .deps/Judy1Tables.Tpo -c -o Judy1Tables.lo Judy1Tables.c
  1263. mv -f .deps/libprev_la-Judy1Prev.Tpo .deps/libprev_la-Judy1Prev.Plo
  1264. /bin/sh ../../libtool  --tag=CC   --mode=link gcc -DJUDY1   -DJUDYNEXT -fPIC -DJU_64BIT   -o libnext.la  libnext_la-Judy1Next.lo libnext_la-Judy1NextEmpty.lo  
  1265. libtool: compile:  gcc -DHAVE_CONFIG_H -I. -I../.. -I. -I.. -I../JudyCommon/ -DJUDY1 -DNOSMARTJBB -DNOSMARTJBU -DNOSMARTJLB -fPIC -DJU_64BIT -MT libcount_la-Judy1ByCount.lo -MD -MP -MF .deps/libcount_la-Judy1ByCount.Tpo -c Judy1ByCount.c -o libcount_la-Judy1ByCount.o >/dev/null 2>&1
  1266. libtool: compile:  gcc -DHAVE_CONFIG_H -I. -I../.. -I. -I.. -I../JudyCommon/ -DJUDY1 -fPIC -DJU_64BIT -MT Judy1Tables.lo -MD -MP -MF .deps/Judy1Tables.Tpo -c Judy1Tables.c  -fno-common -DPIC -o .libs/Judy1Tables.o
  1267. libtool: compile:  gcc -DHAVE_CONFIG_H -I. -I../.. -I. -I.. -I../JudyCommon/ -DJUDY1 -DJUDYGETINLINE -fPIC -DJU_64BIT -MT libinline_la-j__udy1Test.lo -MD -MP -MF .deps/libinline_la-j__udy1Test.Tpo -c j__udy1Test.c  -fno-common -DPIC -o .libs/libinline_la-j__udy1Test.o
  1268. libtool: compile:  gcc -DHAVE_CONFIG_H -I. -I../.. -I. -I.. -I../JudyCommon/ -DJUDY1 -fPIC -DJU_64BIT -MT Judy1Tables.lo -MD -MP -MF .deps/Judy1Tables.Tpo -c Judy1Tables.c -o Judy1Tables.o >/dev/null 2>&1
  1269. libtool: compile:  gcc -DHAVE_CONFIG_H -I. -I../.. -I. -I.. -I../JudyCommon/ -DJUDY1 -DJUDYGETINLINE -fPIC -DJU_64BIT -MT libinline_la-j__udy1Test.lo -MD -MP -MF .deps/libinline_la-j__udy1Test.Tpo -c j__udy1Test.c -o libinline_la-j__udy1Test.o >/dev/null 2>&1
  1270. mv -f .deps/libcount_la-Judy1ByCount.Tpo .deps/libcount_la-Judy1ByCount.Plo
  1271. /bin/sh ../../libtool  --tag=CC   --mode=link gcc -DJUDY1   -DJUDYPREV -fPIC -DJU_64BIT   -o libprev.la  libprev_la-Judy1Prev.lo libprev_la-Judy1PrevEmpty.lo  
  1272. libtool: link: ar cru .libs/libnext.a .libs/libnext_la-Judy1Next.o .libs/libnext_la-Judy1NextEmpty.o
  1273. mv -f .deps/Judy1Tables.Tpo .deps/Judy1Tables.Plo
  1274. /bin/sh ../../libtool  --tag=CC   --mode=link gcc -DJUDY1   -DNOSMARTJBB -DNOSMARTJBU -DNOSMARTJLB -fPIC -DJU_64BIT   -o libcount.la  libcount_la-Judy1ByCount.lo  
  1275. libtool: link: ranlib .libs/libnext.a
  1276. libtool: link: ( cd ".libs" && rm -f "libnext.la" && ln -s "../libnext.la" "libnext.la" )
  1277. /bin/sh ../../libtool  --tag=CC   --mode=link gcc -DJUDY1   -fPIC -DJU_64BIT   -o libJudy1.la  Judy1Test.lo Judy1Tables.lo Judy1Set.lo Judy1SetArray.lo Judy1Unset.lo Judy1Cascade.lo Judy1Count.lo Judy1CreateBranch.lo Judy1Decascade.lo Judy1First.lo Judy1FreeArray.lo Judy1InsertBranch.lo Judy1MallocIF.lo Judy1MemActive.lo Judy1MemUsed.lo  
  1278. mv -f .deps/libinline_la-j__udy1Test.Tpo .deps/libinline_la-j__udy1Test.Plo
  1279. /bin/sh ../../libtool  --tag=CC   --mode=link gcc -DJUDY1   -DJUDYGETINLINE -fPIC -DJU_64BIT   -o libinline.la  libinline_la-j__udy1Test.lo  
  1280. libtool: link: ar cru .libs/libprev.a .libs/libprev_la-Judy1Prev.o .libs/libprev_la-Judy1PrevEmpty.o
  1281. libtool: link: ranlib .libs/libprev.a
  1282. libtool: link: ( cd ".libs" && rm -f "libprev.la" && ln -s "../libprev.la" "libprev.la" )
  1283. libtool: link: ar cru .libs/libcount.a .libs/libcount_la-Judy1ByCount.o
  1284. libtool: link: ranlib .libs/libcount.a
  1285. libtool: link: ar cru .libs/libinline.a .libs/libinline_la-j__udy1Test.o
  1286. libtool: link: ( cd ".libs" && rm -f "libcount.la" && ln -s "../libcount.la" "libcount.la" )
  1287. libtool: link: ranlib .libs/libinline.a
  1288. libtool: link: ar cru .libs/libJudy1.a .libs/Judy1Test.o .libs/Judy1Tables.o .libs/Judy1Set.o .libs/Judy1SetArray.o .libs/Judy1Unset.o .libs/Judy1Cascade.o .libs/Judy1Count.o .libs/Judy1CreateBranch.o .libs/Judy1Decascade.o .libs/Judy1First.o .libs/Judy1FreeArray.o .libs/Judy1InsertBranch.o .libs/Judy1MallocIF.o .libs/Judy1MemActive.o .libs/Judy1MemUsed.o
  1289. libtool: link: ( cd ".libs" && rm -f "libinline.la" && ln -s "../libinline.la" "libinline.la" )
  1290. libtool: link: ranlib .libs/libJudy1.a
  1291. libtool: link: ( cd ".libs" && rm -f "libJudy1.la" && ln -s "../libJudy1.la" "libJudy1.la" )
  1292. Making all in JudySL
  1293. /bin/sh ../../libtool  --tag=CC   --mode=compile gcc -DHAVE_CONFIG_H -I. -I../.. -I. -I.. -I../JudyCommon/    -fPIC -DJU_64BIT   -fPIC -DJU_64BIT -MT JudySL.lo -MD -MP -MF .deps/JudySL.Tpo -c -o JudySL.lo JudySL.c
  1294. libtool: compile:  gcc -DHAVE_CONFIG_H -I. -I../.. -I. -I.. -I../JudyCommon/ -fPIC -DJU_64BIT -fPIC -DJU_64BIT -MT JudySL.lo -MD -MP -MF .deps/JudySL.Tpo -c JudySL.c  -fno-common -DPIC -o .libs/JudySL.o
  1295. libtool: compile:  gcc -DHAVE_CONFIG_H -I. -I../.. -I. -I.. -I../JudyCommon/ -fPIC -DJU_64BIT -fPIC -DJU_64BIT -MT JudySL.lo -MD -MP -MF .deps/JudySL.Tpo -c JudySL.c -o JudySL.o >/dev/null 2>&1
  1296. mv -f .deps/JudySL.Tpo .deps/JudySL.Plo
  1297. /bin/sh ../../libtool  --tag=CC   --mode=link gcc -fPIC -DJU_64BIT   -fPIC -DJU_64BIT   -o libJudySL.la  JudySL.lo  
  1298. libtool: link: ar cru .libs/libJudySL.a .libs/JudySL.o
  1299. libtool: link: ranlib .libs/libJudySL.a
  1300. libtool: link: ( cd ".libs" && rm -f "libJudySL.la" && ln -s "../libJudySL.la" "libJudySL.la" )
  1301. Making all in JudyHS
  1302. /bin/sh ../../libtool  --tag=CC   --mode=compile gcc -DHAVE_CONFIG_H -I. -I../.. -I. -I.. -I../JudyCommon/    -fPIC -DJU_64BIT   -fPIC -DJU_64BIT -MT JudyHS.lo -MD -MP -MF .deps/JudyHS.Tpo -c -o JudyHS.lo JudyHS.c
  1303. libtool: compile:  gcc -DHAVE_CONFIG_H -I. -I../.. -I. -I.. -I../JudyCommon/ -fPIC -DJU_64BIT -fPIC -DJU_64BIT -MT JudyHS.lo -MD -MP -MF .deps/JudyHS.Tpo -c JudyHS.c  -fno-common -DPIC -o .libs/JudyHS.o
  1304. libtool: compile:  gcc -DHAVE_CONFIG_H -I. -I../.. -I. -I.. -I../JudyCommon/ -fPIC -DJU_64BIT -fPIC -DJU_64BIT -MT JudyHS.lo -MD -MP -MF .deps/JudyHS.Tpo -c JudyHS.c -o JudyHS.o >/dev/null 2>&1
  1305. mv -f .deps/JudyHS.Tpo .deps/JudyHS.Plo
  1306. /bin/sh ../../libtool  --tag=CC   --mode=link gcc -fPIC -DJU_64BIT   -fPIC -DJU_64BIT   -o libJudyHS.la  JudyHS.lo  
  1307. libtool: link: ar cru .libs/libJudyHS.a .libs/JudyHS.o
  1308. libtool: link: ranlib .libs/libJudyHS.a
  1309. libtool: link: ( cd ".libs" && rm -f "libJudyHS.la" && ln -s "../libJudyHS.la" "libJudyHS.la" )
  1310. Making all in obj
  1311. /bin/sh ../../libtool  --tag=CC   --mode=link gcc  -fPIC -DJU_64BIT -version-info 1:3:0  -o libJudy.la -rpath /usr/local/lib  ../JudyCommon/*.lo ../JudyL/*.lo ../Judy1/*.lo ../JudyHS/*.lo ../JudySL/*.lo  
  1312. libtool: link: gcc -dynamiclib -Wl,-undefined -Wl,dynamic_lookup -o .libs/libJudy.1.dylib  ../JudyCommon/.libs/JudyMalloc.o ../JudyL/.libs/JudyLCascade.o ../JudyL/.libs/JudyLCount.o ../JudyL/.libs/JudyLCreateBranch.o ../JudyL/.libs/JudyLDecascade.o ../JudyL/.libs/JudyLDel.o ../JudyL/.libs/JudyLFirst.o ../JudyL/.libs/JudyLFreeArray.o ../JudyL/.libs/JudyLGet.o ../JudyL/.libs/JudyLIns.o ../JudyL/.libs/JudyLInsArray.o ../JudyL/.libs/JudyLInsertBranch.o ../JudyL/.libs/JudyLMallocIF.o ../JudyL/.libs/JudyLMemActive.o ../JudyL/.libs/JudyLMemUsed.o ../JudyL/.libs/JudyLTables.o ../JudyL/.libs/libcount_la-JudyLByCount.o ../JudyL/.libs/libinline_la-j__udyLGet.o ../JudyL/.libs/libnext_la-JudyLNext.o ../JudyL/.libs/libnext_la-JudyLNextEmpty.o ../JudyL/.libs/libprev_la-JudyLPrev.o ../JudyL/.libs/libprev_la-JudyLPrevEmpty.o ../Judy1/.libs/Judy1Cascade.o ../Judy1/.libs/Judy1Count.o ../Judy1/.libs/Judy1CreateBranch.o ../Judy1/.libs/Judy1Decascade.o ../Judy1/.libs/Judy1First.o ../Judy1/.libs/Judy1FreeArray.o ../Judy1/.libs/Judy1InsertBranch.o ../Judy1/.libs/Judy1MallocIF.o ../Judy1/.libs/Judy1MemActive.o ../Judy1/.libs/Judy1MemUsed.o ../Judy1/.libs/Judy1Set.o ../Judy1/.libs/Judy1SetArray.o ../Judy1/.libs/Judy1Tables.o ../Judy1/.libs/Judy1Test.o ../Judy1/.libs/Judy1Unset.o ../Judy1/.libs/libcount_la-Judy1ByCount.o ../Judy1/.libs/libinline_la-j__udy1Test.o ../Judy1/.libs/libnext_la-Judy1Next.o ../Judy1/.libs/libnext_la-Judy1NextEmpty.o ../Judy1/.libs/libprev_la-Judy1Prev.o ../Judy1/.libs/libprev_la-Judy1PrevEmpty.o ../JudyHS/.libs/JudyHS.o ../JudySL/.libs/JudySL.o      -install_name  /usr/local/lib/libJudy.1.dylib -compatibility_version 2 -current_version 2.3 -Wl,-single_module
  1313. libtool: link: (cd ".libs" && rm -f "libJudy.dylib" && ln -s "libJudy.1.dylib" "libJudy.dylib")
  1314. libtool: link: ar cru .libs/libJudy.a  ../JudyCommon/JudyMalloc.o ../JudyL/JudyLCascade.o ../JudyL/JudyLCount.o ../JudyL/JudyLCreateBranch.o ../JudyL/JudyLDecascade.o ../JudyL/JudyLDel.o ../JudyL/JudyLFirst.o ../JudyL/JudyLFreeArray.o ../JudyL/JudyLGet.o ../JudyL/JudyLIns.o ../JudyL/JudyLInsArray.o ../JudyL/JudyLInsertBranch.o ../JudyL/JudyLMallocIF.o ../JudyL/JudyLMemActive.o ../JudyL/JudyLMemUsed.o ../JudyL/JudyLTables.o ../JudyL/libcount_la-JudyLByCount.o ../JudyL/libinline_la-j__udyLGet.o ../JudyL/libnext_la-JudyLNext.o ../JudyL/libnext_la-JudyLNextEmpty.o ../JudyL/libprev_la-JudyLPrev.o ../JudyL/libprev_la-JudyLPrevEmpty.o ../Judy1/Judy1Cascade.o ../Judy1/Judy1Count.o ../Judy1/Judy1CreateBranch.o ../Judy1/Judy1Decascade.o ../Judy1/Judy1First.o ../Judy1/Judy1FreeArray.o ../Judy1/Judy1InsertBranch.o ../Judy1/Judy1MallocIF.o ../Judy1/Judy1MemActive.o ../Judy1/Judy1MemUsed.o ../Judy1/Judy1Set.o ../Judy1/Judy1SetArray.o ../Judy1/Judy1Tables.o ../Judy1/Judy1Test.o ../Judy1/Judy1Unset.o ../Judy1/libcount_la-Judy1ByCount.o ../Judy1/libinline_la-j__udy1Test.o ../Judy1/libnext_la-Judy1Next.o ../Judy1/libnext_la-Judy1NextEmpty.o ../Judy1/libprev_la-Judy1Prev.o ../Judy1/libprev_la-Judy1PrevEmpty.o ../JudyHS/JudyHS.o ../JudySL/JudySL.o
  1315. libtool: link: ranlib .libs/libJudy.a
  1316. libtool: link: ( cd ".libs" && rm -f "libJudy.la" && ln -s "../libJudy.la" "libJudy.la" )
  1317. OK  
  1318.  
  1319. [/var/folders/zz/zyxvpxvq6csfxvn_n0000000000000/T/netdata-judy-XXXXXX.Zd3J08rf/libjudy-1.0.5-netdata2]# env CFLAGS=-fPIC CXXFLAGS= LDFLAGS= ar -r src/libJudy.a src/Judy1/Judy1Cascade.o src/Judy1/Judy1Count.o src/Judy1/Judy1CreateBranch.o src/Judy1/Judy1Decascade.o src/Judy1/Judy1First.o src/Judy1/Judy1FreeArray.o src/Judy1/Judy1InsertBranch.o src/Judy1/Judy1MallocIF.o src/Judy1/Judy1MemActive.o src/Judy1/Judy1MemUsed.o src/Judy1/Judy1Set.o src/Judy1/Judy1SetArray.o src/Judy1/Judy1Tables.o src/Judy1/Judy1Test.o src/Judy1/Judy1Unset.o src/Judy1/libcount_la-Judy1ByCount.o src/Judy1/libinline_la-j__udy1Test.o src/Judy1/libnext_la-Judy1Next.o src/Judy1/libnext_la-Judy1NextEmpty.o src/Judy1/libprev_la-Judy1Prev.o src/Judy1/libprev_la-Judy1PrevEmpty.o src/JudyCommon/JudyMalloc.o src/JudyHS/JudyHS.o src/JudyL/JudyLCascade.o src/JudyL/JudyLCount.o src/JudyL/JudyLCreateBranch.o src/JudyL/JudyLDecascade.o src/JudyL/JudyLDel.o src/JudyL/JudyLFirst.o src/JudyL/JudyLFreeArray.o src/JudyL/JudyLGet.o src/JudyL/JudyLIns.o src/JudyL/JudyLInsArray.o src/JudyL/JudyLInsertBranch.o src/JudyL/JudyLMallocIF.o src/JudyL/JudyLMemActive.o src/JudyL/JudyLMemUsed.o src/JudyL/JudyLTables.o src/JudyL/libcount_la-JudyLByCount.o src/JudyL/libinline_la-j__udyLGet.o src/JudyL/libnext_la-JudyLNext.o src/JudyL/libnext_la-JudyLNextEmpty.o src/JudyL/libprev_la-JudyLPrev.o src/JudyL/libprev_la-JudyLPrevEmpty.o src/JudySL/JudySL.o
  1320. ar: creating archive src/libJudy.a
  1321. OK  
  1322.  
  1323. [/var/folders/zz/zyxvpxvq6csfxvn_n0000000000000/T/netdata-updater-XXXXXXXXXX.IEZCYuie/netdata-v1.33.1-78-g9ef13f190]# mkdir -p /var/folders/zz/zyxvpxvq6csfxvn_n0000000000000/T/netdata-updater-XXXXXXXXXX.IEZCYuie/netdata-v1.33.1-78-g9ef13f190/externaldeps/libJudy
  1324. OK  
  1325.  
  1326. [/var/folders/zz/zyxvpxvq6csfxvn_n0000000000000/T/netdata-updater-XXXXXXXXXX.IEZCYuie/netdata-v1.33.1-78-g9ef13f190]# cp /var/folders/zz/zyxvpxvq6csfxvn_n0000000000000/T/netdata-judy-XXXXXX.Zd3J08rf/libjudy-1.0.5-netdata2/src/libJudy.a /var/folders/zz/zyxvpxvq6csfxvn_n0000000000000/T/netdata-updater-XXXXXXXXXX.IEZCYuie/netdata-v1.33.1-78-g9ef13f190/externaldeps/libJudy/libJudy.a
  1327. OK  
  1328.  
  1329. [/var/folders/zz/zyxvpxvq6csfxvn_n0000000000000/T/netdata-updater-XXXXXXXXXX.IEZCYuie/netdata-v1.33.1-78-g9ef13f190]# cp /var/folders/zz/zyxvpxvq6csfxvn_n0000000000000/T/netdata-judy-XXXXXX.Zd3J08rf/libjudy-1.0.5-netdata2/src/Judy.h /var/folders/zz/zyxvpxvq6csfxvn_n0000000000000/T/netdata-updater-XXXXXXXXXX.IEZCYuie/netdata-v1.33.1-78-g9ef13f190/externaldeps/libJudy/Judy.h
  1330. OK  
  1331.  
  1332. OK  libJudy built and prepared.
  1333.  
  1334.  
  1335. --- Run autotools to configure the build environment ---
  1336. [/var/folders/zz/zyxvpxvq6csfxvn_n0000000000000/T/netdata-updater-XXXXXXXXXX.IEZCYuie/netdata-v1.33.1-78-g9ef13f190]# autoreconf -ivf
  1337. autoreconf: export WARNINGS=
  1338. autoreconf: Entering directory '.'
  1339. autoreconf: configure.ac: not using Gettext
  1340. autoreconf: running: aclocal --force -I build/m4
  1341. autoreconf: configure.ac: tracing
  1342. autoreconf: configure.ac: not using Libtool
  1343. autoreconf: configure.ac: not using Intltool
  1344. autoreconf: configure.ac: not using Gtkdoc
  1345. autoreconf: running: /usr/local/Cellar/autoconf/2.71/bin/autoconf --force
  1346. configure.ac:39: warning: The macro `AC_PROG_CC_C99' is obsolete.
  1347. configure.ac:39: You should run autoupdate.
  1348. ./lib/autoconf/c.m4:1659: AC_PROG_CC_C99 is expanded from...
  1349. configure.ac:39: the top level
  1350. configure.ac:307: warning: The macro `ACX_PTHREAD' is obsolete.
  1351. configure.ac:307: You should run autoupdate.
  1352. build/m4/ax_pthread.m4:63: ACX_PTHREAD is expanded from...
  1353. configure.ac:307: the top level
  1354. configure.ac:534: warning: The macro `AC_TRY_LINK' is obsolete.
  1355. configure.ac:534: You should run autoupdate.
  1356. ./lib/autoconf/general.m4:2920: AC_TRY_LINK is expanded from...
  1357. configure.ac:534: the top level
  1358. configure.ac:1070: warning: The macro `AC_TRY_LINK' is obsolete.
  1359. configure.ac:1070: You should run autoupdate.
  1360. ./lib/autoconf/general.m4:2920: AC_TRY_LINK is expanded from...
  1361. configure.ac:1070: the top level
  1362. configure.ac:1392: warning: The macro `AC_LANG_CPLUSPLUS' is obsolete.
  1363. configure.ac:1392: You should run autoupdate.
  1364. ./lib/autoconf/c.m4:262: AC_LANG_CPLUSPLUS is expanded from...
  1365. configure.ac:1392: the top level
  1366. configure.ac:1398: warning: The macro `AC_TRY_LINK' is obsolete.
  1367. configure.ac:1398: You should run autoupdate.
  1368. ./lib/autoconf/general.m4:2920: AC_TRY_LINK is expanded from...
  1369. configure.ac:1398: the top level
  1370. autoreconf: running: /usr/local/Cellar/autoconf/2.71/bin/autoheader --force
  1371. autoreconf: running: automake --add-missing --copy --force-missing
  1372. autoreconf: Leaving directory '.'
  1373. OK  
  1374.  
  1375. [/var/folders/zz/zyxvpxvq6csfxvn_n0000000000000/T/netdata-updater-XXXXXXXXXX.IEZCYuie/netdata-v1.33.1-78-g9ef13f190]# ./configure --prefix=/usr/local/netdata/usr --sysconfdir=/usr/local/netdata/etc --localstatedir=/usr/local/netdata/var --libexecdir=/usr/local/netdata/usr/libexec --libdir=/usr/local/netdata/usr/lib --with-zlib --with-math --with-user=netdata --enable-cloud --with-bundled-protobuf --with-bundled-libJudy CFLAGS= -I/usr/local/opt/[email protected]/include -I/usr/local/include LDFLAGS= -L/usr/local/opt/[email protected]/lib -L/usr/local/lib
  1376. checking whether to enable maintainer-specific portions of Makefiles... no
  1377. checking for a BSD-compatible install... /usr/bin/install -c
  1378. checking whether build environment is sane... yes
  1379. checking for a race-free mkdir -p... ././install-sh -c -d
  1380. checking for gawk... no
  1381. checking for mawk... no
  1382. checking for nawk... no
  1383. checking for awk... awk
  1384. checking whether make sets $(MAKE)... yes
  1385. checking whether make supports nested variables... yes
  1386. checking how to create a pax tar archive... gnutar
  1387. checking whether make supports nested variables... (cached) yes
  1388. checking build system type... x86_64-apple-darwin19.6.0
  1389. checking host system type... x86_64-apple-darwin19.6.0
  1390. checking for gcc... gcc
  1391. checking whether the C compiler works... yes
  1392. checking for C compiler default output file name... a.out
  1393. checking for suffix of executables...
  1394. checking whether we are cross compiling... no
  1395. checking for suffix of object files... o
  1396. checking whether the compiler supports GNU C... yes
  1397. checking whether gcc accepts -g... yes
  1398. checking for gcc option to enable C11 features... none needed
  1399. checking whether gcc understands -c and -o together... yes
  1400. checking whether make supports the include directive... yes (GNU style)
  1401. checking dependency style of gcc... gcc3
  1402. checking for g++... g++
  1403. checking whether the compiler supports GNU C++... yes
  1404. checking whether g++ accepts -g... yes
  1405. checking for g++ option to enable C++11 features... none needed
  1406. checking dependency style of g++... gcc3
  1407. checking for pkg-config... /usr/local/bin/pkg-config
  1408. checking pkg-config is at least version 0.9.0... yes
  1409. checking for stdio.h... yes
  1410. checking for stdlib.h... yes
  1411. checking for string.h... yes
  1412. checking for inttypes.h... yes
  1413. checking for stdint.h... yes
  1414. checking for strings.h... yes
  1415. checking for sys/stat.h... yes
  1416. checking for sys/types.h... yes
  1417. checking for unistd.h... yes
  1418. checking for wchar.h... yes
  1419. checking for minix/config.h... no
  1420. checking for sys/prctl.h... no
  1421. checking for sys/vfs.h... no
  1422. checking for sys/statfs.h... no
  1423. checking for linux/magic.h... no
  1424. checking for sys/statvfs.h... yes
  1425. checking for sys/mount.h... yes
  1426. checking whether it is safe to define __EXTENSIONS__... yes
  1427. checking whether _XOPEN_SOURCE should be defined... no
  1428. checking for __attribute__((returns_nonnull))... yes
  1429. checking for __attribute__((malloc))... yes
  1430. checking for __attribute__((noreturn))... yes
  1431. checking for __attribute__((noinline))... yes
  1432. checking for __attribute__((format))... yes
  1433. checking for __attribute__((warn_unused_result))... yes
  1434. checking for struct timespec... yes
  1435. checking for clockid_t... yes
  1436. checking for library containing clock_gettime... none required
  1437. checking for clock_gettime... yes
  1438. checking for sched_setscheduler... no
  1439. checking for sched_getscheduler... no
  1440. checking for sched_getparam... no
  1441. checking for sched_get_priority_min... yes
  1442. checking for sched_get_priority_max... yes
  1443. checking for getpriority... yes
  1444. checking for setpriority... yes
  1445. checking for nice... yes
  1446. checking for recvmmsg... no
  1447. checking for int8_t... yes
  1448. checking for int16_t... yes
  1449. checking for int32_t... yes
  1450. checking for int64_t... yes
  1451. checking for uint8_t... yes
  1452. checking for uint16_t... yes
  1453. checking for uint32_t... yes
  1454. checking for uint64_t... yes
  1455. checking for inline... inline
  1456. checking for gcc options needed to detect all undeclared functions... none needed
  1457. checking whether strerror_r is declared... yes
  1458. checking whether strerror_r returns char *... no
  1459. checking for _Generic... yes
  1460. checking for __atomic... yes
  1461. checking for sys/mkdev.h... no
  1462. checking for sys/sysmacros.h... no
  1463. checking for sys/types.h... (cached) yes
  1464. checking for netinet/in.h... yes
  1465. checking for arpa/nameser.h... yes
  1466. checking for netdb.h... yes
  1467. checking for resolv.h... yes
  1468. checking for accept4... no
  1469. checking operating system... Host OS: macos
  1470. checking if compiler needs -Werror to reject unknown flags... yes
  1471. checking whether pthreads work with -pthread... yes
  1472. checking for joinable pthread attribute... PTHREAD_CREATE_JOINABLE
  1473. checking if more special flags are required for pthreads... -D_THREAD_SAFE
  1474. checking for PTHREAD_PRIO_INHERIT... yes
  1475. checking for pthread_getname_np in -lpthread... yes
  1476. checking for sin in -lm... yes
  1477. checking if libm should be used... yes
  1478. checking for uv_fs_scandir_next in -luv... yes
  1479. checking for LZ4_initStream in -llz4... yes
  1480. checking for LZ4_compress_default in -llz4... yes
  1481. checking for zlib... yes
  1482. checking if zlib should be used... yes
  1483. checking for uuid... yes
  1484. checking for SHA256_Init in -lcrypto... yes
  1485. checking for X509_VERIFY_PARAM_set1_host in -lcrypto... yes
  1486. checking for json-c... yes
  1487. checking for json_object_get_type in -ljson-c... yes
  1488. checking for libJudy in yes... yes
  1489. checking if netdata dbengine should be used... yes
  1490. checking if netdata https should be used... yes
  1491. checking if netdata compression should be used... yes
  1492. checking if json-c should be used... yes
  1493. checking for memory allocator... system
  1494. checking for mallopt... no
  1495. checking for mallinfo... no
  1496. checking for libcap... no
  1497. checking if libcap should be used... no
  1498. checking is bundled protobuf available... yes
  1499. configure: using bundled protobuf
  1500. checking for g++... /usr/bin/g++
  1501. checking if Cloud functionality should be enabled... yes
  1502. configure: Checking if ACLK Next Generation can be built
  1503. checking if git submodules present for ACLK Next Generation... yes
  1504. checking if SSL available for ACLK Next Generation... yes
  1505. checking if JSON-C available for ACLK Next Generation... yes
  1506. checking ACLK Next Generation can be built... yes
  1507. checking if protobuf available for New Cloud Protocol... yes
  1508. checking if protoc available for New Cloud Protocol... yes
  1509. checking if C++ compiler available for New Cloud Protocol... yes
  1510. checking ACLK Next Generation can support New Cloud protocol... yes
  1511. checking if apps.plugin should be enabled... no
  1512. checking for libipmimonitoring... no
  1513. checking if freeipmi.plugin should be enabled... no
  1514. checking for httpConnect2 in -lcups... yes
  1515. checking for cups/cups.h... yes
  1516. checking for cups-config... /usr/bin/cups-config
  1517. checking if cups.plugin should be enabled... yes
  1518. checking for linux/netfilter/nfnetlink_conntrack.h... no
  1519. checking for libnetfilter_acct... no
  1520. checking for libmnl... no
  1521. checking if nfacct.plugin should be enabled... no
  1522. checking for yajl... no
  1523. checking for xenstat_init in -lxenstat... no
  1524. checking for xenlight... no
  1525. checking if xenstat.plugin should be enabled... no
  1526. checking for linux/perf_event.h... no
  1527. checking if perf.plugin should be enabled... no
  1528. checking if gtest and gmock can be found... checking for gtest... no
  1529. checking for gmock... no
  1530. checking if git submodules are present for machine learning functionality... yes
  1531. checking whether C++ compiler accepts -std=c++11... yes
  1532. no
  1533. checking if slabinfo.plugin should be enabled... no
  1534. checking for libcrypto... no
  1535. checking for libssl... no
  1536. checking for libcurl... yes
  1537. checking for curl_easy_init in -lcurl... yes
  1538. checking for aws-cpp-sdk-core... no
  1539. checking for aws-cpp-sdk-kinesis... no
  1540. checking if kinesis backend should be enabled... no
  1541. checking for grpc... no
  1542. checking for google_cloud_cpp_pubsub_protos... no
  1543. checking for g++... (cached) /usr/bin/g++
  1544. checking if pubsub exporting connector should be enabled... detect
  1545. checking for snappy::RawCompress in -lsnappy... no
  1546. checking if prometheus remote write backend should be enabled... no
  1547. checking for libmongoc-1.0 >= 1.7... no
  1548. checking if mongodb backend should be enabled... no
  1549. checking for setns... no
  1550. checking if cgroup-network can be enabled... no
  1551. checking if LTO should be enabled... no
  1552. checking whether we can use -latomic... no
  1553. checking for cmocka... no
  1554. configure: CMocka not found on the system. Unit tests disabled
  1555. checking that generated files are newer than configure... done
  1556. configure: creating ./config.status
  1557. config.status: creating Makefile
  1558. config.status: creating netdata.spec
  1559. config.status: creating backends/graphite/Makefile
  1560. config.status: creating backends/json/Makefile
  1561. config.status: creating backends/Makefile
  1562. config.status: creating backends/opentsdb/Makefile
  1563. config.status: creating backends/prometheus/Makefile
  1564. config.status: creating backends/prometheus/remote_write/Makefile
  1565. config.status: creating backends/aws_kinesis/Makefile
  1566. config.status: creating backends/mongodb/Makefile
  1567. config.status: creating collectors/Makefile
  1568. config.status: creating collectors/apps.plugin/Makefile
  1569. config.status: creating collectors/cgroups.plugin/Makefile
  1570. config.status: creating collectors/charts.d.plugin/Makefile
  1571. config.status: creating collectors/checks.plugin/Makefile
  1572. config.status: creating collectors/diskspace.plugin/Makefile
  1573. config.status: creating collectors/timex.plugin/Makefile
  1574. config.status: creating collectors/fping.plugin/Makefile
  1575. config.status: creating collectors/ioping.plugin/Makefile
  1576. config.status: creating collectors/freebsd.plugin/Makefile
  1577. config.status: creating collectors/freeipmi.plugin/Makefile
  1578. config.status: creating collectors/cups.plugin/Makefile
  1579. config.status: creating collectors/idlejitter.plugin/Makefile
  1580. config.status: creating collectors/macos.plugin/Makefile
  1581. config.status: creating collectors/nfacct.plugin/Makefile
  1582. config.status: creating collectors/node.d.plugin/Makefile
  1583. config.status: creating collectors/plugins.d/Makefile
  1584. config.status: creating collectors/proc.plugin/Makefile
  1585. config.status: creating collectors/python.d.plugin/Makefile
  1586. config.status: creating collectors/slabinfo.plugin/Makefile
  1587. config.status: creating collectors/statsd.plugin/Makefile
  1588. config.status: creating collectors/ebpf.plugin/Makefile
  1589. config.status: creating collectors/tc.plugin/Makefile
  1590. config.status: creating collectors/xenstat.plugin/Makefile
  1591. config.status: creating collectors/perf.plugin/Makefile
  1592. config.status: creating daemon/Makefile
  1593. config.status: creating database/Makefile
  1594. config.status: creating database/engine/Makefile
  1595. config.status: creating database/engine/metadata_log/Makefile
  1596. config.status: creating diagrams/Makefile
  1597. config.status: creating exporting/Makefile
  1598. config.status: creating exporting/graphite/Makefile
  1599. config.status: creating exporting/json/Makefile
  1600. config.status: creating exporting/opentsdb/Makefile
  1601. config.status: creating exporting/prometheus/Makefile
  1602. config.status: creating exporting/prometheus/remote_write/Makefile
  1603. config.status: creating exporting/aws_kinesis/Makefile
  1604. config.status: creating exporting/pubsub/Makefile
  1605. config.status: creating exporting/mongodb/Makefile
  1606. config.status: creating exporting/tests/Makefile
  1607. config.status: creating health/Makefile
  1608. config.status: creating health/notifications/Makefile
  1609. config.status: creating ml/Makefile
  1610. config.status: creating ml/kmeans/Makefile
  1611. config.status: creating libnetdata/Makefile
  1612. config.status: creating libnetdata/tests/Makefile
  1613. config.status: creating libnetdata/adaptive_resortable_list/Makefile
  1614. config.status: creating libnetdata/avl/Makefile
  1615. config.status: creating libnetdata/buffer/Makefile
  1616. config.status: creating libnetdata/clocks/Makefile
  1617. config.status: creating libnetdata/completion/Makefile
  1618. config.status: creating libnetdata/config/Makefile
  1619. config.status: creating libnetdata/dictionary/Makefile
  1620. config.status: creating libnetdata/ebpf/Makefile
  1621. config.status: creating libnetdata/eval/Makefile
  1622. config.status: creating libnetdata/locks/Makefile
  1623. config.status: creating libnetdata/log/Makefile
  1624. config.status: creating libnetdata/popen/Makefile
  1625. config.status: creating libnetdata/procfile/Makefile
  1626. config.status: creating libnetdata/simple_pattern/Makefile
  1627. config.status: creating libnetdata/socket/Makefile
  1628. config.status: creating libnetdata/statistical/Makefile
  1629. config.status: creating libnetdata/storage_number/Makefile
  1630. config.status: creating libnetdata/storage_number/tests/Makefile
  1631. config.status: creating libnetdata/threads/Makefile
  1632. config.status: creating libnetdata/url/Makefile
  1633. config.status: creating libnetdata/json/Makefile
  1634. config.status: creating libnetdata/health/Makefile
  1635. config.status: creating registry/Makefile
  1636. config.status: creating streaming/Makefile
  1637. config.status: creating system/Makefile
  1638. config.status: creating tests/Makefile
  1639. config.status: creating web/Makefile
  1640. config.status: creating web/api/Makefile
  1641. config.status: creating web/api/badges/Makefile
  1642. config.status: creating web/api/exporters/Makefile
  1643. config.status: creating web/api/exporters/shell/Makefile
  1644. config.status: creating web/api/exporters/prometheus/Makefile
  1645. config.status: creating web/api/formatters/Makefile
  1646. config.status: creating web/api/formatters/csv/Makefile
  1647. config.status: creating web/api/formatters/json/Makefile
  1648. config.status: creating web/api/formatters/ssv/Makefile
  1649. config.status: creating web/api/formatters/value/Makefile
  1650. config.status: creating web/api/queries/Makefile
  1651. config.status: creating web/api/queries/average/Makefile
  1652. config.status: creating web/api/queries/des/Makefile
  1653. config.status: creating web/api/queries/incremental_sum/Makefile
  1654. config.status: creating web/api/queries/max/Makefile
  1655. config.status: creating web/api/queries/median/Makefile
  1656. config.status: creating web/api/queries/min/Makefile
  1657. config.status: creating web/api/queries/ses/Makefile
  1658. config.status: creating web/api/queries/stddev/Makefile
  1659. config.status: creating web/api/queries/sum/Makefile
  1660. config.status: creating web/api/health/Makefile
  1661. config.status: creating web/gui/Makefile
  1662. config.status: creating web/gui/dashboard/Makefile
  1663. config.status: creating web/server/Makefile
  1664. config.status: creating web/server/static/Makefile
  1665. config.status: creating claim/Makefile
  1666. config.status: creating spawn/Makefile
  1667. config.status: creating parser/Makefile
  1668. config.status: creating config.h
  1669. config.status: executing depfiles commands
  1670. OK  
  1671.  
  1672. --- Cleanup compilation directory ---
  1673. [/var/folders/zz/zyxvpxvq6csfxvn_n0000000000000/T/netdata-updater-XXXXXXXXXX.IEZCYuie/netdata-v1.33.1-78-g9ef13f190]# make clean
  1674. Making clean in diagrams
  1675. make[1]: Nothing to be done for `clean'.
  1676. Making clean in system
  1677. test -z "edit-config netdata-openrc netdata.logrotate netdata.service netdata.service.v235 netdata-init-d netdata-lsb netdata-freebsd netdata.plist netdata.crontab netdata-updater.service " || rm -f edit-config netdata-openrc netdata.logrotate netdata.service netdata.service.v235 netdata-init-d netdata-lsb netdata-freebsd netdata.plist netdata.crontab netdata-updater.service
  1678. Making clean in tests
  1679. test -z "health_mgmtapi/health-cmdapi-test.sh acls/acl.sh urls/request.sh alarm_repetition/alarm.sh template_dimension/template_dim.sh " || rm -f health_mgmtapi/health-cmdapi-test.sh acls/acl.sh urls/request.sh alarm_repetition/alarm.sh template_dimension/template_dim.sh
  1680. Making clean in backends
  1681. Making clean in graphite
  1682. make[2]: Nothing to be done for `clean'.
  1683. Making clean in json
  1684. make[2]: Nothing to be done for `clean'.
  1685. Making clean in opentsdb
  1686. make[2]: Nothing to be done for `clean'.
  1687. Making clean in prometheus
  1688. Making clean in remote_write
  1689. test -z "remote_write.pb.cc remote_write.pb.h " || rm -f remote_write.pb.cc remote_write.pb.h
  1690. make[3]: Nothing to be done for `clean-am'.
  1691. Making clean in aws_kinesis
  1692. make[2]: Nothing to be done for `clean'.
  1693. Making clean in mongodb
  1694. make[2]: Nothing to be done for `clean'.
  1695. make[2]: Nothing to be done for `clean-am'.
  1696. Making clean in collectors
  1697. Making clean in plugins.d
  1698. make[3]: Nothing to be done for `clean-am'.
  1699. Making clean in apps.plugin
  1700. make[2]: Nothing to be done for `clean'.
  1701. Making clean in cgroups.plugin
  1702. test -z "cgroup-name.sh " || rm -f cgroup-name.sh
  1703. Making clean in charts.d.plugin
  1704. test -z "charts.d.plugin " || rm -f charts.d.plugin
  1705. Making clean in checks.plugin
  1706. make[2]: Nothing to be done for `clean'.
  1707. Making clean in cups.plugin
  1708. make[2]: Nothing to be done for `clean'.
  1709. Making clean in diskspace.plugin
  1710. make[2]: Nothing to be done for `clean'.
  1711. Making clean in timex.plugin
  1712. make[2]: Nothing to be done for `clean'.
  1713. Making clean in fping.plugin
  1714. test -z "fping.plugin " || rm -f fping.plugin
  1715. Making clean in ioping.plugin
  1716. test -z "ioping.plugin " || rm -f ioping.plugin
  1717. Making clean in freebsd.plugin
  1718. make[2]: Nothing to be done for `clean'.
  1719. Making clean in freeipmi.plugin
  1720. make[2]: Nothing to be done for `clean'.
  1721. Making clean in idlejitter.plugin
  1722. make[2]: Nothing to be done for `clean'.
  1723. Making clean in macos.plugin
  1724. make[2]: Nothing to be done for `clean'.
  1725. Making clean in nfacct.plugin
  1726. make[2]: Nothing to be done for `clean'.
  1727. Making clean in xenstat.plugin
  1728. make[2]: Nothing to be done for `clean'.
  1729. Making clean in perf.plugin
  1730. make[2]: Nothing to be done for `clean'.
  1731. Making clean in node.d.plugin
  1732. test -z "node.d.plugin " || rm -f node.d.plugin
  1733. Making clean in proc.plugin
  1734. make[2]: Nothing to be done for `clean'.
  1735. Making clean in python.d.plugin
  1736. test -z "python.d.plugin " || rm -f python.d.plugin
  1737. Making clean in slabinfo.plugin
  1738. test -z "slabinfo.plugin " || rm -f slabinfo.plugin
  1739. Making clean in statsd.plugin
  1740. make[2]: Nothing to be done for `clean'.
  1741. Making clean in ebpf.plugin
  1742. make[2]: Nothing to be done for `clean'.
  1743. Making clean in tc.plugin
  1744. test -z "tc-qos-helper.sh " || rm -f tc-qos-helper.sh
  1745. make[2]: Nothing to be done for `clean-am'.
  1746. Making clean in daemon
  1747. test -z "anonymous-statistics.sh " || rm -f anonymous-statistics.sh
  1748. Making clean in database
  1749. Making clean in engine
  1750. Making clean in metadata_log
  1751. make[3]: Nothing to be done for `clean'.
  1752. make[3]: Nothing to be done for `clean-am'.
  1753. make[2]: Nothing to be done for `clean-am'.
  1754. Making clean in exporting
  1755. Making clean in tests
  1756. make[2]: Nothing to be done for `clean'.
  1757. Making clean in graphite
  1758. make[2]: Nothing to be done for `clean'.
  1759. Making clean in json
  1760. make[2]: Nothing to be done for `clean'.
  1761. Making clean in opentsdb
  1762. make[2]: Nothing to be done for `clean'.
  1763. Making clean in prometheus
  1764. Making clean in remote_write
  1765. test -z "remote_write.pb.cc remote_write.pb.h " || rm -f remote_write.pb.cc remote_write.pb.h
  1766. make[3]: Nothing to be done for `clean-am'.
  1767. Making clean in aws_kinesis
  1768. make[2]: Nothing to be done for `clean'.
  1769. Making clean in pubsub
  1770. make[2]: Nothing to be done for `clean'.
  1771. Making clean in mongodb
  1772. make[2]: Nothing to be done for `clean'.
  1773. make[2]: Nothing to be done for `clean-am'.
  1774. Making clean in health
  1775. Making clean in notifications
  1776. test -z "alarm-notify.sh " || rm -f alarm-notify.sh
  1777. test -z "" || rm -f
  1778. Making clean in libnetdata
  1779. Making clean in adaptive_resortable_list
  1780. make[2]: Nothing to be done for `clean'.
  1781. Making clean in avl
  1782. make[2]: Nothing to be done for `clean'.
  1783. Making clean in buffer
  1784. make[2]: Nothing to be done for `clean'.
  1785. Making clean in clocks
  1786. make[2]: Nothing to be done for `clean'.
  1787. Making clean in completion
  1788. make[2]: Nothing to be done for `clean'.
  1789. Making clean in config
  1790. make[2]: Nothing to be done for `clean'.
  1791. Making clean in dictionary
  1792. make[2]: Nothing to be done for `clean'.
  1793. Making clean in ebpf
  1794. make[2]: Nothing to be done for `clean'.
  1795. Making clean in eval
  1796. make[2]: Nothing to be done for `clean'.
  1797. Making clean in json
  1798. make[2]: Nothing to be done for `clean'.
  1799. Making clean in health
  1800. make[2]: Nothing to be done for `clean'.
  1801. Making clean in locks
  1802. make[2]: Nothing to be done for `clean'.
  1803. Making clean in log
  1804. make[2]: Nothing to be done for `clean'.
  1805. Making clean in popen
  1806. make[2]: Nothing to be done for `clean'.
  1807. Making clean in procfile
  1808. make[2]: Nothing to be done for `clean'.
  1809. Making clean in simple_pattern
  1810. make[2]: Nothing to be done for `clean'.
  1811. Making clean in socket
  1812. make[2]: Nothing to be done for `clean'.
  1813. Making clean in statistical
  1814. make[2]: Nothing to be done for `clean'.
  1815. Making clean in storage_number
  1816. Making clean in tests
  1817. make[3]: Nothing to be done for `clean'.
  1818. make[3]: Nothing to be done for `clean-am'.
  1819. Making clean in threads
  1820. make[2]: Nothing to be done for `clean'.
  1821. Making clean in url
  1822. make[2]: Nothing to be done for `clean'.
  1823. Making clean in tests
  1824. make[2]: Nothing to be done for `clean'.
  1825. make[2]: Nothing to be done for `clean-am'.
  1826. Making clean in registry
  1827. make[1]: Nothing to be done for `clean'.
  1828. Making clean in streaming
  1829. make[1]: Nothing to be done for `clean'.
  1830. Making clean in web
  1831. Making clean in api
  1832. Making clean in badges
  1833. make[3]: Nothing to be done for `clean'.
  1834. Making clean in queries
  1835. Making clean in average
  1836. make[4]: Nothing to be done for `clean'.
  1837. Making clean in des
  1838. make[4]: Nothing to be done for `clean'.
  1839. Making clean in incremental_sum
  1840. make[4]: Nothing to be done for `clean'.
  1841. Making clean in max
  1842. make[4]: Nothing to be done for `clean'.
  1843. Making clean in min
  1844. make[4]: Nothing to be done for `clean'.
  1845. Making clean in sum
  1846. make[4]: Nothing to be done for `clean'.
  1847. Making clean in median
  1848. make[4]: Nothing to be done for `clean'.
  1849. Making clean in ses
  1850. make[4]: Nothing to be done for `clean'.
  1851. Making clean in stddev
  1852. make[4]: Nothing to be done for `clean'.
  1853. make[4]: Nothing to be done for `clean-am'.
  1854. Making clean in exporters
  1855. Making clean in shell
  1856. make[4]: Nothing to be done for `clean'.
  1857. Making clean in prometheus
  1858. make[4]: Nothing to be done for `clean'.
  1859. make[4]: Nothing to be done for `clean-am'.
  1860. Making clean in formatters
  1861. Making clean in csv
  1862. make[4]: Nothing to be done for `clean'.
  1863. Making clean in json
  1864. make[4]: Nothing to be done for `clean'.
  1865. Making clean in ssv
  1866. make[4]: Nothing to be done for `clean'.
  1867. Making clean in value
  1868. make[4]: Nothing to be done for `clean'.
  1869. make[4]: Nothing to be done for `clean-am'.
  1870. Making clean in health
  1871. make[3]: Nothing to be done for `clean'.
  1872. make[3]: Nothing to be done for `clean-am'.
  1873. Making clean in gui
  1874. Making clean in dashboard
  1875. make[3]: Nothing to be done for `clean'.
  1876. test -z "version.txt " || rm -f version.txt
  1877. Making clean in server
  1878. Making clean in static
  1879. make[4]: Nothing to be done for `clean-am'.
  1880. make[3]: Nothing to be done for `clean-am'.
  1881. make[2]: Nothing to be done for `clean-am'.
  1882. Making clean in claim
  1883. test -z "netdata-claim.sh " || rm -f netdata-claim.sh
  1884. Making clean in parser
  1885. make[1]: Nothing to be done for `clean'.
  1886. Making clean in spawn
  1887. make[1]: Nothing to be done for `clean'.
  1888. Making clean in ml
  1889. Making clean in kmeans
  1890. make[2]: Nothing to be done for `clean'.
  1891. make[2]: Nothing to be done for `clean-am'.
  1892. test -z "" || rm -f
  1893. test -z "./netdata-v1.33.1-78-nightly.tar.gz aclk/aclk-schemas/proto/agent/v1/connection.pb.cc aclk/aclk-schemas/proto/agent/v1/connection.pb.h aclk/aclk-schemas/proto/nodeinstance/connection/v1/connection.pb.cc aclk/aclk-schemas/proto/nodeinstance/connection/v1/connection.pb.h aclk/aclk-schemas/proto/nodeinstance/create/v1/creation.pb.cc aclk/aclk-schemas/proto/nodeinstance/create/v1/creation.pb.h aclk/aclk-schemas/proto/chart/v1/stream.pb.cc aclk/aclk-schemas/proto/chart/v1/stream.pb.h aclk/aclk-schemas/proto/chart/v1/instance.pb.cc aclk/aclk-schemas/proto/chart/v1/instance.pb.h aclk/aclk-schemas/proto/chart/v1/dimension.pb.cc aclk/aclk-schemas/proto/chart/v1/dimension.pb.h aclk/aclk-schemas/proto/chart/v1/config.pb.cc aclk/aclk-schemas/proto/chart/v1/config.pb.h aclk/aclk-schemas/proto/aclk/v1/lib.pb.cc aclk/aclk-schemas/proto/aclk/v1/lib.pb.h aclk/aclk-schemas/proto/agent/v1/disconnect.pb.cc aclk/aclk-schemas/proto/agent/v1/disconnect.pb.h aclk/aclk-schemas/proto/alarm/v1/config.pb.cc aclk/aclk-schemas/proto/alarm/v1/config.pb.h aclk/aclk-schemas/proto/alarm/v1/stream.pb.cc aclk/aclk-schemas/proto/alarm/v1/stream.pb.h aclk/aclk-schemas/proto/nodeinstance/info/v1/info.pb.cc aclk/aclk-schemas/proto/nodeinstance/info/v1/info.pb.h " || rm -f ./netdata-v1.33.1-78-nightly.tar.gz aclk/aclk-schemas/proto/agent/v1/connection.pb.cc aclk/aclk-schemas/proto/agent/v1/connection.pb.h aclk/aclk-schemas/proto/nodeinstance/connection/v1/connection.pb.cc aclk/aclk-schemas/proto/nodeinstance/connection/v1/connection.pb.h aclk/aclk-schemas/proto/nodeinstance/create/v1/creation.pb.cc aclk/aclk-schemas/proto/nodeinstance/create/v1/creation.pb.h aclk/aclk-schemas/proto/chart/v1/stream.pb.cc aclk/aclk-schemas/proto/chart/v1/stream.pb.h aclk/aclk-schemas/proto/chart/v1/instance.pb.cc aclk/aclk-schemas/proto/chart/v1/instance.pb.h aclk/aclk-schemas/proto/chart/v1/dimension.pb.cc aclk/aclk-schemas/proto/chart/v1/dimension.pb.h aclk/aclk-schemas/proto/chart/v1/config.pb.cc aclk/aclk-schemas/proto/chart/v1/config.pb.h aclk/aclk-schemas/proto/aclk/v1/lib.pb.cc aclk/aclk-schemas/proto/aclk/v1/lib.pb.h aclk/aclk-schemas/proto/agent/v1/disconnect.pb.cc aclk/aclk-schemas/proto/agent/v1/disconnect.pb.h aclk/aclk-schemas/proto/alarm/v1/config.pb.cc aclk/aclk-schemas/proto/alarm/v1/config.pb.h aclk/aclk-schemas/proto/alarm/v1/stream.pb.cc aclk/aclk-schemas/proto/alarm/v1/stream.pb.h aclk/aclk-schemas/proto/nodeinstance/info/v1/info.pb.cc aclk/aclk-schemas/proto/nodeinstance/info/v1/info.pb.h
  1894. test -z "    cups.plugin    " || rm -f     cups.plugin    
  1895. test -z "netdata netdatacli" || rm -f netdata netdatacli
  1896. rm -f *.o
  1897. rm -f aclk/*.o
  1898. rm -f aclk/aclk-schemas/proto/aclk/v1/*.o
  1899. rm -f aclk/aclk-schemas/proto/agent/v1/*.o
  1900. rm -f aclk/aclk-schemas/proto/alarm/v1/*.o
  1901. rm -f aclk/aclk-schemas/proto/chart/v1/*.o
  1902. rm -f aclk/aclk-schemas/proto/nodeinstance/connection/v1/*.o
  1903. rm -f aclk/aclk-schemas/proto/nodeinstance/create/v1/*.o
  1904. rm -f aclk/aclk-schemas/proto/nodeinstance/info/v1/*.o
  1905. rm -f aclk/schema-wrappers/*.o
  1906. rm -f backends/*.o
  1907. rm -f backends/aws_kinesis/*.o
  1908. rm -f backends/graphite/*.o
  1909. rm -f backends/json/*.o
  1910. rm -f backends/mongodb/*.o
  1911. rm -f backends/opentsdb/*.o
  1912. rm -f backends/prometheus/*.o
  1913. rm -f backends/prometheus/remote_write/*.o
  1914. rm -f claim/*.o
  1915. rm -f cli/*.o
  1916. rm -f collectors/apps.plugin/*.o
  1917. rm -f collectors/cgroups.plugin/*.o
  1918. rm -f collectors/cgroups.plugin/tests/*.o
  1919. rm -f collectors/checks.plugin/*.o
  1920. rm -f collectors/cups.plugin/*.o
  1921. rm -f collectors/diskspace.plugin/*.o
  1922. rm -f collectors/ebpf.plugin/*.o
  1923. rm -f collectors/freebsd.plugin/*.o
  1924. rm -f collectors/freeipmi.plugin/*.o
  1925. rm -f collectors/idlejitter.plugin/*.o
  1926. rm -f collectors/macos.plugin/*.o
  1927. rm -f collectors/nfacct.plugin/*.o
  1928. rm -f collectors/perf.plugin/*.o
  1929. rm -f collectors/plugins.d/*.o
  1930. rm -f collectors/proc.plugin/*.o
  1931. rm -f collectors/slabinfo.plugin/*.o
  1932. rm -f collectors/statsd.plugin/*.o
  1933. rm -f collectors/tc.plugin/*.o
  1934. rm -f collectors/timex.plugin/*.o
  1935. rm -f collectors/xenstat.plugin/*.o
  1936. rm -f daemon/*.o
  1937. rm -f database/*.o
  1938. rm -f database/engine/*.o
  1939. rm -f database/engine/metadata_log/*.o
  1940. rm -f database/sqlite/*.o
  1941. rm -f exporting/*.o
  1942. rm -f exporting/aws_kinesis/*.o
  1943. rm -f exporting/graphite/*.o
  1944. rm -f exporting/json/*.o
  1945. rm -f exporting/mongodb/*.o
  1946. rm -f exporting/opentsdb/*.o
  1947. rm -f exporting/prometheus/*.o
  1948. rm -f exporting/prometheus/remote_write/*.o
  1949. rm -f exporting/pubsub/*.o
  1950. rm -f exporting/tests/*.o
  1951. rm -f health/*.o
  1952. rm -f libnetdata/*.o
  1953. rm -f libnetdata/adaptive_resortable_list/*.o
  1954. rm -f libnetdata/avl/*.o
  1955. rm -f libnetdata/buffer/*.o
  1956. rm -f libnetdata/circular_buffer/*.o
  1957. rm -f libnetdata/clocks/*.o
  1958. rm -f libnetdata/completion/*.o
  1959. rm -f libnetdata/config/*.o
  1960. rm -f libnetdata/dictionary/*.o
  1961. rm -f libnetdata/ebpf/*.o
  1962. rm -f libnetdata/eval/*.o
  1963. rm -f libnetdata/health/*.o
  1964. rm -f libnetdata/json/*.o
  1965. rm -f libnetdata/locks/*.o
  1966. rm -f libnetdata/log/*.o
  1967. rm -f libnetdata/popen/*.o
  1968. rm -f libnetdata/procfile/*.o
  1969. rm -f libnetdata/simple_pattern/*.o
  1970. rm -f libnetdata/socket/*.o
  1971. rm -f libnetdata/statistical/*.o
  1972. rm -f libnetdata/storage_number/*.o
  1973. rm -f libnetdata/storage_number/tests/*.o
  1974. rm -f libnetdata/tests/*.o
  1975. rm -f libnetdata/threads/*.o
  1976. rm -f libnetdata/url/*.o
  1977. rm -f ml/*.o
  1978. rm -f ml/kmeans/*.o
  1979. rm -f ml/kmeans/dlib/dlib/all/*.o
  1980. rm -f mqtt_websockets/MQTT-C/src/*.o
  1981. rm -f mqtt_websockets/c-rbuf/src/*.o
  1982. rm -f mqtt_websockets/src/*.o
  1983. rm -f parser/*.o
  1984. rm -f registry/*.o
  1985. rm -f spawn/*.o
  1986. rm -f streaming/*.o
  1987. rm -f web/api/*.o
  1988. rm -f web/api/badges/*.o
  1989. rm -f web/api/exporters/*.o
  1990. rm -f web/api/exporters/shell/*.o
  1991. rm -f web/api/formatters/*.o
  1992. rm -f web/api/formatters/csv/*.o
  1993. rm -f web/api/formatters/json/*.o
  1994. rm -f web/api/formatters/ssv/*.o
  1995. rm -f web/api/formatters/value/*.o
  1996. rm -f web/api/health/*.o
  1997. rm -f web/api/queries/*.o
  1998. rm -f web/api/queries/average/*.o
  1999. rm -f web/api/queries/des/*.o
  2000. rm -f web/api/queries/incremental_sum/*.o
  2001. rm -f web/api/queries/max/*.o
  2002. rm -f web/api/queries/median/*.o
  2003. rm -f web/api/queries/min/*.o
  2004. rm -f web/api/queries/ses/*.o
  2005. rm -f web/api/queries/stddev/*.o
  2006. rm -f web/api/queries/sum/*.o
  2007. rm -f web/api/tests/*.o
  2008. rm -f web/server/*.o
  2009. rm -f web/server/static/*.o
  2010. test -z "" || rm -f
  2011. test -z "" || rm -f
  2012. test -z "test-suite.log" || rm -f test-suite.log
  2013. OK  
  2014.  
  2015. --- Compile netdata ---
  2016. [/var/folders/zz/zyxvpxvq6csfxvn_n0000000000000/T/netdata-updater-XXXXXXXXXX.IEZCYuie/netdata-v1.33.1-78-g9ef13f190]# make -j4
  2017. /var/folders/zz/zyxvpxvq6csfxvn_n0000000000000/T/netdata-updater-XXXXXXXXXX.IEZCYuie/netdata-v1.33.1-78-g9ef13f190/externaldeps/protobuf/src/protoc -I=aclk/aclk-schemas --cpp_out=./aclk/aclk-schemas aclk/aclk-schemas/proto/agent/v1/connection.proto
  2018. /var/folders/zz/zyxvpxvq6csfxvn_n0000000000000/T/netdata-updater-XXXXXXXXXX.IEZCYuie/netdata-v1.33.1-78-g9ef13f190/externaldeps/protobuf/src/protoc -I=aclk/aclk-schemas --cpp_out=./aclk/aclk-schemas aclk/aclk-schemas/proto/agent/v1/connection.proto
  2019. /var/folders/zz/zyxvpxvq6csfxvn_n0000000000000/T/netdata-updater-XXXXXXXXXX.IEZCYuie/netdata-v1.33.1-78-g9ef13f190/externaldeps/protobuf/src/protoc -I=aclk/aclk-schemas --cpp_out=./aclk/aclk-schemas aclk/aclk-schemas/proto/nodeinstance/connection/v1/connection.proto
  2020. /var/folders/zz/zyxvpxvq6csfxvn_n0000000000000/T/netdata-updater-XXXXXXXXXX.IEZCYuie/netdata-v1.33.1-78-g9ef13f190/externaldeps/protobuf/src/protoc -I=aclk/aclk-schemas --cpp_out=./aclk/aclk-schemas aclk/aclk-schemas/proto/nodeinstance/connection/v1/connection.proto
  2021. /var/folders/zz/zyxvpxvq6csfxvn_n0000000000000/T/netdata-updater-XXXXXXXXXX.IEZCYuie/netdata-v1.33.1-78-g9ef13f190/externaldeps/protobuf/src/protoc -I=aclk/aclk-schemas --cpp_out=./aclk/aclk-schemas aclk/aclk-schemas/proto/nodeinstance/create/v1/creation.proto
  2022. /var/folders/zz/zyxvpxvq6csfxvn_n0000000000000/T/netdata-updater-XXXXXXXXXX.IEZCYuie/netdata-v1.33.1-78-g9ef13f190/externaldeps/protobuf/src/protoc -I=aclk/aclk-schemas --cpp_out=./aclk/aclk-schemas aclk/aclk-schemas/proto/nodeinstance/create/v1/creation.proto
  2023. /var/folders/zz/zyxvpxvq6csfxvn_n0000000000000/T/netdata-updater-XXXXXXXXXX.IEZCYuie/netdata-v1.33.1-78-g9ef13f190/externaldeps/protobuf/src/protoc -I=aclk/aclk-schemas --cpp_out=./aclk/aclk-schemas aclk/aclk-schemas/proto/chart/v1/stream.proto
  2024. /var/folders/zz/zyxvpxvq6csfxvn_n0000000000000/T/netdata-updater-XXXXXXXXXX.IEZCYuie/netdata-v1.33.1-78-g9ef13f190/externaldeps/protobuf/src/protoc -I=aclk/aclk-schemas --cpp_out=./aclk/aclk-schemas aclk/aclk-schemas/proto/chart/v1/stream.proto
  2025. /var/folders/zz/zyxvpxvq6csfxvn_n0000000000000/T/netdata-updater-XXXXXXXXXX.IEZCYuie/netdata-v1.33.1-78-g9ef13f190/externaldeps/protobuf/src/protoc -I=aclk/aclk-schemas --cpp_out=./aclk/aclk-schemas aclk/aclk-schemas/proto/chart/v1/instance.proto
  2026. /var/folders/zz/zyxvpxvq6csfxvn_n0000000000000/T/netdata-updater-XXXXXXXXXX.IEZCYuie/netdata-v1.33.1-78-g9ef13f190/externaldeps/protobuf/src/protoc -I=aclk/aclk-schemas --cpp_out=./aclk/aclk-schemas aclk/aclk-schemas/proto/chart/v1/instance.proto
  2027. /var/folders/zz/zyxvpxvq6csfxvn_n0000000000000/T/netdata-updater-XXXXXXXXXX.IEZCYuie/netdata-v1.33.1-78-g9ef13f190/externaldeps/protobuf/src/protoc -I=aclk/aclk-schemas --cpp_out=./aclk/aclk-schemas aclk/aclk-schemas/proto/chart/v1/dimension.proto
  2028. /var/folders/zz/zyxvpxvq6csfxvn_n0000000000000/T/netdata-updater-XXXXXXXXXX.IEZCYuie/netdata-v1.33.1-78-g9ef13f190/externaldeps/protobuf/src/protoc -I=aclk/aclk-schemas --cpp_out=./aclk/aclk-schemas aclk/aclk-schemas/proto/chart/v1/dimension.proto
  2029. /var/folders/zz/zyxvpxvq6csfxvn_n0000000000000/T/netdata-updater-XXXXXXXXXX.IEZCYuie/netdata-v1.33.1-78-g9ef13f190/externaldeps/protobuf/src/protoc -I=aclk/aclk-schemas --cpp_out=./aclk/aclk-schemas aclk/aclk-schemas/proto/chart/v1/config.proto
  2030. /var/folders/zz/zyxvpxvq6csfxvn_n0000000000000/T/netdata-updater-XXXXXXXXXX.IEZCYuie/netdata-v1.33.1-78-g9ef13f190/externaldeps/protobuf/src/protoc -I=aclk/aclk-schemas --cpp_out=./aclk/aclk-schemas aclk/aclk-schemas/proto/chart/v1/config.proto
  2031. /var/folders/zz/zyxvpxvq6csfxvn_n0000000000000/T/netdata-updater-XXXXXXXXXX.IEZCYuie/netdata-v1.33.1-78-g9ef13f190/externaldeps/protobuf/src/protoc -I=aclk/aclk-schemas --cpp_out=./aclk/aclk-schemas aclk/aclk-schemas/proto/aclk/v1/lib.proto
  2032. /var/folders/zz/zyxvpxvq6csfxvn_n0000000000000/T/netdata-updater-XXXXXXXXXX.IEZCYuie/netdata-v1.33.1-78-g9ef13f190/externaldeps/protobuf/src/protoc -I=aclk/aclk-schemas --cpp_out=./aclk/aclk-schemas aclk/aclk-schemas/proto/aclk/v1/lib.proto
  2033. /var/folders/zz/zyxvpxvq6csfxvn_n0000000000000/T/netdata-updater-XXXXXXXXXX.IEZCYuie/netdata-v1.33.1-78-g9ef13f190/externaldeps/protobuf/src/protoc -I=aclk/aclk-schemas --cpp_out=./aclk/aclk-schemas aclk/aclk-schemas/proto/agent/v1/disconnect.proto
  2034. /var/folders/zz/zyxvpxvq6csfxvn_n0000000000000/T/netdata-updater-XXXXXXXXXX.IEZCYuie/netdata-v1.33.1-78-g9ef13f190/externaldeps/protobuf/src/protoc -I=aclk/aclk-schemas --cpp_out=./aclk/aclk-schemas aclk/aclk-schemas/proto/agent/v1/disconnect.proto
  2035. /var/folders/zz/zyxvpxvq6csfxvn_n0000000000000/T/netdata-updater-XXXXXXXXXX.IEZCYuie/netdata-v1.33.1-78-g9ef13f190/externaldeps/protobuf/src/protoc -I=aclk/aclk-schemas --cpp_out=./aclk/aclk-schemas aclk/aclk-schemas/proto/alarm/v1/config.proto
  2036. /var/folders/zz/zyxvpxvq6csfxvn_n0000000000000/T/netdata-updater-XXXXXXXXXX.IEZCYuie/netdata-v1.33.1-78-g9ef13f190/externaldeps/protobuf/src/protoc -I=aclk/aclk-schemas --cpp_out=./aclk/aclk-schemas aclk/aclk-schemas/proto/alarm/v1/config.proto
  2037. /var/folders/zz/zyxvpxvq6csfxvn_n0000000000000/T/netdata-updater-XXXXXXXXXX.IEZCYuie/netdata-v1.33.1-78-g9ef13f190/externaldeps/protobuf/src/protoc -I=aclk/aclk-schemas --cpp_out=./aclk/aclk-schemas aclk/aclk-schemas/proto/alarm/v1/stream.proto
  2038. /var/folders/zz/zyxvpxvq6csfxvn_n0000000000000/T/netdata-updater-XXXXXXXXXX.IEZCYuie/netdata-v1.33.1-78-g9ef13f190/externaldeps/protobuf/src/protoc -I=aclk/aclk-schemas --cpp_out=./aclk/aclk-schemas aclk/aclk-schemas/proto/alarm/v1/stream.proto
  2039. /var/folders/zz/zyxvpxvq6csfxvn_n0000000000000/T/netdata-updater-XXXXXXXXXX.IEZCYuie/netdata-v1.33.1-78-g9ef13f190/externaldeps/protobuf/src/protoc -I=aclk/aclk-schemas --cpp_out=./aclk/aclk-schemas aclk/aclk-schemas/proto/nodeinstance/info/v1/info.proto
  2040. /var/folders/zz/zyxvpxvq6csfxvn_n0000000000000/T/netdata-updater-XXXXXXXXXX.IEZCYuie/netdata-v1.33.1-78-g9ef13f190/externaldeps/protobuf/src/protoc -I=aclk/aclk-schemas --cpp_out=./aclk/aclk-schemas aclk/aclk-schemas/proto/nodeinstance/info/v1/info.proto
  2041. /Applications/Xcode.app/Contents/Developer/usr/bin/make  all-recursive
  2042. Making all in diagrams
  2043. make[2]: Nothing to be done for `all'.
  2044. Making all in system
  2045. if sed \
  2046.         -e 's#[@]localstatedir_POST@#/usr/local/netdata/var#g' \
  2047.         -e 's#[@]sbindir_POST@#/usr/local/netdata/usr/sbin#g' \
  2048.         -e 's#[@]pluginsdir_POST@#/usr/local/netdata/usr/libexec/netdata/plugins.d#g' \
  2049.         -e 's#[@]configdir_POST@#/usr/local/netdata/etc/netdata#g' \
  2050.         -e 's#[@]libconfigdir_POST@#/usr/local/netdata/usr/lib/netdata/conf.d#g' \
  2051.         -e 's#[@]pkglibexecdir_POST@#/usr/local/netdata/usr/libexec/netdata#g' \
  2052.         -e 's#[@]cachedir_POST@#/usr/local/netdata/var/cache/netdata#g' \
  2053.         -e 's#[@]registrydir_POST@#/usr/local/netdata/var/lib/netdata/registry#g' \
  2054.         -e 's#[@]varlibdir_POST@#/usr/local/netdata/var/lib/netdata#g' \
  2055.         -e 's#[@]webdir_POST@#/usr/local/netdata/usr/share/netdata/web#g' \
  2056.         -e 's#[@]enable_aclk_POST@#yes#g' \
  2057.         -e 's#[@]enable_cloud_POST@#yes#g' \
  2058.         edit-config.in > edit-config.tmp; then \
  2059.         mv "edit-config.tmp" "edit-config"; \
  2060.     else \
  2061.         rm -f "edit-config.tmp"; \
  2062.         false; \
  2063.     fi
  2064. if sed \
  2065.         -e 's#[@]localstatedir_POST@#/usr/local/netdata/var#g' \
  2066.         -e 's#[@]sbindir_POST@#/usr/local/netdata/usr/sbin#g' \
  2067.         -e 's#[@]pluginsdir_POST@#/usr/local/netdata/usr/libexec/netdata/plugins.d#g' \
  2068.         -e 's#[@]configdir_POST@#/usr/local/netdata/etc/netdata#g' \
  2069.         -e 's#[@]libconfigdir_POST@#/usr/local/netdata/usr/lib/netdata/conf.d#g' \
  2070.         -e 's#[@]pkglibexecdir_POST@#/usr/local/netdata/usr/libexec/netdata#g' \
  2071.         -e 's#[@]cachedir_POST@#/usr/local/netdata/var/cache/netdata#g' \
  2072.         -e 's#[@]registrydir_POST@#/usr/local/netdata/var/lib/netdata/registry#g' \
  2073.         -e 's#[@]varlibdir_POST@#/usr/local/netdata/var/lib/netdata#g' \
  2074.         -e 's#[@]webdir_POST@#/usr/local/netdata/usr/share/netdata/web#g' \
  2075.         -e 's#[@]enable_aclk_POST@#yes#g' \
  2076.         -e 's#[@]enable_cloud_POST@#yes#g' \
  2077.         netdata-openrc.in > netdata-openrc.tmp; then \
  2078.         mv "netdata-openrc.tmp" "netdata-openrc"; \
  2079.     else \
  2080.         rm -f "netdata-openrc.tmp"; \
  2081.         false; \
  2082.     fi
  2083. if sed \
  2084.         -e 's#[@]localstatedir_POST@#/usr/local/netdata/var#g' \
  2085.         -e 's#[@]sbindir_POST@#/usr/local/netdata/usr/sbin#g' \
  2086.         -e 's#[@]pluginsdir_POST@#/usr/local/netdata/usr/libexec/netdata/plugins.d#g' \
  2087.         -e 's#[@]configdir_POST@#/usr/local/netdata/etc/netdata#g' \
  2088.         -e 's#[@]libconfigdir_POST@#/usr/local/netdata/usr/lib/netdata/conf.d#g' \
  2089.         -e 's#[@]pkglibexecdir_POST@#/usr/local/netdata/usr/libexec/netdata#g' \
  2090.         -e 's#[@]cachedir_POST@#/usr/local/netdata/var/cache/netdata#g' \
  2091.         -e 's#[@]registrydir_POST@#/usr/local/netdata/var/lib/netdata/registry#g' \
  2092.         -e 's#[@]varlibdir_POST@#/usr/local/netdata/var/lib/netdata#g' \
  2093.         -e 's#[@]webdir_POST@#/usr/local/netdata/usr/share/netdata/web#g' \
  2094.         -e 's#[@]enable_aclk_POST@#yes#g' \
  2095.         -e 's#[@]enable_cloud_POST@#yes#g' \
  2096.         netdata.logrotate.in > netdata.logrotate.tmp; then \
  2097.         mv "netdata.logrotate.tmp" "netdata.logrotate"; \
  2098.     else \
  2099.         rm -f "netdata.logrotate.tmp"; \
  2100.         false; \
  2101.     fi
  2102. if sed \
  2103.         -e 's#[@]localstatedir_POST@#/usr/local/netdata/var#g' \
  2104.         -e 's#[@]sbindir_POST@#/usr/local/netdata/usr/sbin#g' \
  2105.         -e 's#[@]pluginsdir_POST@#/usr/local/netdata/usr/libexec/netdata/plugins.d#g' \
  2106.         -e 's#[@]configdir_POST@#/usr/local/netdata/etc/netdata#g' \
  2107.         -e 's#[@]libconfigdir_POST@#/usr/local/netdata/usr/lib/netdata/conf.d#g' \
  2108.         -e 's#[@]pkglibexecdir_POST@#/usr/local/netdata/usr/libexec/netdata#g' \
  2109.         -e 's#[@]cachedir_POST@#/usr/local/netdata/var/cache/netdata#g' \
  2110.         -e 's#[@]registrydir_POST@#/usr/local/netdata/var/lib/netdata/registry#g' \
  2111.         -e 's#[@]varlibdir_POST@#/usr/local/netdata/var/lib/netdata#g' \
  2112.         -e 's#[@]webdir_POST@#/usr/local/netdata/usr/share/netdata/web#g' \
  2113.         -e 's#[@]enable_aclk_POST@#yes#g' \
  2114.         -e 's#[@]enable_cloud_POST@#yes#g' \
  2115.         netdata.service.in > netdata.service.tmp; then \
  2116.         mv "netdata.service.tmp" "netdata.service"; \
  2117.     else \
  2118.         rm -f "netdata.service.tmp"; \
  2119.         false; \
  2120.     fi
  2121. if sed \
  2122.         -e 's#[@]localstatedir_POST@#/usr/local/netdata/var#g' \
  2123.         -e 's#[@]sbindir_POST@#/usr/local/netdata/usr/sbin#g' \
  2124.         -e 's#[@]pluginsdir_POST@#/usr/local/netdata/usr/libexec/netdata/plugins.d#g' \
  2125.         -e 's#[@]configdir_POST@#/usr/local/netdata/etc/netdata#g' \
  2126.         -e 's#[@]libconfigdir_POST@#/usr/local/netdata/usr/lib/netdata/conf.d#g' \
  2127.         -e 's#[@]pkglibexecdir_POST@#/usr/local/netdata/usr/libexec/netdata#g' \
  2128.         -e 's#[@]cachedir_POST@#/usr/local/netdata/var/cache/netdata#g' \
  2129.         -e 's#[@]registrydir_POST@#/usr/local/netdata/var/lib/netdata/registry#g' \
  2130.         -e 's#[@]varlibdir_POST@#/usr/local/netdata/var/lib/netdata#g' \
  2131.         -e 's#[@]webdir_POST@#/usr/local/netdata/usr/share/netdata/web#g' \
  2132.         -e 's#[@]enable_aclk_POST@#yes#g' \
  2133.         -e 's#[@]enable_cloud_POST@#yes#g' \
  2134.         netdata.service.v235.in > netdata.service.v235.tmp; then \
  2135.         mv "netdata.service.v235.tmp" "netdata.service.v235"; \
  2136.     else \
  2137.         rm -f "netdata.service.v235.tmp"; \
  2138.         false; \
  2139.     fi
  2140. if sed \
  2141.         -e 's#[@]localstatedir_POST@#/usr/local/netdata/var#g' \
  2142.         -e 's#[@]sbindir_POST@#/usr/local/netdata/usr/sbin#g' \
  2143.         -e 's#[@]pluginsdir_POST@#/usr/local/netdata/usr/libexec/netdata/plugins.d#g' \
  2144.         -e 's#[@]configdir_POST@#/usr/local/netdata/etc/netdata#g' \
  2145.         -e 's#[@]libconfigdir_POST@#/usr/local/netdata/usr/lib/netdata/conf.d#g' \
  2146.         -e 's#[@]pkglibexecdir_POST@#/usr/local/netdata/usr/libexec/netdata#g' \
  2147.         -e 's#[@]cachedir_POST@#/usr/local/netdata/var/cache/netdata#g' \
  2148.         -e 's#[@]registrydir_POST@#/usr/local/netdata/var/lib/netdata/registry#g' \
  2149.         -e 's#[@]varlibdir_POST@#/usr/local/netdata/var/lib/netdata#g' \
  2150.         -e 's#[@]webdir_POST@#/usr/local/netdata/usr/share/netdata/web#g' \
  2151.         -e 's#[@]enable_aclk_POST@#yes#g' \
  2152.         -e 's#[@]enable_cloud_POST@#yes#g' \
  2153.         netdata-init-d.in > netdata-init-d.tmp; then \
  2154.         mv "netdata-init-d.tmp" "netdata-init-d"; \
  2155.     else \
  2156.         rm -f "netdata-init-d.tmp"; \
  2157.         false; \
  2158.     fi
  2159. if sed \
  2160.         -e 's#[@]localstatedir_POST@#/usr/local/netdata/var#g' \
  2161.         -e 's#[@]sbindir_POST@#/usr/local/netdata/usr/sbin#g' \
  2162.         -e 's#[@]pluginsdir_POST@#/usr/local/netdata/usr/libexec/netdata/plugins.d#g' \
  2163.         -e 's#[@]configdir_POST@#/usr/local/netdata/etc/netdata#g' \
  2164.         -e 's#[@]libconfigdir_POST@#/usr/local/netdata/usr/lib/netdata/conf.d#g' \
  2165.         -e 's#[@]pkglibexecdir_POST@#/usr/local/netdata/usr/libexec/netdata#g' \
  2166.         -e 's#[@]cachedir_POST@#/usr/local/netdata/var/cache/netdata#g' \
  2167.         -e 's#[@]registrydir_POST@#/usr/local/netdata/var/lib/netdata/registry#g' \
  2168.         -e 's#[@]varlibdir_POST@#/usr/local/netdata/var/lib/netdata#g' \
  2169.         -e 's#[@]webdir_POST@#/usr/local/netdata/usr/share/netdata/web#g' \
  2170.         -e 's#[@]enable_aclk_POST@#yes#g' \
  2171.         -e 's#[@]enable_cloud_POST@#yes#g' \
  2172.         netdata-lsb.in > netdata-lsb.tmp; then \
  2173.         mv "netdata-lsb.tmp" "netdata-lsb"; \
  2174.     else \
  2175.         rm -f "netdata-lsb.tmp"; \
  2176.         false; \
  2177.     fi
  2178. if sed \
  2179.         -e 's#[@]localstatedir_POST@#/usr/local/netdata/var#g' \
  2180.         -e 's#[@]sbindir_POST@#/usr/local/netdata/usr/sbin#g' \
  2181.         -e 's#[@]pluginsdir_POST@#/usr/local/netdata/usr/libexec/netdata/plugins.d#g' \
  2182.         -e 's#[@]configdir_POST@#/usr/local/netdata/etc/netdata#g' \
  2183.         -e 's#[@]libconfigdir_POST@#/usr/local/netdata/usr/lib/netdata/conf.d#g' \
  2184.         -e 's#[@]pkglibexecdir_POST@#/usr/local/netdata/usr/libexec/netdata#g' \
  2185.         -e 's#[@]cachedir_POST@#/usr/local/netdata/var/cache/netdata#g' \
  2186.         -e 's#[@]registrydir_POST@#/usr/local/netdata/var/lib/netdata/registry#g' \
  2187.         -e 's#[@]varlibdir_POST@#/usr/local/netdata/var/lib/netdata#g' \
  2188.         -e 's#[@]webdir_POST@#/usr/local/netdata/usr/share/netdata/web#g' \
  2189.         -e 's#[@]enable_aclk_POST@#yes#g' \
  2190.         -e 's#[@]enable_cloud_POST@#yes#g' \
  2191.         netdata-freebsd.in > netdata-freebsd.tmp; then \
  2192.         mv "netdata-freebsd.tmp" "netdata-freebsd"; \
  2193.     else \
  2194.         rm -f "netdata-freebsd.tmp"; \
  2195.         false; \
  2196.     fi
  2197. if sed \
  2198.         -e 's#[@]localstatedir_POST@#/usr/local/netdata/var#g' \
  2199.         -e 's#[@]sbindir_POST@#/usr/local/netdata/usr/sbin#g' \
  2200.         -e 's#[@]pluginsdir_POST@#/usr/local/netdata/usr/libexec/netdata/plugins.d#g' \
  2201.         -e 's#[@]configdir_POST@#/usr/local/netdata/etc/netdata#g' \
  2202.         -e 's#[@]libconfigdir_POST@#/usr/local/netdata/usr/lib/netdata/conf.d#g' \
  2203.         -e 's#[@]pkglibexecdir_POST@#/usr/local/netdata/usr/libexec/netdata#g' \
  2204.         -e 's#[@]cachedir_POST@#/usr/local/netdata/var/cache/netdata#g' \
  2205.         -e 's#[@]registrydir_POST@#/usr/local/netdata/var/lib/netdata/registry#g' \
  2206.         -e 's#[@]varlibdir_POST@#/usr/local/netdata/var/lib/netdata#g' \
  2207.         -e 's#[@]webdir_POST@#/usr/local/netdata/usr/share/netdata/web#g' \
  2208.         -e 's#[@]enable_aclk_POST@#yes#g' \
  2209.         -e 's#[@]enable_cloud_POST@#yes#g' \
  2210.         netdata.plist.in > netdata.plist.tmp; then \
  2211.         mv "netdata.plist.tmp" "netdata.plist"; \
  2212.     else \
  2213.         rm -f "netdata.plist.tmp"; \
  2214.         false; \
  2215.     fi
  2216. if sed \
  2217.         -e 's#[@]localstatedir_POST@#/usr/local/netdata/var#g' \
  2218.         -e 's#[@]sbindir_POST@#/usr/local/netdata/usr/sbin#g' \
  2219.         -e 's#[@]pluginsdir_POST@#/usr/local/netdata/usr/libexec/netdata/plugins.d#g' \
  2220.         -e 's#[@]configdir_POST@#/usr/local/netdata/etc/netdata#g' \
  2221.         -e 's#[@]libconfigdir_POST@#/usr/local/netdata/usr/lib/netdata/conf.d#g' \
  2222.         -e 's#[@]pkglibexecdir_POST@#/usr/local/netdata/usr/libexec/netdata#g' \
  2223.         -e 's#[@]cachedir_POST@#/usr/local/netdata/var/cache/netdata#g' \
  2224.         -e 's#[@]registrydir_POST@#/usr/local/netdata/var/lib/netdata/registry#g' \
  2225.         -e 's#[@]varlibdir_POST@#/usr/local/netdata/var/lib/netdata#g' \
  2226.         -e 's#[@]webdir_POST@#/usr/local/netdata/usr/share/netdata/web#g' \
  2227.         -e 's#[@]enable_aclk_POST@#yes#g' \
  2228.         -e 's#[@]enable_cloud_POST@#yes#g' \
  2229.         netdata.crontab.in > netdata.crontab.tmp; then \
  2230.         mv "netdata.crontab.tmp" "netdata.crontab"; \
  2231.     else \
  2232.         rm -f "netdata.crontab.tmp"; \
  2233.         false; \
  2234.     fi
  2235. if sed \
  2236.         -e 's#[@]localstatedir_POST@#/usr/local/netdata/var#g' \
  2237.         -e 's#[@]sbindir_POST@#/usr/local/netdata/usr/sbin#g' \
  2238.         -e 's#[@]pluginsdir_POST@#/usr/local/netdata/usr/libexec/netdata/plugins.d#g' \
  2239.         -e 's#[@]configdir_POST@#/usr/local/netdata/etc/netdata#g' \
  2240.         -e 's#[@]libconfigdir_POST@#/usr/local/netdata/usr/lib/netdata/conf.d#g' \
  2241.         -e 's#[@]pkglibexecdir_POST@#/usr/local/netdata/usr/libexec/netdata#g' \
  2242.         -e 's#[@]cachedir_POST@#/usr/local/netdata/var/cache/netdata#g' \
  2243.         -e 's#[@]registrydir_POST@#/usr/local/netdata/var/lib/netdata/registry#g' \
  2244.         -e 's#[@]varlibdir_POST@#/usr/local/netdata/var/lib/netdata#g' \
  2245.         -e 's#[@]webdir_POST@#/usr/local/netdata/usr/share/netdata/web#g' \
  2246.         -e 's#[@]enable_aclk_POST@#yes#g' \
  2247.         -e 's#[@]enable_cloud_POST@#yes#g' \
  2248.         netdata-updater.service.in > netdata-updater.service.tmp; then \
  2249.         mv "netdata-updater.service.tmp" "netdata-updater.service"; \
  2250.     else \
  2251.         rm -f "netdata-updater.service.tmp"; \
  2252.         false; \
  2253.     fi
  2254. Making all in tests
  2255. if sed \
  2256.         -e 's#[@]localstatedir_POST@#/usr/local/netdata/var#g' \
  2257.         -e 's#[@]sbindir_POST@#/usr/local/netdata/usr/sbin#g' \
  2258.         -e 's#[@]pluginsdir_POST@#/usr/local/netdata/usr/libexec/netdata/plugins.d#g' \
  2259.         -e 's#[@]configdir_POST@#/usr/local/netdata/etc/netdata#g' \
  2260.         -e 's#[@]libconfigdir_POST@#/usr/local/netdata/usr/lib/netdata/conf.d#g' \
  2261.         -e 's#[@]pkglibexecdir_POST@#/usr/local/netdata/usr/libexec/netdata#g' \
  2262.         -e 's#[@]cachedir_POST@#/usr/local/netdata/var/cache/netdata#g' \
  2263.         -e 's#[@]registrydir_POST@#/usr/local/netdata/var/lib/netdata/registry#g' \
  2264.         -e 's#[@]varlibdir_POST@#/usr/local/netdata/var/lib/netdata#g' \
  2265.         -e 's#[@]webdir_POST@#/usr/local/netdata/usr/share/netdata/web#g' \
  2266.         -e 's#[@]enable_aclk_POST@#yes#g' \
  2267.         -e 's#[@]enable_cloud_POST@#yes#g' \
  2268.         health_mgmtapi/health-cmdapi-test.sh.in > health_mgmtapi/health-cmdapi-test.sh.tmp; then \
  2269.         mv "health_mgmtapi/health-cmdapi-test.sh.tmp" "health_mgmtapi/health-cmdapi-test.sh"; \
  2270.     else \
  2271.         rm -f "health_mgmtapi/health-cmdapi-test.sh.tmp"; \
  2272.         false; \
  2273.     fi
  2274. if sed \
  2275.         -e 's#[@]localstatedir_POST@#/usr/local/netdata/var#g' \
  2276.         -e 's#[@]sbindir_POST@#/usr/local/netdata/usr/sbin#g' \
  2277.         -e 's#[@]pluginsdir_POST@#/usr/local/netdata/usr/libexec/netdata/plugins.d#g' \
  2278.         -e 's#[@]configdir_POST@#/usr/local/netdata/etc/netdata#g' \
  2279.         -e 's#[@]libconfigdir_POST@#/usr/local/netdata/usr/lib/netdata/conf.d#g' \
  2280.         -e 's#[@]pkglibexecdir_POST@#/usr/local/netdata/usr/libexec/netdata#g' \
  2281.         -e 's#[@]cachedir_POST@#/usr/local/netdata/var/cache/netdata#g' \
  2282.         -e 's#[@]registrydir_POST@#/usr/local/netdata/var/lib/netdata/registry#g' \
  2283.         -e 's#[@]varlibdir_POST@#/usr/local/netdata/var/lib/netdata#g' \
  2284.         -e 's#[@]webdir_POST@#/usr/local/netdata/usr/share/netdata/web#g' \
  2285.         -e 's#[@]enable_aclk_POST@#yes#g' \
  2286.         -e 's#[@]enable_cloud_POST@#yes#g' \
  2287.         acls/acl.sh.in > acls/acl.sh.tmp; then \
  2288.         mv "acls/acl.sh.tmp" "acls/acl.sh"; \
  2289.     else \
  2290.         rm -f "acls/acl.sh.tmp"; \
  2291.         false; \
  2292.     fi
  2293. if sed \
  2294.         -e 's#[@]localstatedir_POST@#/usr/local/netdata/var#g' \
  2295.         -e 's#[@]sbindir_POST@#/usr/local/netdata/usr/sbin#g' \
  2296.         -e 's#[@]pluginsdir_POST@#/usr/local/netdata/usr/libexec/netdata/plugins.d#g' \
  2297.         -e 's#[@]configdir_POST@#/usr/local/netdata/etc/netdata#g' \
  2298.         -e 's#[@]libconfigdir_POST@#/usr/local/netdata/usr/lib/netdata/conf.d#g' \
  2299.         -e 's#[@]pkglibexecdir_POST@#/usr/local/netdata/usr/libexec/netdata#g' \
  2300.         -e 's#[@]cachedir_POST@#/usr/local/netdata/var/cache/netdata#g' \
  2301.         -e 's#[@]registrydir_POST@#/usr/local/netdata/var/lib/netdata/registry#g' \
  2302.         -e 's#[@]varlibdir_POST@#/usr/local/netdata/var/lib/netdata#g' \
  2303.         -e 's#[@]webdir_POST@#/usr/local/netdata/usr/share/netdata/web#g' \
  2304.         -e 's#[@]enable_aclk_POST@#yes#g' \
  2305.         -e 's#[@]enable_cloud_POST@#yes#g' \
  2306.         urls/request.sh.in > urls/request.sh.tmp; then \
  2307.         mv "urls/request.sh.tmp" "urls/request.sh"; \
  2308.     else \
  2309.         rm -f "urls/request.sh.tmp"; \
  2310.         false; \
  2311.     fi
  2312. if sed \
  2313.         -e 's#[@]localstatedir_POST@#/usr/local/netdata/var#g' \
  2314.         -e 's#[@]sbindir_POST@#/usr/local/netdata/usr/sbin#g' \
  2315.         -e 's#[@]pluginsdir_POST@#/usr/local/netdata/usr/libexec/netdata/plugins.d#g' \
  2316.         -e 's#[@]configdir_POST@#/usr/local/netdata/etc/netdata#g' \
  2317.         -e 's#[@]libconfigdir_POST@#/usr/local/netdata/usr/lib/netdata/conf.d#g' \
  2318.         -e 's#[@]pkglibexecdir_POST@#/usr/local/netdata/usr/libexec/netdata#g' \
  2319.         -e 's#[@]cachedir_POST@#/usr/local/netdata/var/cache/netdata#g' \
  2320.         -e 's#[@]registrydir_POST@#/usr/local/netdata/var/lib/netdata/registry#g' \
  2321.         -e 's#[@]varlibdir_POST@#/usr/local/netdata/var/lib/netdata#g' \
  2322.         -e 's#[@]webdir_POST@#/usr/local/netdata/usr/share/netdata/web#g' \
  2323.         -e 's#[@]enable_aclk_POST@#yes#g' \
  2324.         -e 's#[@]enable_cloud_POST@#yes#g' \
  2325.         alarm_repetition/alarm.sh.in > alarm_repetition/alarm.sh.tmp; then \
  2326.         mv "alarm_repetition/alarm.sh.tmp" "alarm_repetition/alarm.sh"; \
  2327.     else \
  2328.         rm -f "alarm_repetition/alarm.sh.tmp"; \
  2329.         false; \
  2330.     fi
  2331. if sed \
  2332.         -e 's#[@]localstatedir_POST@#/usr/local/netdata/var#g' \
  2333.         -e 's#[@]sbindir_POST@#/usr/local/netdata/usr/sbin#g' \
  2334.         -e 's#[@]pluginsdir_POST@#/usr/local/netdata/usr/libexec/netdata/plugins.d#g' \
  2335.         -e 's#[@]configdir_POST@#/usr/local/netdata/etc/netdata#g' \
  2336.         -e 's#[@]libconfigdir_POST@#/usr/local/netdata/usr/lib/netdata/conf.d#g' \
  2337.         -e 's#[@]pkglibexecdir_POST@#/usr/local/netdata/usr/libexec/netdata#g' \
  2338.         -e 's#[@]cachedir_POST@#/usr/local/netdata/var/cache/netdata#g' \
  2339.         -e 's#[@]registrydir_POST@#/usr/local/netdata/var/lib/netdata/registry#g' \
  2340.         -e 's#[@]varlibdir_POST@#/usr/local/netdata/var/lib/netdata#g' \
  2341.         -e 's#[@]webdir_POST@#/usr/local/netdata/usr/share/netdata/web#g' \
  2342.         -e 's#[@]enable_aclk_POST@#yes#g' \
  2343.         -e 's#[@]enable_cloud_POST@#yes#g' \
  2344.         template_dimension/template_dim.sh.in > template_dimension/template_dim.sh.tmp; then \
  2345.         mv "template_dimension/template_dim.sh.tmp" "template_dimension/template_dim.sh"; \
  2346.     else \
  2347.         rm -f "template_dimension/template_dim.sh.tmp"; \
  2348.         false; \
  2349.     fi
  2350. Making all in backends
  2351. Making all in graphite
  2352. make[3]: Nothing to be done for `all'.
  2353. Making all in json
  2354. make[3]: Nothing to be done for `all'.
  2355. Making all in opentsdb
  2356. make[3]: Nothing to be done for `all'.
  2357. Making all in prometheus
  2358. Making all in remote_write
  2359. make[4]: Nothing to be done for `all'.
  2360. make[4]: Nothing to be done for `all-am'.
  2361. Making all in aws_kinesis
  2362. make[3]: Nothing to be done for `all'.
  2363. Making all in mongodb
  2364. make[3]: Nothing to be done for `all'.
  2365. make[3]: Nothing to be done for `all-am'.
  2366. Making all in collectors
  2367. Making all in plugins.d
  2368. make[4]: Nothing to be done for `all-am'.
  2369. Making all in apps.plugin
  2370. make[3]: Nothing to be done for `all'.
  2371. Making all in cgroups.plugin
  2372. if sed \
  2373.         -e 's#[@]localstatedir_POST@#/usr/local/netdata/var#g' \
  2374.         -e 's#[@]sbindir_POST@#/usr/local/netdata/usr/sbin#g' \
  2375.         -e 's#[@]pluginsdir_POST@#/usr/local/netdata/usr/libexec/netdata/plugins.d#g' \
  2376.         -e 's#[@]configdir_POST@#/usr/local/netdata/etc/netdata#g' \
  2377.         -e 's#[@]libconfigdir_POST@#/usr/local/netdata/usr/lib/netdata/conf.d#g' \
  2378.         -e 's#[@]pkglibexecdir_POST@#/usr/local/netdata/usr/libexec/netdata#g' \
  2379.         -e 's#[@]cachedir_POST@#/usr/local/netdata/var/cache/netdata#g' \
  2380.         -e 's#[@]registrydir_POST@#/usr/local/netdata/var/lib/netdata/registry#g' \
  2381.         -e 's#[@]varlibdir_POST@#/usr/local/netdata/var/lib/netdata#g' \
  2382.         -e 's#[@]webdir_POST@#/usr/local/netdata/usr/share/netdata/web#g' \
  2383.         -e 's#[@]enable_aclk_POST@#yes#g' \
  2384.         -e 's#[@]enable_cloud_POST@#yes#g' \
  2385.         cgroup-name.sh.in > cgroup-name.sh.tmp; then \
  2386.         mv "cgroup-name.sh.tmp" "cgroup-name.sh"; \
  2387.     else \
  2388.         rm -f "cgroup-name.sh.tmp"; \
  2389.         false; \
  2390.     fi
  2391. Making all in charts.d.plugin
  2392. if sed \
  2393.         -e 's#[@]localstatedir_POST@#/usr/local/netdata/var#g' \
  2394.         -e 's#[@]sbindir_POST@#/usr/local/netdata/usr/sbin#g' \
  2395.         -e 's#[@]pluginsdir_POST@#/usr/local/netdata/usr/libexec/netdata/plugins.d#g' \
  2396.         -e 's#[@]configdir_POST@#/usr/local/netdata/etc/netdata#g' \
  2397.         -e 's#[@]libconfigdir_POST@#/usr/local/netdata/usr/lib/netdata/conf.d#g' \
  2398.         -e 's#[@]pkglibexecdir_POST@#/usr/local/netdata/usr/libexec/netdata#g' \
  2399.         -e 's#[@]cachedir_POST@#/usr/local/netdata/var/cache/netdata#g' \
  2400.         -e 's#[@]registrydir_POST@#/usr/local/netdata/var/lib/netdata/registry#g' \
  2401.         -e 's#[@]varlibdir_POST@#/usr/local/netdata/var/lib/netdata#g' \
  2402.         -e 's#[@]webdir_POST@#/usr/local/netdata/usr/share/netdata/web#g' \
  2403.         -e 's#[@]enable_aclk_POST@#yes#g' \
  2404.         -e 's#[@]enable_cloud_POST@#yes#g' \
  2405.         charts.d.plugin.in > charts.d.plugin.tmp; then \
  2406.         mv "charts.d.plugin.tmp" "charts.d.plugin"; \
  2407.     else \
  2408.         rm -f "charts.d.plugin.tmp"; \
  2409.         false; \
  2410.     fi
  2411. Making all in checks.plugin
  2412. make[3]: Nothing to be done for `all'.
  2413. Making all in cups.plugin
  2414. make[3]: Nothing to be done for `all'.
  2415. Making all in diskspace.plugin
  2416. make[3]: Nothing to be done for `all'.
  2417. Making all in timex.plugin
  2418. make[3]: Nothing to be done for `all'.
  2419. Making all in fping.plugin
  2420. if sed \
  2421.         -e 's#[@]localstatedir_POST@#/usr/local/netdata/var#g' \
  2422.         -e 's#[@]sbindir_POST@#/usr/local/netdata/usr/sbin#g' \
  2423.         -e 's#[@]pluginsdir_POST@#/usr/local/netdata/usr/libexec/netdata/plugins.d#g' \
  2424.         -e 's#[@]configdir_POST@#/usr/local/netdata/etc/netdata#g' \
  2425.         -e 's#[@]libconfigdir_POST@#/usr/local/netdata/usr/lib/netdata/conf.d#g' \
  2426.         -e 's#[@]pkglibexecdir_POST@#/usr/local/netdata/usr/libexec/netdata#g' \
  2427.         -e 's#[@]cachedir_POST@#/usr/local/netdata/var/cache/netdata#g' \
  2428.         -e 's#[@]registrydir_POST@#/usr/local/netdata/var/lib/netdata/registry#g' \
  2429.         -e 's#[@]varlibdir_POST@#/usr/local/netdata/var/lib/netdata#g' \
  2430.         -e 's#[@]webdir_POST@#/usr/local/netdata/usr/share/netdata/web#g' \
  2431.         -e 's#[@]enable_aclk_POST@#yes#g' \
  2432.         -e 's#[@]enable_cloud_POST@#yes#g' \
  2433.         fping.plugin.in > fping.plugin.tmp; then \
  2434.         mv "fping.plugin.tmp" "fping.plugin"; \
  2435.     else \
  2436.         rm -f "fping.plugin.tmp"; \
  2437.         false; \
  2438.     fi
  2439. Making all in ioping.plugin
  2440. if sed \
  2441.         -e 's#[@]localstatedir_POST@#/usr/local/netdata/var#g' \
  2442.         -e 's#[@]sbindir_POST@#/usr/local/netdata/usr/sbin#g' \
  2443.         -e 's#[@]pluginsdir_POST@#/usr/local/netdata/usr/libexec/netdata/plugins.d#g' \
  2444.         -e 's#[@]configdir_POST@#/usr/local/netdata/etc/netdata#g' \
  2445.         -e 's#[@]libconfigdir_POST@#/usr/local/netdata/usr/lib/netdata/conf.d#g' \
  2446.         -e 's#[@]pkglibexecdir_POST@#/usr/local/netdata/usr/libexec/netdata#g' \
  2447.         -e 's#[@]cachedir_POST@#/usr/local/netdata/var/cache/netdata#g' \
  2448.         -e 's#[@]registrydir_POST@#/usr/local/netdata/var/lib/netdata/registry#g' \
  2449.         -e 's#[@]varlibdir_POST@#/usr/local/netdata/var/lib/netdata#g' \
  2450.         -e 's#[@]webdir_POST@#/usr/local/netdata/usr/share/netdata/web#g' \
  2451.         -e 's#[@]enable_aclk_POST@#yes#g' \
  2452.         -e 's#[@]enable_cloud_POST@#yes#g' \
  2453.         ioping.plugin.in > ioping.plugin.tmp; then \
  2454.         mv "ioping.plugin.tmp" "ioping.plugin"; \
  2455.     else \
  2456.         rm -f "ioping.plugin.tmp"; \
  2457.         false; \
  2458.     fi
  2459. Making all in freebsd.plugin
  2460. make[3]: Nothing to be done for `all'.
  2461. Making all in freeipmi.plugin
  2462. make[3]: Nothing to be done for `all'.
  2463. Making all in idlejitter.plugin
  2464. make[3]: Nothing to be done for `all'.
  2465. Making all in macos.plugin
  2466. make[3]: Nothing to be done for `all'.
  2467. Making all in nfacct.plugin
  2468. make[3]: Nothing to be done for `all'.
  2469. Making all in xenstat.plugin
  2470. make[3]: Nothing to be done for `all'.
  2471. Making all in perf.plugin
  2472. make[3]: Nothing to be done for `all'.
  2473. Making all in node.d.plugin
  2474. if sed \
  2475.         -e 's#[@]localstatedir_POST@#/usr/local/netdata/var#g' \
  2476.         -e 's#[@]sbindir_POST@#/usr/local/netdata/usr/sbin#g' \
  2477.         -e 's#[@]pluginsdir_POST@#/usr/local/netdata/usr/libexec/netdata/plugins.d#g' \
  2478.         -e 's#[@]configdir_POST@#/usr/local/netdata/etc/netdata#g' \
  2479.         -e 's#[@]libconfigdir_POST@#/usr/local/netdata/usr/lib/netdata/conf.d#g' \
  2480.         -e 's#[@]pkglibexecdir_POST@#/usr/local/netdata/usr/libexec/netdata#g' \
  2481.         -e 's#[@]cachedir_POST@#/usr/local/netdata/var/cache/netdata#g' \
  2482.         -e 's#[@]registrydir_POST@#/usr/local/netdata/var/lib/netdata/registry#g' \
  2483.         -e 's#[@]varlibdir_POST@#/usr/local/netdata/var/lib/netdata#g' \
  2484.         -e 's#[@]webdir_POST@#/usr/local/netdata/usr/share/netdata/web#g' \
  2485.         -e 's#[@]enable_aclk_POST@#yes#g' \
  2486.         -e 's#[@]enable_cloud_POST@#yes#g' \
  2487.         node.d.plugin.in > node.d.plugin.tmp; then \
  2488.         mv "node.d.plugin.tmp" "node.d.plugin"; \
  2489.     else \
  2490.         rm -f "node.d.plugin.tmp"; \
  2491.         false; \
  2492.     fi
  2493. Making all in proc.plugin
  2494. make[3]: Nothing to be done for `all'.
  2495. Making all in python.d.plugin
  2496. if sed \
  2497.         -e 's#[@]localstatedir_POST@#/usr/local/netdata/var#g' \
  2498.         -e 's#[@]sbindir_POST@#/usr/local/netdata/usr/sbin#g' \
  2499.         -e 's#[@]pluginsdir_POST@#/usr/local/netdata/usr/libexec/netdata/plugins.d#g' \
  2500.         -e 's#[@]configdir_POST@#/usr/local/netdata/etc/netdata#g' \
  2501.         -e 's#[@]libconfigdir_POST@#/usr/local/netdata/usr/lib/netdata/conf.d#g' \
  2502.         -e 's#[@]pkglibexecdir_POST@#/usr/local/netdata/usr/libexec/netdata#g' \
  2503.         -e 's#[@]cachedir_POST@#/usr/local/netdata/var/cache/netdata#g' \
  2504.         -e 's#[@]registrydir_POST@#/usr/local/netdata/var/lib/netdata/registry#g' \
  2505.         -e 's#[@]varlibdir_POST@#/usr/local/netdata/var/lib/netdata#g' \
  2506.         -e 's#[@]webdir_POST@#/usr/local/netdata/usr/share/netdata/web#g' \
  2507.         -e 's#[@]enable_aclk_POST@#yes#g' \
  2508.         -e 's#[@]enable_cloud_POST@#yes#g' \
  2509.         python.d.plugin.in > python.d.plugin.tmp; then \
  2510.         mv "python.d.plugin.tmp" "python.d.plugin"; \
  2511.     else \
  2512.         rm -f "python.d.plugin.tmp"; \
  2513.         false; \
  2514.     fi
  2515. Making all in slabinfo.plugin
  2516. make[3]: Nothing to be done for `all'.
  2517. Making all in statsd.plugin
  2518. make[3]: Nothing to be done for `all'.
  2519. Making all in ebpf.plugin
  2520. make[3]: Nothing to be done for `all'.
  2521. Making all in tc.plugin
  2522. if sed \
  2523.         -e 's#[@]localstatedir_POST@#/usr/local/netdata/var#g' \
  2524.         -e 's#[@]sbindir_POST@#/usr/local/netdata/usr/sbin#g' \
  2525.         -e 's#[@]pluginsdir_POST@#/usr/local/netdata/usr/libexec/netdata/plugins.d#g' \
  2526.         -e 's#[@]configdir_POST@#/usr/local/netdata/etc/netdata#g' \
  2527.         -e 's#[@]libconfigdir_POST@#/usr/local/netdata/usr/lib/netdata/conf.d#g' \
  2528.         -e 's#[@]pkglibexecdir_POST@#/usr/local/netdata/usr/libexec/netdata#g' \
  2529.         -e 's#[@]cachedir_POST@#/usr/local/netdata/var/cache/netdata#g' \
  2530.         -e 's#[@]registrydir_POST@#/usr/local/netdata/var/lib/netdata/registry#g' \
  2531.         -e 's#[@]varlibdir_POST@#/usr/local/netdata/var/lib/netdata#g' \
  2532.         -e 's#[@]webdir_POST@#/usr/local/netdata/usr/share/netdata/web#g' \
  2533.         -e 's#[@]enable_aclk_POST@#yes#g' \
  2534.         -e 's#[@]enable_cloud_POST@#yes#g' \
  2535.         tc-qos-helper.sh.in > tc-qos-helper.sh.tmp; then \
  2536.         mv "tc-qos-helper.sh.tmp" "tc-qos-helper.sh"; \
  2537.     else \
  2538.         rm -f "tc-qos-helper.sh.tmp"; \
  2539.         false; \
  2540.     fi
  2541. make[3]: Nothing to be done for `all-am'.
  2542. Making all in daemon
  2543. if sed \
  2544.         -e 's#[@]localstatedir_POST@#/usr/local/netdata/var#g' \
  2545.         -e 's#[@]sbindir_POST@#/usr/local/netdata/usr/sbin#g' \
  2546.         -e 's#[@]pluginsdir_POST@#/usr/local/netdata/usr/libexec/netdata/plugins.d#g' \
  2547.         -e 's#[@]configdir_POST@#/usr/local/netdata/etc/netdata#g' \
  2548.         -e 's#[@]libconfigdir_POST@#/usr/local/netdata/usr/lib/netdata/conf.d#g' \
  2549.         -e 's#[@]pkglibexecdir_POST@#/usr/local/netdata/usr/libexec/netdata#g' \
  2550.         -e 's#[@]cachedir_POST@#/usr/local/netdata/var/cache/netdata#g' \
  2551.         -e 's#[@]registrydir_POST@#/usr/local/netdata/var/lib/netdata/registry#g' \
  2552.         -e 's#[@]varlibdir_POST@#/usr/local/netdata/var/lib/netdata#g' \
  2553.         -e 's#[@]webdir_POST@#/usr/local/netdata/usr/share/netdata/web#g' \
  2554.         -e 's#[@]enable_aclk_POST@#yes#g' \
  2555.         -e 's#[@]enable_cloud_POST@#yes#g' \
  2556.         anonymous-statistics.sh.in > anonymous-statistics.sh.tmp; then \
  2557.         mv "anonymous-statistics.sh.tmp" "anonymous-statistics.sh"; \
  2558.     else \
  2559.         rm -f "anonymous-statistics.sh.tmp"; \
  2560.         false; \
  2561.     fi
  2562. Making all in database
  2563. Making all in engine
  2564. Making all in metadata_log
  2565. make[4]: Nothing to be done for `all'.
  2566. make[4]: Nothing to be done for `all-am'.
  2567. make[3]: Nothing to be done for `all-am'.
  2568. Making all in exporting
  2569. Making all in tests
  2570. make[3]: Nothing to be done for `all'.
  2571. Making all in graphite
  2572. make[3]: Nothing to be done for `all'.
  2573. Making all in json
  2574. make[3]: Nothing to be done for `all'.
  2575. Making all in opentsdb
  2576. make[3]: Nothing to be done for `all'.
  2577. Making all in prometheus
  2578. Making all in remote_write
  2579. make[4]: Nothing to be done for `all'.
  2580. make[4]: Nothing to be done for `all-am'.
  2581. Making all in aws_kinesis
  2582. make[3]: Nothing to be done for `all'.
  2583. Making all in pubsub
  2584. make[3]: Nothing to be done for `all'.
  2585. Making all in mongodb
  2586. make[3]: Nothing to be done for `all'.
  2587. make[3]: Nothing to be done for `all-am'.
  2588. Making all in health
  2589. Making all in notifications
  2590. if sed \
  2591.         -e 's#[@]localstatedir_POST@#/usr/local/netdata/var#g' \
  2592.         -e 's#[@]sbindir_POST@#/usr/local/netdata/usr/sbin#g' \
  2593.         -e 's#[@]pluginsdir_POST@#/usr/local/netdata/usr/libexec/netdata/plugins.d#g' \
  2594.         -e 's#[@]configdir_POST@#/usr/local/netdata/etc/netdata#g' \
  2595.         -e 's#[@]libconfigdir_POST@#/usr/local/netdata/usr/lib/netdata/conf.d#g' \
  2596.         -e 's#[@]pkglibexecdir_POST@#/usr/local/netdata/usr/libexec/netdata#g' \
  2597.         -e 's#[@]cachedir_POST@#/usr/local/netdata/var/cache/netdata#g' \
  2598.         -e 's#[@]registrydir_POST@#/usr/local/netdata/var/lib/netdata/registry#g' \
  2599.         -e 's#[@]varlibdir_POST@#/usr/local/netdata/var/lib/netdata#g' \
  2600.         -e 's#[@]webdir_POST@#/usr/local/netdata/usr/share/netdata/web#g' \
  2601.         -e 's#[@]enable_aclk_POST@#yes#g' \
  2602.         -e 's#[@]enable_cloud_POST@#yes#g' \
  2603.         alarm-notify.sh.in > alarm-notify.sh.tmp; then \
  2604.         mv "alarm-notify.sh.tmp" "alarm-notify.sh"; \
  2605.     else \
  2606.         rm -f "alarm-notify.sh.tmp"; \
  2607.         false; \
  2608.     fi
  2609. make[3]: Nothing to be done for `all-am'.
  2610. Making all in libnetdata
  2611. Making all in adaptive_resortable_list
  2612. make[3]: Nothing to be done for `all'.
  2613. Making all in avl
  2614. make[3]: Nothing to be done for `all'.
  2615. Making all in buffer
  2616. make[3]: Nothing to be done for `all'.
  2617. Making all in clocks
  2618. make[3]: Nothing to be done for `all'.
  2619. Making all in completion
  2620. make[3]: Nothing to be done for `all'.
  2621. Making all in config
  2622. make[3]: Nothing to be done for `all'.
  2623. Making all in dictionary
  2624. make[3]: Nothing to be done for `all'.
  2625. Making all in ebpf
  2626. make[3]: Nothing to be done for `all'.
  2627. Making all in eval
  2628. make[3]: Nothing to be done for `all'.
  2629. Making all in json
  2630. make[3]: Nothing to be done for `all'.
  2631. Making all in health
  2632. make[3]: Nothing to be done for `all'.
  2633. Making all in locks
  2634. make[3]: Nothing to be done for `all'.
  2635. Making all in log
  2636. make[3]: Nothing to be done for `all'.
  2637. Making all in popen
  2638. make[3]: Nothing to be done for `all'.
  2639. Making all in procfile
  2640. make[3]: Nothing to be done for `all'.
  2641. Making all in simple_pattern
  2642. make[3]: Nothing to be done for `all'.
  2643. Making all in socket
  2644. make[3]: Nothing to be done for `all'.
  2645. Making all in statistical
  2646. make[3]: Nothing to be done for `all'.
  2647. Making all in storage_number
  2648. Making all in tests
  2649. make[4]: Nothing to be done for `all'.
  2650. make[4]: Nothing to be done for `all-am'.
  2651. Making all in threads
  2652. make[3]: Nothing to be done for `all'.
  2653. Making all in url
  2654. make[3]: Nothing to be done for `all'.
  2655. Making all in tests
  2656. make[3]: Nothing to be done for `all'.
  2657. make[3]: Nothing to be done for `all-am'.
  2658. Making all in registry
  2659. make[2]: Nothing to be done for `all'.
  2660. Making all in streaming
  2661. make[2]: Nothing to be done for `all'.
  2662. Making all in web
  2663. Making all in api
  2664. Making all in badges
  2665. make[4]: Nothing to be done for `all'.
  2666. Making all in queries
  2667. Making all in average
  2668. make[5]: Nothing to be done for `all'.
  2669. Making all in des
  2670. make[5]: Nothing to be done for `all'.
  2671. Making all in incremental_sum
  2672. make[5]: Nothing to be done for `all'.
  2673. Making all in max
  2674. make[5]: Nothing to be done for `all'.
  2675. Making all in min
  2676. make[5]: Nothing to be done for `all'.
  2677. Making all in sum
  2678. make[5]: Nothing to be done for `all'.
  2679. Making all in median
  2680. make[5]: Nothing to be done for `all'.
  2681. Making all in ses
  2682. make[5]: Nothing to be done for `all'.
  2683. Making all in stddev
  2684. make[5]: Nothing to be done for `all'.
  2685. make[5]: Nothing to be done for `all-am'.
  2686. Making all in exporters
  2687. Making all in shell
  2688. make[5]: Nothing to be done for `all'.
  2689. Making all in prometheus
  2690. make[5]: Nothing to be done for `all'.
  2691. make[5]: Nothing to be done for `all-am'.
  2692. Making all in formatters
  2693. Making all in csv
  2694. make[5]: Nothing to be done for `all'.
  2695. Making all in json
  2696. make[5]: Nothing to be done for `all'.
  2697. Making all in ssv
  2698. make[5]: Nothing to be done for `all'.
  2699. Making all in value
  2700. make[5]: Nothing to be done for `all'.
  2701. make[5]: Nothing to be done for `all-am'.
  2702. Making all in health
  2703. make[4]: Nothing to be done for `all'.
  2704. make[4]: Nothing to be done for `all-am'.
  2705. Making all in gui
  2706. Making all in dashboard
  2707. make[4]: Nothing to be done for `all'.
  2708. if test -f dashboard.js; then rm -f dashboard.js; fi
  2709. if test -d "../../.git"; then \
  2710.         git --git-dir="../../.git" log -n 1 --format=%H; \
  2711.     fi > version.txt.tmp
  2712. test -s version.txt.tmp || echo 0 > version.txt.tmp
  2713. cat src/dashboard.js/prologue.js.inc src/dashboard.js/utils.js src/dashboard.js/server-detection.js src/dashboard.js/dependencies.js src/dashboard.js/error-handling.js src/dashboard.js/compatibility.js src/dashboard.js/xss.js src/dashboard.js/colors.js src/dashboard.js/units-conversion.js src/dashboard.js/options.js src/dashboard.js/localstorage.js src/dashboard.js/timeout.js src/dashboard.js/themes.js src/dashboard.js/charting/dygraph.js src/dashboard.js/charting/sparkline.js src/dashboard.js/charting/google-charts.js src/dashboard.js/charting/gauge.js src/dashboard.js/charting/easy-pie-chart.js src/dashboard.js/charting/d3pie.js src/dashboard.js/charting/d3.js src/dashboard.js/charting/peity.js src/dashboard.js/charting/textonly.js src/dashboard.js/charting.js src/dashboard.js/chart-registry.js src/dashboard.js/common.js src/dashboard.js/main.js src/dashboard.js/alarms.js src/dashboard.js/registry.js src/dashboard.js/boot.js src/dashboard.js/epilogue.js.inc  > dashboard.js.tmp && mv dashboard.js.tmp dashboard.js
  2714. mv version.txt.tmp version.txt
  2715. Making all in server
  2716. Making all in static
  2717. make[5]: Nothing to be done for `all-am'.
  2718. make[4]: Nothing to be done for `all-am'.
  2719. make[3]: Nothing to be done for `all-am'.
  2720. Making all in claim
  2721. if sed \
  2722.         -e 's#[@]localstatedir_POST@#/usr/local/netdata/var#g' \
  2723.         -e 's#[@]sbindir_POST@#/usr/local/netdata/usr/sbin#g' \
  2724.         -e 's#[@]pluginsdir_POST@#/usr/local/netdata/usr/libexec/netdata/plugins.d#g' \
  2725.         -e 's#[@]configdir_POST@#/usr/local/netdata/etc/netdata#g' \
  2726.         -e 's#[@]libconfigdir_POST@#/usr/local/netdata/usr/lib/netdata/conf.d#g' \
  2727.         -e 's#[@]pkglibexecdir_POST@#/usr/local/netdata/usr/libexec/netdata#g' \
  2728.         -e 's#[@]cachedir_POST@#/usr/local/netdata/var/cache/netdata#g' \
  2729.         -e 's#[@]registrydir_POST@#/usr/local/netdata/var/lib/netdata/registry#g' \
  2730.         -e 's#[@]varlibdir_POST@#/usr/local/netdata/var/lib/netdata#g' \
  2731.         -e 's#[@]webdir_POST@#/usr/local/netdata/usr/share/netdata/web#g' \
  2732.         -e 's#[@]enable_aclk_POST@#yes#g' \
  2733.         -e 's#[@]enable_cloud_POST@#yes#g' \
  2734.         netdata-claim.sh.in > netdata-claim.sh.tmp; then \
  2735.         mv "netdata-claim.sh.tmp" "netdata-claim.sh"; \
  2736.     else \
  2737.         rm -f "netdata-claim.sh.tmp"; \
  2738.         false; \
  2739.     fi
  2740. Making all in parser
  2741. make[2]: Nothing to be done for `all'.
  2742. Making all in spawn
  2743. make[2]: Nothing to be done for `all'.
  2744. Making all in ml
  2745. Making all in kmeans
  2746. make[3]: Nothing to be done for `all'.
  2747. make[3]: Nothing to be done for `all-am'.
  2748.   CC       libnetdata/os.o
  2749.   CC       web/api/formatters/json_wrapper.o
  2750.   CC       web/api/formatters/charts2json.o
  2751.   CC       web/api/formatters/rrdset2json.o
  2752.   CC       exporting/read_config.o
  2753.   CC       exporting/clean_connectors.o
  2754.   CC       exporting/init_connectors.o
  2755.   CC       exporting/process_data.o
  2756.   CC       exporting/check_filters.o
  2757.   CC       exporting/send_data.o
  2758.   CC       exporting/send_internal_metrics.o
  2759.   CXX      ml/ml.o
  2760.   CC       aclk/aclk_charts_api.o
  2761.   CC       aclk/aclk_alarm_api.o
  2762.   CC       daemon/static_threads_macos.o
  2763.   CXX      aclk/aclk-schemas/proto/agent/v1/disconnect.pb.o
  2764.   CC       collectors/cups.plugin/cups_plugin.o
  2765.   CC       libnetdata/adaptive_resortable_list/adaptive_resortable_list.o
  2766.   CC       libnetdata/config/appconfig.o
  2767.   CC       libnetdata/avl/avl.o
  2768. In file included from aclk/aclk-schemas/proto/agent/v1/disconnect.pb.cc:4:
  2769. /var/folders/zz/zyxvpxvq6csfxvn_n0000000000000/T/netdata-updater-XXXXXXXXXX.IEZCYuie/netdata-v1.33.1-78-g9ef13f190/aclk/aclk-schemas/proto/agent/v1/disconnect.pb.h:17:2: error:
  2770.       This file was generated by an older version of protoc which is
  2771. #error This file was generated by an older version of protoc which is
  2772.  ^
  2773. /var/folders/zz/zyxvpxvq6csfxvn_n0000000000000/T/netdata-updater-XXXXXXXXXX.IEZCYuie/netdata-v1.33.1-78-g9ef13f190/aclk/aclk-schemas/proto/agent/v1/disconnect.pb.h:18:2: error:
  2774.       incompatible with your Protocol Buffer headers. Please
  2775. #error incompatible with your Protocol Buffer headers. Please
  2776.  ^
  2777. /var/folders/zz/zyxvpxvq6csfxvn_n0000000000000/T/netdata-updater-XXXXXXXXXX.IEZCYuie/netdata-v1.33.1-78-g9ef13f190/aclk/aclk-schemas/proto/agent/v1/disconnect.pb.h:19:2: error:
  2778.       regenerate this file with a newer version of protoc.
  2779. #error regenerate this file with a newer version of protoc.
  2780.  ^
  2781.   CC       libnetdata/buffer/buffer.o
  2782.   CC       libnetdata/circular_buffer/circular_buffer.o
  2783.   CC       libnetdata/clocks/clocks.o
  2784.   CC       libnetdata/completion/completion.o
  2785. /var/folders/zz/zyxvpxvq6csfxvn_n0000000000000/T/netdata-updater-XXXXXXXXXX.IEZCYuie/netdata-v1.33.1-78-g9ef13f190/aclk/aclk-schemas/proto/agent/v1/disconnect.pb.h:137:37: error:
  2786.       non-virtual member function marked 'final' hides virtual member function
  2787.   inline DisconnectReq* New() const final {
  2788.                                     ^
  2789. /usr/local/include/google/protobuf/message.h:251:12: note: hidden overloaded virtual function
  2790.       'google::protobuf::Message::New' declared here: different number of parameters (1 vs 0)
  2791.   Message* New(Arena* arena) const override = 0;
  2792.            ^
  2793. In file included from aclk/aclk-schemas/proto/agent/v1/disconnect.pb.cc:4:
  2794. /var/folders/zz/zyxvpxvq6csfxvn_n0000000000000/T/netdata-updater-XXXXXXXXXX.IEZCYuie/netdata-v1.33.1-78-g9ef13f190/aclk/aclk-schemas/proto/agent/v1/disconnect.pb.h:199:3: error:
  2795.       unknown type name 'PROTOBUF_MUST_USE_RESULT'
  2796.   PROTOBUF_MUST_USE_RESULT std::string* release_error_description();
  2797.   ^
  2798. /var/folders/zz/zyxvpxvq6csfxvn_n0000000000000/T/netdata-updater-XXXXXXXXXX.IEZCYuie/netdata-v1.33.1-78-g9ef13f190/aclk/aclk-schemas/proto/agent/v1/disconnect.pb.h:199:33: error:
  2799.       non-friend class member 'string' cannot have a qualified name
  2800.   PROTOBUF_MUST_USE_RESULT std::string* release_error_description();
  2801.                            ~~~~~^
  2802. /var/folders/zz/zyxvpxvq6csfxvn_n0000000000000/T/netdata-updater-XXXXXXXXXX.IEZCYuie/netdata-v1.33.1-78-g9ef13f190/aclk/aclk-schemas/proto/agent/v1/disconnect.pb.h:199:39: error:
  2803.       expected ';' at end of declaration list
  2804.   PROTOBUF_MUST_USE_RESULT std::string* release_error_description();
  2805.                                       ^
  2806.                                       ;
  2807. /var/folders/zz/zyxvpxvq6csfxvn_n0000000000000/T/netdata-updater-XXXXXXXXXX.IEZCYuie/netdata-v1.33.1-78-g9ef13f190/aclk/aclk-schemas/proto/agent/v1/disconnect.pb.h:214:3: error:
  2808.       unknown type name 'PROTOBUF_MUST_USE_RESULT'
  2809.   PROTOBUF_MUST_USE_RESULT PROTOBUF_NAMESPACE_ID::Timestamp* release_created_at();
  2810.   ^
  2811. /var/folders/zz/zyxvpxvq6csfxvn_n0000000000000/T/netdata-updater-XXXXXXXXXX.IEZCYuie/netdata-v1.33.1-78-g9ef13f190/aclk/aclk-schemas/proto/agent/v1/disconnect.pb.h:214:51: error:
  2812.       non-friend class member 'Timestamp' cannot have a qualified name
  2813.   PROTOBUF_MUST_USE_RESULT PROTOBUF_NAMESPACE_ID::Timestamp* release_created_at();
  2814.                            ~~~~~~~~~~~~~~~~~~~~~~~^
  2815. /var/folders/zz/zyxvpxvq6csfxvn_n0000000000000/T/netdata-updater-XXXXXXXXXX.IEZCYuie/netdata-v1.33.1-78-g9ef13f190/aclk/aclk-schemas/proto/agent/v1/disconnect.pb.h:214:60: error:
  2816.       expected ';' at end of declaration list
  2817.   PROTOBUF_MUST_USE_RESULT PROTOBUF_NAMESPACE_ID::Timestamp* release_created_at();
  2818.                                                            ^
  2819.                                                            ;
  2820. /var/folders/zz/zyxvpxvq6csfxvn_n0000000000000/T/netdata-updater-XXXXXXXXXX.IEZCYuie/netdata-v1.33.1-78-g9ef13f190/aclk/aclk-schemas/proto/agent/v1/disconnect.pb.h:91:9: error:
  2821.       cannot initialize object parameter of type 'const google::protobuf::MessageLite' with an expression of type
  2822.       'agent::v1::DisconnectReq'
  2823.     if (GetOwningArena() == from.GetOwningArena()) {
  2824.         ^~~~~~~~~~~~~~
  2825. /var/folders/zz/zyxvpxvq6csfxvn_n0000000000000/T/netdata-updater-XXXXXXXXXX.IEZCYuie/netdata-v1.33.1-78-g9ef13f190/aclk/aclk-schemas/proto/agent/v1/disconnect.pb.h:91:29: error:
  2826.       cannot initialize object parameter of type 'const google::protobuf::MessageLite' with an expression of type
  2827.       'agent::v1::DisconnectReq'
  2828.     if (GetOwningArena() == from.GetOwningArena()) {
  2829.                             ^~~~
  2830. /var/folders/zz/zyxvpxvq6csfxvn_n0000000000000/T/netdata-updater-XXXXXXXXXX.IEZCYuie/netdata-v1.33.1-78-g9ef13f190/aclk/aclk-schemas/proto/agent/v1/disconnect.pb.h:123:9: error:
  2831.       cannot initialize object parameter of type 'const google::protobuf::MessageLite' with an expression of type
  2832.       'agent::v1::DisconnectReq'
  2833.     if (GetOwningArena() == other->GetOwningArena()) {
  2834.         ^~~~~~~~~~~~~~
  2835. /var/folders/zz/zyxvpxvq6csfxvn_n0000000000000/T/netdata-updater-XXXXXXXXXX.IEZCYuie/netdata-v1.33.1-78-g9ef13f190/aclk/aclk-schemas/proto/agent/v1/disconnect.pb.h:123:29: error:
  2836.       cannot initialize object parameter of type 'const google::protobuf::MessageLite' with an expression of type
  2837.       'agent::v1::DisconnectReq'
  2838.     if (GetOwningArena() == other->GetOwningArena()) {
  2839.                             ^~~~~
  2840. /var/folders/zz/zyxvpxvq6csfxvn_n0000000000000/T/netdata-updater-XXXXXXXXXX.IEZCYuie/netdata-v1.33.1-78-g9ef13f190/aclk/aclk-schemas/proto/agent/v1/disconnect.pb.h:126:7: error:
  2841.       no matching function for call to 'GenericSwap'
  2842.       ::PROTOBUF_NAMESPACE_ID::internal::GenericSwap(this, other);
  2843.       ^~~~~~~~~~~~~~~~~~~~~~~~~~~~~~~~~~~~~~~~~~~~~~
  2844. /usr/local/include/google/protobuf/generated_message_util.h:163:22: note: candidate function not viable: no known
  2845.       conversion from 'agent::v1::DisconnectReq *' to 'google::protobuf::MessageLite *' for 1st argument
  2846. PROTOBUF_EXPORT void GenericSwap(MessageLite* m1, MessageLite* m2);
  2847.                      ^
  2848. /usr/local/include/google/protobuf/generated_message_util.h:165:22: note: candidate function not viable: no known
  2849.       conversion from 'agent::v1::DisconnectReq *' to 'google::protobuf::Message *' for 1st argument
  2850. PROTOBUF_EXPORT void GenericSwap(Message* m1, Message* m2);
  2851.                      ^
  2852. In file included from aclk/aclk-schemas/proto/agent/v1/disconnect.pb.cc:4:
  2853. /var/folders/zz/zyxvpxvq6csfxvn_n0000000000000/T/netdata-updater-XXXXXXXXXX.IEZCYuie/netdata-v1.33.1-78-g9ef13f190/aclk/aclk-schemas/proto/agent/v1/disconnect.pb.h:131:19: error:
  2854.       cannot initialize object parameter of type 'const google::protobuf::MessageLite' with an expression of type
  2855.       'agent::v1::DisconnectReq'
  2856.     GOOGLE_DCHECK(GetOwningArena() == other->GetOwningArena());
  2857.                   ^~~~~~~~~~~~~~
  2858. /usr/local/include/google/protobuf/stubs/logging.h:192:26: note: expanded from macro 'GOOGLE_DCHECK'
  2859. #define GOOGLE_DCHECK    GOOGLE_CHECK
  2860.                          ^
  2861. /usr/local/include/google/protobuf/stubs/logging.h:152:26: note: expanded from macro 'GOOGLE_CHECK'
  2862.   GOOGLE_LOG_IF(FATAL, !(EXPRESSION)) << "CHECK failed: " #EXPRESSION ": "
  2863.                          ^~~~~~~~~~
  2864. /usr/local/include/google/protobuf/stubs/logging.h:149:5: note: expanded from macro 'GOOGLE_LOG_IF'
  2865.   !(CONDITION) ? (void)0 : GOOGLE_LOG(LEVEL)
  2866.     ^~~~~~~~~
  2867. In file included from aclk/aclk-schemas/proto/agent/v1/disconnect.pb.cc:4:
  2868. /var/folders/zz/zyxvpxvq6csfxvn_n0000000000000/T/netdata-updater-XXXXXXXXXX.IEZCYuie/netdata-v1.33.1-78-g9ef13f190/aclk/aclk-schemas/proto/agent/v1/disconnect.pb.h:131:39: error:
  2869.       cannot initialize object parameter of type 'const google::protobuf::MessageLite' with an expression of type
  2870.       'agent::v1::DisconnectReq'
  2871.     GOOGLE_DCHECK(GetOwningArena() == other->GetOwningArena());
  2872.                                       ^~~~~
  2873. /usr/local/include/google/protobuf/stubs/logging.h:192:26: note: expanded from macro 'GOOGLE_DCHECK'
  2874. #define GOOGLE_DCHECK    GOOGLE_CHECK
  2875.                          ^
  2876. /usr/local/include/google/protobuf/stubs/logging.h:152:26: note: expanded from macro 'GOOGLE_CHECK'
  2877.   GOOGLE_LOG_IF(FATAL, !(EXPRESSION)) << "CHECK failed: " #EXPRESSION ": "
  2878.                          ^~~~~~~~~~
  2879. /usr/local/include/google/protobuf/stubs/logging.h:149:5: note: expanded from macro 'GOOGLE_LOG_IF'
  2880.   !(CONDITION) ? (void)0 : GOOGLE_LOG(LEVEL)
  2881.     ^~~~~~~~~
  2882. In file included from aclk/aclk-schemas/proto/agent/v1/disconnect.pb.cc:4:
  2883. /var/folders/zz/zyxvpxvq6csfxvn_n0000000000000/T/netdata-updater-XXXXXXXXXX.IEZCYuie/netdata-v1.33.1-78-g9ef13f190/aclk/aclk-schemas/proto/agent/v1/disconnect.pb.h:336:7: error:
  2884.       cannot initialize object parameter of type 'const google::protobuf::MessageLite' with an expression of type
  2885.       'agent::v1::DisconnectReq'
  2886.   if (GetArenaForAllocation() == nullptr) {
  2887.       ^~~~~~~~~~~~~~~~~~~~~
  2888. /var/folders/zz/zyxvpxvq6csfxvn_n0000000000000/T/netdata-updater-XXXXXXXXXX.IEZCYuie/netdata-v1.33.1-78-g9ef13f190/aclk/aclk-schemas/proto/agent/v1/disconnect.pb.h:347:57: error:
  2889.       out-of-line definition of 'release_created_at' does not match any declaration in 'agent::v1::DisconnectReq'
  2890. inline PROTOBUF_NAMESPACE_ID::Timestamp* DisconnectReq::release_created_at() {
  2891.                                                         ^~~~~~~~~~~~~~~~~~
  2892. fatal error: too many errors emitted, stopping now [-ferror-limit=]
  2893. 20 errors generated.
  2894. make[2]: *** [aclk/aclk-schemas/proto/agent/v1/disconnect.pb.o] Error 1
  2895. make[2]: *** Waiting for unfinished jobs....
  2896. make[1]: *** [all-recursive] Error 1
  2897. make: *** [all] Error 2
  2898.  FAILED  
  2899.  
  2900. Dom 27 Feb 2022 11:56:22 CET : ERROR:  FAILED TO UPDATE NETDATA : FAILED TO COMPILE/INSTALL NETDATA
  2901.  FAILED
  2902.  
  2903.  ABORTED  Failed to update existing Netdata install at /usr/local/netdata
Advertisement
Add Comment
Please, Sign In to add comment