SHARE
TWEET

Untitled

a guest Dec 21st, 2014 656 Never
Not a member of Pastebin yet? Sign Up, it unlocks many cool features!
  1. SLF4J: Failed to load class "org.slf4j.impl.StaticLoggerBinder".
  2. SLF4J: Defaulting to no-operation (NOP) logger implementation
  3. SLF4J: See http://www.slf4j.org/codes.html#StaticLoggerBinder for further details.
  4. [INFO] Scanning for projects...
  5. [INFO]                                                                        
  6. [INFO] ------------------------------------------------------------------------
  7. [INFO] Building MavenProject 0.1
  8. [INFO] ------------------------------------------------------------------------
  9. [INFO]
  10. [INFO] --- maven-resources-plugin:2.5:resources (default-resources) @ MavenProject ---
  11. [debug] execute contextualize
  12. [WARNING] File encoding has not been set, using platform encoding Cp1252, i.e. build is platform dependent!
  13. [WARNING] Using platform encoding (Cp1252 actually) to copy filtered resources, i.e. build is platform dependent!
  14. [INFO] Copying 1 resource to .
  15. [INFO]
  16. [INFO] --- maven-compiler-plugin:2.3.2:compile (default-compile) @ MavenProject ---
  17. [WARNING] File encoding has not been set, using platform encoding Cp1252, i.e. build is platform dependent!
  18. [INFO] Compiling 1 source file to ....
  19. [INFO] -------------------------------------------------------------
  20. [ERROR] COMPILATION ERROR :
  21. [INFO] -------------------------------------------------------------
  22. [ERROR] --class--.java:[6,17] error: package org.bukkit does not exist
  23. [ERROR] --class--.java:[7,17] error: package org.bukkit does not exist
  24. [ERROR] --class--.java:[8,17] error: package org.bukkit does not exist
  25. [ERROR] --class--.java:[9,24] error: package org.bukkit.entity does not exist
  26. [ERROR] --class--.java:[10,24] error: package org.bukkit.entity does not exist
  27. [ERROR] --class--.java:[11,24] error: package org.bukkit.entity does not exist
  28. [ERROR] --class--.java:[12,23] error: package org.bukkit.event does not exist
  29. [ERROR] --class--.java:[13,29] error: package org.bukkit.event.block does not exist
  30. [ERROR] --class--.java:[14,30] error: package org.bukkit.event.player does not exist
  31. [ERROR] --class--.java:[15,27] error: package org.bukkit.inventory does not exist
  32. [ERROR] --class--.java:[24,7] error: cannot access Listener
  33. [ERROR] --class--.java:[35,8] error: cannot find symbol
  34. [ERROR] --class--.java:[47,21] error: cannot find symbol
  35. [ERROR] --class--.java:[53,24] error: cannot find symbol
  36. [ERROR] --class--.java:[46,2] error: cannot find symbol
  37. [ERROR] --class--.java:[52,2] error: cannot find symbol
  38. [ERROR] --class--.java:[68,2] error: cannot find symbol
  39. [ERROR] --class--.java:[29,143] error: cannot find symbol
  40. [ERROR] --class--.java:[29,136] error: cannot access Material
  41. [ERROR] --class--.java:[36,13] error: cannot find symbol
  42. [ERROR] --class--.java:[37,51] error: cannot find symbol
  43. [ERROR] --class--.java:[37,11] error: cannot find symbol
  44. [ERROR] --class--.java:[38,55] error: cannot find symbol
  45. [ERROR] --class--.java:[38,11] error: cannot find symbol
  46. [ERROR] --class--.java:[39,53] error: cannot find symbol
  47. [ERROR] --class--.java:[39,11] error: cannot find symbol
  48. [ERROR] --class--.java:[40,50] error: cannot find symbol
  49. [ERROR] --class--.java:[40,11] error: cannot find symbol
  50. [ERROR] --class--.java:[41,11] error: cannot find symbol
  51. [ERROR] --class--.java:[41,4] error: cannot access ItemStack
  52. [ERROR] --class--.java:[34,1] error: method does not override or implement a method from a supertype
  53. [ERROR] --class--.java:[54,2] error: cannot find symbol
  54. [ERROR] --class--.java:[55,2] error: cannot find symbol
  55. [ERROR] --class--.java:[57,28] error: cannot find symbol
  56. [ERROR] --class--.java:[58,32] error: cannot find symbol
  57. [ERROR] --class--.java:[58,84] error: cannot find symbol
  58. [ERROR] --class--.java:[60,9] error: cannot find symbol
  59. [ERROR] --class--.java:[62,7] error: cannot find symbol
  60. [ERROR] --class--.java:[62,112] error: cannot find symbol
  61. [ERROR] --class--.java:[70,11] error: cannot access Event
  62. [ERROR] --class--.java:[72,6] error: cannot find symbol
  63. [ERROR] --class--.java:[72,17] error: cannot find symbol
  64. [ERROR] --class--.java:[73,6] error: cannot find symbol
  65. [ERROR] --class--.java:[77,19] error: cannot access JavaPlugin
  66. [INFO] 44 errors
  67. [INFO] -------------------------------------------------------------
  68. [INFO] ------------------------------------------------------------------------
  69. [INFO] BUILD FAILURE
  70. [INFO] ------------------------------------------------------------------------
  71. [INFO] Total time: 2.395s
  72. [INFO] Finished at: Sun Dec 21 22:24:28 MST 2014
  73. [INFO] Final Memory: 9M/123M
  74. [INFO] ------------------------------------------------------------------------
  75. [ERROR] Failed to execute goal org.apache.maven.plugins:maven-compiler-plugin:2.3.2:compile (default-compile) on project MavenProject: Compilation failure: Compilation failure:
  76. [ERROR] --class--.java:[6,17] error: package org.bukkit does not exist
  77. [ERROR] --class--.java:[7,17] error: package org.bukkit does not exist
  78. [ERROR] --class--.java:[8,17] error: package org.bukkit does not exist
  79. [ERROR] --class--.java:[9,24] error: package org.bukkit.entity does not exist
  80. [ERROR] --class--.java:[10,24] error: package org.bukkit.entity does not exist
  81. [ERROR] --class--.java:[11,24] error: package org.bukkit.entity does not exist
  82. [ERROR] --class--.java:[12,23] error: package org.bukkit.event does not exist
  83. [ERROR] --class--.java:[13,29] error: package org.bukkit.event.block does not exist
  84. [ERROR] --class--.java:[14,30] error: package org.bukkit.event.player does not exist
  85. [ERROR] --class--.java:[15,27] error: package org.bukkit.inventory does not exist
  86. [ERROR] --class--.java:[24,7] error: cannot access Listener
  87. [ERROR] --class--.java:[35,8] error: cannot find symbol
  88. [ERROR] --class--.java:[47,21] error: cannot find symbol
  89. [ERROR] --class--.java:[53,24] error: cannot find symbol
  90. [ERROR] --class--.java:[46,2] error: cannot find symbol
  91. [ERROR] --class--.java:[52,2] error: cannot find symbol
  92. [ERROR] --class--.java:[68,2] error: cannot find symbol
  93. [ERROR] --class--.java:[29,143] error: cannot find symbol
  94. [ERROR] --class--.java:[29,136] error: cannot access Material
  95. [ERROR] --class--.java:[36,13] error: cannot find symbol
  96. [ERROR] --class--.java:[37,51] error: cannot find symbol
  97. [ERROR] --class--.java:[37,11] error: cannot find symbol
  98. [ERROR] --class--.java:[38,55] error: cannot find symbol
  99. [ERROR] --class--.java:[38,11] error: cannot find symbol
  100. [ERROR] --class--.java:[39,53] error: cannot find symbol
  101. [ERROR] --class--.java:[39,11] error: cannot find symbol
  102. [ERROR] --class--.java:[40,50] error: cannot find symbol
  103. [ERROR] --class--.java:[40,11] error: cannot find symbol
  104. [ERROR] --class--.java:[41,11] error: cannot find symbol
  105. [ERROR] --class--.java:[41,4] error: cannot access ItemStack
  106. [ERROR] --class--.java:[34,1] error: method does not override or implement a method from a supertype
  107. [ERROR] --class--.java:[54,2] error: cannot find symbol
  108. [ERROR] --class--.java:[55,2] error: cannot find symbol
  109. [ERROR] --class--.java:[57,28] error: cannot find symbol
  110. [ERROR] --class--.java:[58,32] error: cannot find symbol
  111. [ERROR] --class--.java:[58,84] error: cannot find symbol
  112. [ERROR] --class--.java:[60,9] error: cannot find symbol
  113. [ERROR] --class--.java:[62,7] error: cannot find symbol
  114. [ERROR] --class--.java:[62,112] error: cannot find symbol
  115. [ERROR] --class--.java:[70,11] error: cannot access Event
  116. [ERROR] --class--.java:[72,6] error: cannot find symbol
  117. [ERROR] --class--.java:[72,17] error: cannot find symbol
  118. [ERROR] --class--.java:[73,6] error: cannot find symbol
  119. [ERROR] SLF4J: Failed to load class "org.slf4j.impl.StaticLoggerBinder".
  120. SLF4J: Defaulting to no-operation (NOP) logger implementation
  121. SLF4J: See http://www.slf4j.org/codes.html#StaticLoggerBinder for further details.
  122. [INFO] Scanning for projects...
  123. [INFO]                                                                        
  124. [INFO] ------------------------------------------------------------------------
  125. [INFO] Building MavenProject 0.1
  126. [INFO] ------------------------------------------------------------------------
  127. [INFO]
  128. [INFO] --- maven-resources-plugin:2.5:resources (default-resources) @ MavenProject ---
  129. [debug] execute contextualize
  130. [WARNING] File encoding has not been set, using platform encoding Cp1252, i.e. build is platform dependent!
  131. [WARNING] Using platform encoding (Cp1252 actually) to copy filtered resources, i.e. build is platform dependent!
  132. [INFO] Copying 1 resource to .
  133. [INFO]
  134. [INFO] --- maven-compiler-plugin:2.3.2:compile (default-compile) @ MavenProject ---
  135. [WARNING] File encoding has not been set, using platform encoding Cp1252, i.e. build is platform dependent!
  136. [INFO] Compiling 1 source file to ......
  137. [INFO] -------------------------------------------------------------
  138. [ERROR] COMPILATION ERROR :
  139. [INFO] -------------------------------------------------------------
  140. [ERROR] --class--.java:[6,17] error: package org.bukkit does not exist
  141. [ERROR] --class--.java:[7,17] error: package org.bukkit does not exist
  142. [ERROR] --class--.java:[8,17] error: package org.bukkit does not exist
  143. [ERROR] --class--.java:[9,24] error: package org.bukkit.entity does not exist
  144. [ERROR] --class--.java:[10,24] error: package org.bukkit.entity does not exist
  145. [ERROR] --class--.java:[11,24] error: package org.bukkit.entity does not exist
  146. [ERROR] --class--.java:[12,23] error: package org.bukkit.event does not exist
  147. [ERROR] --class--.java:[13,29] error: package org.bukkit.event.block does not exist
  148. [ERROR] --class--.java:[14,30] error: package org.bukkit.event.player does not exist
  149. [ERROR] --class--.java:[15,27] error: package org.bukkit.inventory does not exist
  150. [ERROR] --class--.java:[24,7] error: cannot access Listener
  151. [ERROR] --class--.java:[35,8] error: cannot find symbol
  152. [ERROR] --class--.java:[47,21] error: cannot find symbol
  153. [ERROR] --class--.java:[53,24] error: cannot find symbol
  154. [ERROR] --class--.java:[46,2] error: cannot find symbol
  155. [ERROR] --class--.java:[52,2] error: cannot find symbol
  156. [ERROR] --class--.java:[68,2] error: cannot find symbol
  157. [ERROR] --class--.java:[29,143] error: cannot find symbol
  158. [ERROR] --class--.java:[29,136] error: cannot access Material
  159. [ERROR] --class--.java:[36,13] error: cannot find symbol
  160. [ERROR] --class--.java:[37,51] error: cannot find symbol
  161. [ERROR] --class--.java:[37,11] error: cannot find symbol
  162. [ERROR] --class--.java:[38,55] error: cannot find symbol
  163. [ERROR] --class--.java:[38,11] error: cannot find symbol
  164. [ERROR] --class--.java:[39,53] error: cannot find symbol
  165. [ERROR] --class--.java:[39,11] error: cannot find symbol
  166. [ERROR] --class--.java:[40,50] error: cannot find symbol
  167. [ERROR] --class--.java:[40,11] error: cannot find symbol
  168. [ERROR] --class--.java:[41,11] error: cannot find symbol
  169. [ERROR] --class--.java:[41,4] error: cannot access ItemStack
  170. [ERROR] --class--.java:[34,1] error: method does not override or implement a method from a supertype
  171. [ERROR] --class--.java:[54,2] error: cannot find symbol
  172. [ERROR] --class--.java:[55,2] error: cannot find symbol
  173. [ERROR] --class--.java:[57,28] error: cannot find symbol
  174. [ERROR] --class--.java:[58,32] error: cannot find symbol
  175. [ERROR] --class--.java:[58,84] error: cannot find symbol
  176. [ERROR] --class--.java:[60,9] error: cannot find symbol
  177. [ERROR] --class--.java:[62,7] error: cannot find symbol
  178. [ERROR] --class--.java:[62,112] error: cannot find symbol
  179. [ERROR] --class--.java:[70,11] error: cannot access Event
  180. [ERROR] --class--.java:[72,6] error: cannot find symbol
  181. [ERROR] --class--.java:[72,17] error: cannot find symbol
  182. [ERROR] --class--.java:[73,6] error: cannot find symbol
  183. [ERROR] --class--.java:[77,19] error: cannot access JavaPlugin
  184. [INFO] 44 errors
  185. [INFO] -------------------------------------------------------------
  186. [INFO] ------------------------------------------------------------------------
  187. [INFO] BUILD FAILURE
  188. [INFO] ------------------------------------------------------------------------
  189. [INFO] Total time: 2.395s
  190. [INFO] Finished at: Sun Dec 21 22:24:28 MST 2014
  191. [INFO] Final Memory: 9M/123M
  192. [INFO] ------------------------------------------------------------------------
  193. [ERROR] Failed to execute goal org.apache.maven.plugins:maven-compiler-plugin:2.3.2:compile (default-compile) on project MavenProject: Compilation failure: Compilation failure:
  194. [ERROR] --class--.java:[6,17] error: package org.bukkit does not exist
  195. [ERROR] --class--.java:[7,17] error: package org.bukkit does not exist
  196. [ERROR] --class--.java:[8,17] error: package org.bukkit does not exist
  197. [ERROR] --class--.java:[9,24] error: package org.bukkit.entity does not exist
  198. [ERROR] --class--.java:[10,24] error: package org.bukkit.entity does not exist
  199. [ERROR] --class--.java:[11,24] error: package org.bukkit.entity does not exist
  200. [ERROR] --class--.java:[12,23] error: package org.bukkit.event does not exist
  201. [ERROR] --class--.java:[13,29] error: package org.bukkit.event.block does not exist
  202. [ERROR] --class--.java:[14,30] error: package org.bukkit.event.player does not exist
  203. [ERROR] --class--.java:[15,27] error: package org.bukkit.inventory does not exist
  204. [ERROR] --class--.java:[24,7] error: cannot access Listener
  205. [ERROR] --class--.java:[35,8] error: cannot find symbol
  206. [ERROR] --class--.java:[47,21] error: cannot find symbol
  207. [ERROR] --class--.java:[53,24] error: cannot find symbol
  208. [ERROR] --class--.java:[46,2] error: cannot find symbol
  209. [ERROR] --class--.java:[52,2] error: cannot find symbol
  210. [ERROR] --class--.java:[68,2] error: cannot find symbol
  211. [ERROR] --class--.java:[29,143] error: cannot find symbol
  212. [ERROR] --class--.java:[29,136] error: cannot access Material
  213. [ERROR] --class--.java:[36,13] error: cannot find symbol
  214. [ERROR] --class--.java:[37,51] error: cannot find symbol
  215. [ERROR] --class--.java:[37,11] error: cannot find symbol
  216. [ERROR] --class--.java:[38,55] error: cannot find symbol
  217. [ERROR] --class--.java:[38,11] error: cannot find symbol
  218. [ERROR] --class--.java:[39,53] error: cannot find symbol
  219. [ERROR] --class--.java:[39,11] error: cannot find symbol
  220. [ERROR] --class--.java:[40,50] error: cannot find symbol
  221. [ERROR] --class--.java:[40,11] error: cannot find symbol
  222. [ERROR] --class--.java:[41,11] error: cannot find symbol
  223. [ERROR] --class--.java:[41,4] error: cannot access ItemStack
  224. [ERROR] --class--.java:[34,1] error: method does not override or implement a method from a supertype
  225. [ERROR] --class--.java:[54,2] error: cannot find symbol
  226. [ERROR] --class--.java:[55,2] error: cannot find symbol
  227. [ERROR] --class--.java:[57,28] error: cannot find symbol
  228. [ERROR] --class--.java:[58,32] error: cannot find symbol
  229. [ERROR] --class--.java:[58,84] error: cannot find symbol
  230. [ERROR] --class--.java:[60,9] error: cannot find symbol
  231. [ERROR] --class--.java:[62,7] error: cannot find symbol
  232. [ERROR] --class--.java:[62,112] error: cannot find symbol
  233. [ERROR] --class--.java:[70,11] error: cannot access Event
  234. [ERROR] --class--.java:[72,6] error: cannot find symbol
  235. [ERROR] --class--.java:[72,17] error: cannot find symbol
  236. [ERROR] --class--.java:[73,6] error: cannot find symbol
  237. [ERROR] --class--.java:[77,19] error: cannot access JavaPlugin
  238. [ERROR] -> [Help 1]
  239. [ERROR]
  240. [ERROR] To see the full stack trace of the errors, re-run Maven with the -e switch.
  241. [ERROR] Re-run Maven using the -X switch to enable full debug logging.
  242. [ERROR]
  243. [ERROR] For more information about the errors and possible solutions, please read the following articles:
  244. [ERROR] [Help 1] http://cwiki.apache.org/confluence/display/MAVEN/MojoFailureException.java:[77,19] error: cannot access JavaPlugin
  245. [ERROR] -> [Help 1]
  246. [ERROR]
  247. [ERROR] To see the full stack trace of the errors, re-run Maven with the -e switch.
  248. [ERROR] Re-run Maven using the -X switch to enable full debug logging.
  249. [ERROR]
  250. [ERROR] For more information about the errors and possible solutions, please read the following articles:
  251. [ERROR] [Help 1] http://cwiki.apache.org/confluence/display/MAVEN/MojoFailureException
RAW Paste Data
We use cookies for various purposes including analytics. By continuing to use Pastebin, you agree to our use of cookies as described in the Cookies Policy. OK, I Understand
 
Top