taa1

Compiling ncat 7.12 from source -- missing 2 files

Aug 21st, 2016
160
0
Never
Not a member of Pastebin yet? Sign Up, it unlocks many cool features!
text 4.42 KB | None | 0 0
  1. wget --no-check-certificate https://nmap.org/dist/nmap-7.12.tgz
  2. tar xzf nmap-7.12.tgz
  3. cd nmap-7.12
  4. cd ncat
  5. ./configure
  6. (snip)
  7. configure: creating ./config.status
  8. config.status: creating Makefile
  9. config.status: creating config.h
  10. . .
  11. \`-"'"-'/
  12. } 6 6 {
  13. ==. Y ,==
  14. /^^^\ .
  15. / \ ) Ncat: A modern interpretation of classic Netcat
  16. ( )-( )/
  17. -""---""--- /
  18. / Ncat \_/
  19. ( ____
  20. \_.=|____E
  21. Configuration complete.
  22.  
  23. ~/nmap-7.12/ncat taa$ make
  24.  
  25. Makefile:212: makefile.dep: No such file or directory
  26. gcc -MM -I./../liblua -I../libpcap -DHAVE_CONFIG_H -DNCAT_DATADIR="\"/usr/local/share/ncat\"" -D_FORTIFY_SOURCE=2 -I. -I.. -I../nsock/include/ -I../nbase ncat_main.c ncat_connect.c ncat_core.c ncat_posix.c ncat_listen.c ncat_proxy.c ncat_ssl.c base64.c http.c util.c sys_wrap.c http_digest.c ncat_lua.c > makefile.dep
  27. In file included from ncat_main.c:124:
  28. ../nsock/include/nsock.h:65:26: error: nsock_config.h: No such file or directory
  29. In file included from ncat.h:128,
  30. from ncat_main.c:125:
  31. ../nbase/nbase.h:161:26: error: nbase_config.h: No such file or directory
  32. In file included from ncat_connect.c:124:
  33. ../nsock/include/nsock.h:65:26: error: nsock_config.h: No such file or directory
  34. In file included from ncat.h:128,
  35. from ncat_connect.c:125:
  36. ../nbase/nbase.h:161:26: error: nbase_config.h: No such file or directory
  37. In file included from ncat.h:128,
  38. from ncat_core.c:123:
  39. ../nbase/nbase.h:161:26: error: nbase_config.h: No such file or directory
  40. In file included from ncat.h:134,
  41. from ncat_core.c:123:
  42. ../nsock/include/nsock.h:65:26: error: nsock_config.h: No such file or directory
  43. In file included from ncat.h:128,
  44. from ncat_posix.c:123:
  45. ../nbase/nbase.h:161:26: error: nbase_config.h: No such file or directory
  46. In file included from ncat.h:134,
  47. from ncat_posix.c:123:
  48. ../nsock/include/nsock.h:65:26: error: nsock_config.h: No such file or directory
  49. In file included from ncat.h:128,
  50. from ncat_listen.c:123:
  51. ../nbase/nbase.h:161:26: error: nbase_config.h: No such file or directory
  52. In file included from ncat.h:134,
  53. from ncat_listen.c:123:
  54. ../nsock/include/nsock.h:65:26: error: nsock_config.h: No such file or directory
  55. In file included from util.h:128,
  56. from http.h:127,
  57. from ncat_proxy.c:124:
  58. ../nbase/nbase.h:161:26: error: nbase_config.h: No such file or directory
  59. In file included from ncat_proxy.c:125:
  60. ../nsock/include/nsock.h:65:26: error: nsock_config.h: No such file or directory
  61. In file included from ncat_ssl.c:123:
  62. ../nbase/nbase.h:161:26: error: nbase_config.h: No such file or directory
  63. In file included from ncat_ssl.c:126:
  64. ../nsock/include/nsock.h:65:26: error: nsock_config.h: No such file or directory
  65. In file included from base64.c:124:
  66. ../nbase/nbase.h:161:26: error: nbase_config.h: No such file or directory
  67. In file included from ncat.h:128,
  68. from http.c:126:
  69. ../nbase/nbase.h:161:26: error: nbase_config.h: No such file or directory
  70. In file included from ncat.h:134,
  71. from http.c:126:
  72. ../nsock/include/nsock.h:65:26: error: nsock_config.h: No such file or directory
  73. In file included from sys_wrap.h:126,
  74. from util.c:123:
  75. ../nbase/nbase.h:161:26: error: nbase_config.h: No such file or directory
  76. In file included from ncat.h:134,
  77. from util.c:125:
  78. ../nsock/include/nsock.h:65:26: error: nsock_config.h: No such file or directory
  79. In file included from sys_wrap.h:126,
  80. from sys_wrap.c:125:
  81. ../nbase/nbase.h:161:26: error: nbase_config.h: No such file or directory
  82. In file included from ncat.h:128,
  83. from http_digest.c:138:
  84. ../nbase/nbase.h:161:26: error: nbase_config.h: No such file or directory
  85. In file included from ncat.h:134,
  86. from http_digest.c:138:
  87. ../nsock/include/nsock.h:65:26: error: nsock_config.h: No such file or directory
  88. In file included from ncat.h:128,
  89. from ncat_lua.c:123:
  90. ../nbase/nbase.h:161:26: error: nbase_config.h: No such file or directory
  91. In file included from ncat.h:134,
  92. from ncat_lua.c:123:
  93. ../nsock/include/nsock.h:65:26: error: nsock_config.h: No such file or directory
  94. make: *** [makefile.dep] Error 1
Advertisement
Add Comment
Please, Sign In to add comment