Advertisement
Guest User

LibreOffice build error on Windows & Cygwin

a guest
Jun 11th, 2020
481
0
Never
Not a member of Pastebin yet? Sign Up, it unlocks many cool features!
Bash 2.70 KB | None | 0 0
  1. /cygdrive/c/build $   /cygdrive/c/sources/libo-core/autogen.sh --with-external-tar=/cygdrive/c/sources/lo-externalsrc  --with-junit=/cygdrive/c/sources/junit-4.10.jar  --with-ant-home=/cygdrive/c/sources/apache-ant-1.9.5  --enable-pch --disable-ccache  --with-locales=ko --with-vendor=me  --with-lang=ko  --enable-dbgutil  --disable-skia  --with-jdk-home="/cygdrive/c/Program Files/AdoptOpenJDK/jdk-14.0.1.7-openj9/" --enable-64-bit --with-visual-studio=2019 --disable-odk
  2.  
  3. /cygdrive/c/build $    /opt/lo/bin/make distclean gb_COLOR=1
  4.  
  5.  
  6. building
  7.  
  8.  
  9. error message
  10. C:/build/workdir/UnpackedTarball/nss/nss/lib/libpkix/pkix_pl_nss/module/pkix_pl_pk11certstore.c: fatal error C1041: □□□α׷□ □□□□□ͺ□□̽□ 'C:\build\workdir\Unpacked
  11. Tarball\nss\nss\lib\libpkix\pkix_pl_nss\module\vc140.pdb'□□(□□) □□ □□ □□□□□ϴ□. □□□□ CL.EXE□□□□ □□□□□□ .PDB □□□Ͽ□ □□□□ □□□□ /FS□□ □□□□□Ͻʽÿ□.
  12. make[8]: *** [../../../../coreconf/rules.mk:287: out/pkix_pl_pk11certstore.obj] Error 2
  13. make[8]: *** Waiting for unfinished jobs....
  14. make[7]: *** [../../../coreconf/rules.mk:44: module] Error 2
  15. make[6]: *** [../../coreconf/rules.mk:44: pkix_pl_nss] Error 2
  16. make[5]: *** [../coreconf/rules.mk:44: libpkix] Error 2
  17. make[5]: *** Waiting for unfinished jobs....
  18. /usr/bin/sh: -c: line 0: syntax error near unexpected token `('
  19. /usr/bin/sh: -c: line 0: `expr Microsoft(R) \> 1600 \| Microsoft(R) = 1600 \& C/C++ \>= 40219'
  20. /usr/bin/sh: -c: line 0: syntax error near unexpected token `('
  21. /usr/bin/sh: -c: line 0: `expr Microsoft(R) \>= 1700'
  22. /usr/bin/sh: -c: line 0: syntax error near unexpected token `('
  23. /usr/bin/sh: -c: line 0: `expr Microsoft(R) \>= 1800'
  24. quickder.c
  25. secdig.c
  26. derdec.c
  27. derenc.c
  28. dersubr.c
  29. dertime.c
  30. errstrs.c
  31. nssb64d.c
  32. nssb64e.c
  33. nssrwlk.c
  34. nssilock.c
  35. oidstring.c
  36. pkcs1sig.c
  37. portreg.c
  38. secalgid.c
  39. secasn1d.c
  40. secasn1e.c
  41. secasn1u.c
  42. secitem.c
  43. secload.c
  44. secoid.c
  45. sectime.c
  46. secport.c
  47. templates.c
  48. utf8.c
  49. utilmod.c
  50. utilpars.c
  51. pkcs11uri.c
  52. Microsoft (R) Windows (R) Resource Compiler Version 10.0.10011.16384
  53. Copyright (C) Microsoft Corporation.  All rights reserved.
  54.  
  55. out/nssutil.res finished
  56. out/nssutil.lib
  57.    out\nssutil3.lib □□□̺귯□□ □□ out\nssutil3.exp □□ü□□ □□□□□ϰ□ □ֽ□□ϴ□.
  58. make[4]: *** [coreconf/rules.mk:44: lib] Error 2
  59. make[3]: *** [manifest.mn:28: all] Error 2
  60. make[2]: *** [Makefile:54: nss_build_all] Error 2
  61. make[1]: *** [C:/sources/libo-core/external/nss/ExternalProject_nss.mk:21: C:/build/workdir/ExternalProject/nss/build] Error 1
  62. make[1]: *** Waiting for unfinished jobs....
  63. make: *** [Makefile:282: build] Error 2
  64.  
  65. /cygdrive/c/build $
Advertisement
Add Comment
Please, Sign In to add comment
Advertisement