akilawickey

Untitled

Jun 14th, 2017
108
0
Never
Not a member of Pastebin yet? Sign Up, it unlocks many cool features!
text 5.21 KB | None | 0 0
  1.  
  2. e12376@aiken:/export/e12376/gsoc/phase2/genivi-dev-platform/gdp-src-build$ bitbake zebra
  3. Loading cache: 100% |############################################################################################################| Time: 0:00:00
  4. Loaded 2761 entries from dependency cache.
  5. Parsing recipes: 100% |##########################################################################################################| Time: 0:00:01
  6. Parsing of 2029 .bb files complete (2028 cached, 1 parsed). 2759 targets, 342 skipped, 0 masked, 0 errors.
  7. NOTE: Resolving any missing task queue dependencies
  8.  
  9. Build Configuration:
  10. BB_VERSION = "1.32.0"
  11. BUILD_SYS = "x86_64-linux"
  12. NATIVELSBSTRING = "Ubuntu-14.04"
  13. TARGET_SYS = "x86_64-poky-linux"
  14. MACHINE = "qemux86-64"
  15. DISTRO = "poky-ivi-systemd"
  16. DISTRO_VERSION = "12.0.0"
  17. TUNE_FEATURES = "m64 core2"
  18. TARGET_FPU = ""
  19. meta
  20. meta-yocto
  21. meta-yocto-bsp = "HEAD:924e576b8930fd2268d85f0b151e5f68a3c2afce"
  22. meta-ivi
  23. meta-ivi-bsp = "HEAD:df824ccfb821a38f2e83b1d1ac75a4601a5b738b"
  24. meta-oe
  25. meta-filesystems
  26. meta-ruby
  27. meta-gnome
  28. meta-python = "HEAD:fe5c83312de11e80b85680ef237f8acb04b4b26e"
  29. meta-qt5 = "HEAD:d715f2c1d340fa38f8a9860acc73de5e14a38b75"
  30. meta-genivi-dev = "HEAD:cfafb73eb8a0468b1c2c417335139dc49e4cbda9"
  31. meta-oic = "HEAD:b9ba736871b8f8b741cc9c1d88dda56e63a35091"
  32. meta-iot-web = "HEAD:1cd4254c97e3817cc617e2c1d75c9a57e5b0f8d5"
  33. meta-erlang = "HEAD:4d7eacc8e6593934ed5b0c8abc3d3e9dc339d849"
  34. meta-rvi = "HEAD:de9d548fe35e2cee8688faaae910b4f6f7fea17e"
  35. meta-browser = "HEAD:021a954614d5dc4555e856484c27648757a76b5b"
  36.  
  37. Initialising tasks: 100% |#######################################################################################################| Time: 0:00:00
  38. NOTE: Executing SetScene Tasks
  39. NOTE: Executing RunQueue Tasks
  40. WARNING: zebra-1.0-r0 do_fetch: Missing shrinkwrap file in NPM_SHRINKWRAP for zebra, this will lead to unreliable builds!
  41. WARNING: zebra-1.0-r0 do_fetch: Missing lockdown file in NPM_LOCKDOWN for zebra, this will lead to unreproducible builds!
  42. WARNING: zebra-1.0-r0 do_fetch: Failed to fetch URL npm://zebkit.npmjs.org;name=zebra;version=1.0, attempting MIRRORS if available
  43. ERROR: zebra-1.0-r0 do_fetch: Fetcher failure: Fetch command export PATH="/export/e12376/gsoc/phase2/genivi-dev-platform/poky/scripts:/export/e12376/gsoc/phase2/genivi-dev-platform/gdp-src-build/tmp/sysroots/x86_64-linux/usr/bin/x86_64-poky-linux:/export/e12376/gsoc/phase2/genivi-dev-platform/gdp-src-build/tmp/sysroots/qemux86-64/usr/bin/crossscripts:/export/e12376/gsoc/phase2/genivi-dev-platform/gdp-src-build/tmp/sysroots/x86_64-linux/usr/sbin:/export/e12376/gsoc/phase2/genivi-dev-platform/gdp-src-build/tmp/sysroots/x86_64-linux/usr/bin:/export/e12376/gsoc/phase2/genivi-dev-platform/gdp-src-build/tmp/sysroots/x86_64-linux/sbin:/export/e12376/gsoc/phase2/genivi-dev-platform/gdp-src-build/tmp/sysroots/x86_64-linux/bin:/export/e12376/gsoc/phase2/genivi-dev-platform/poky/scripts:/export/e12376/gsoc/phase2/genivi-dev-platform/poky/bitbake/bin:/usr/local/sbin:/usr/local/bin:/usr/sbin:/usr/bin:/sbin:/bin:/usr/games:/usr/local/games"; export HOME="/home/e12376"; npm view zebra@'1.0' --json --registry http://zebkit.npmjs.org failed with exit code 1, output:
  44. npm ERR! Linux 3.13.0-86-generic
  45. npm ERR! argv "/export/e12376/gsoc/phase2/genivi-dev-platform/gdp-src-build/tmp/sysroots/x86_64-linux/usr/bin/node" "/export/e12376/gsoc/phase2/genivi-dev-platform/gdp-src-build/tmp/sysroots/x86_64-linux/usr/bin/npm" "view" "[email protected]" "--json" "--registry" "http://zebkit.npmjs.org"
  46. npm ERR! node v4.5.0
  47. npm ERR! npm v2.15.9
  48. npm ERR! code ENOTFOUND
  49. npm ERR! errno ENOTFOUND
  50. npm ERR! syscall getaddrinfo
  51.  
  52. npm ERR! network getaddrinfo ENOTFOUND zebkit.npmjs.org zebkit.npmjs.org:80
  53. npm ERR! network This is most likely not a problem with npm itself
  54. npm ERR! network and is related to network connectivity.
  55. npm ERR! network In most cases you are behind a proxy or have bad network settings.
  56. npm ERR! network
  57. npm ERR! network If you are behind a proxy, please make sure that the
  58. npm ERR! network 'proxy' config is set properly. See: 'npm help config'
  59.  
  60. npm ERR! Please include the following file with any support request:
  61. npm ERR! /export/e12376/gsoc/phase2/genivi-dev-platform/gdp-src-build/downloads/npm-debug.log
  62.  
  63. ERROR: zebra-1.0-r0 do_fetch: Fetcher failure for URL: 'npm://zebkit.npmjs.org;name=zebra;version=1.0'. Unable to fetch URL from any source.
  64. ERROR: zebra-1.0-r0 do_fetch: Function failed: base_do_fetch
  65. ERROR: Logfile of failure stored in: /export/e12376/gsoc/phase2/genivi-dev-platform/gdp-src-build/tmp/work/core2-64-poky-linux/zebra/1.0-r0/temp/log.do_fetch.42139
  66. ERROR: Task (/export/e12376/gsoc/phase2/genivi-dev-platform/gdp-src-build/../meta-genivi-dev/meta-genivi-dev/recipes-zebra/zebra/zebra.bb:do_fetch) failed with exit code '1'
  67. NOTE: Tasks Summary: Attempted 406 tasks of which 405 didn't need to be rerun and 1 failed.
  68.  
  69. Summary: 1 task failed:
  70. /export/e12376/gsoc/phase2/genivi-dev-platform/gdp-src-build/../meta-genivi-dev/meta-genivi-dev/recipes-zebra/zebra/zebra.bb:do_fetch
  71. Summary: There were 3 WARNING messages shown.
  72. Summary: There were 3 ERROR messages shown, returning a non-zero exit code.
Advertisement
Add Comment
Please, Sign In to add comment