Advertisement
TheHonkOfChonk

Untitled

Feb 11th, 2024
54
0
Never
Not a member of Pastebin yet? Sign Up, it unlocks many cool features!
text 5.62 KB | None | 0 0
  1. Executing Gradle task: runClient
  2. Build info: MCreator 2023.4.52316, forge-1.20.1, 64-bit, 7883 MB, Windows 11, JVM 17.0.9, JAVA_HOME: C:\Program Files\Pylo\MCreator\jdk, started on: 2024-02-11-17:52:26
  3.  
  4. > Task :compileJava FAILED
  5. C:\Users\*****\MCreatorWorkspaces\space_ii\src\main\java\net\mcreator\spaceii\client\model\Modelhungry_oashhh.java:43: error: not a statement
  6. PartDefinition 2 = body.addOrReplaceChild("2", CubeListBuilder.create(), PartPose.offsetAndRotation(0.0F, -6.0F, 0.0F, -0.3491F, 0.0F, 0.0F));
  7. ^
  8. C:\Users\*****\MCreatorWorkspaces\space_ii\src\main\java\net\mcreator\spaceii\client\model\Modelhungry_oashhh.java:43: error: ';' expected
  9. PartDefinition 2 = body.addOrReplaceChild("2", CubeListBuilder.create(), PartPose.offsetAndRotation(0.0F, -6.0F, 0.0F, -0.3491F, 0.0F, 0.0F));
  10. ^
  11. C:\Users\*****\MCreatorWorkspaces\space_ii\src\main\java\net\mcreator\spaceii\client\model\Modelhungry_oashhh.java:44: error: ';' expected
  12. PartDefinition bone2 = 2.addOrReplaceChild("bone2", CubeListBuilder.create().texOffs(2, 5).addBox(-6.0F, -6.0F, 0.0F, 12.0F, 6.0F, 0.0F, new CubeDeformation(0.01F)), PartPose.offset(0.0F, 0.0F, 0.0F));
  13. ^
  14. C:\Users\*****\MCreatorWorkspaces\space_ii\src\main\java\net\mcreator\spaceii\client\model\Modelhungry_oashhh.java:50: error: not a statement
  15. PartDefinition 3 = 2.addOrReplaceChild("3", CubeListBuilder.create(), PartPose.offsetAndRotation(0.0F, -6.0F, 0.0F, -0.4363F, 0.0F, 0.0F));
  16. ^
  17. C:\Users\*****\MCreatorWorkspaces\space_ii\src\main\java\net\mcreator\spaceii\client\model\Modelhungry_oashhh.java:50: error: ';' expected
  18. PartDefinition 3 = 2.addOrReplaceChild("3", CubeListBuilder.create(), PartPose.offsetAndRotation(0.0F, -6.0F, 0.0F, -0.4363F, 0.0F, 0.0F));
  19. ^
  20. C:\Users\*****\MCreatorWorkspaces\space_ii\src\main\java\net\mcreator\spaceii\client\model\Modelhungry_oashhh.java:51: error: ';' expected
  21. PartDefinition bone3 = 3.addOrReplaceChild("bone3", CubeListBuilder.create().texOffs(2, 0).addBox(-5.0F, -6.0F, 0.0F, 10.0F, 6.0F, 0.0F, new CubeDeformation(0.0F)), PartPose.offset(0.0F, 0.0F, 0.0F));
  22. ^
  23. C:\Users\*****\MCreatorWorkspaces\space_ii\src\main\java\net\mcreator\spaceii\client\model\Modelhungry_oashhh.java:57: error: not a statement
  24. PartDefinition 4 = 3.addOrReplaceChild("4", CubeListBuilder.create(), PartPose.offsetAndRotation(0.0F, -6.0F, 0.0F, 0.6981F, 0.0F, 0.0F));
  25. ^
  26. C:\Users\*****\MCreatorWorkspaces\space_ii\src\main\java\net\mcreator\spaceii\client\model\Modelhungry_oashhh.java:57: error: ';' expected
  27. PartDefinition 4 = 3.addOrReplaceChild("4", CubeListBuilder.create(), PartPose.offsetAndRotation(0.0F, -6.0F, 0.0F, 0.6981F, 0.0F, 0.0F));
  28. ^
  29. C:\Users\*****\MCreatorWorkspaces\space_ii\src\main\java\net\mcreator\spaceii\client\model\Modelhungry_oashhh.java:58: error: ';' expected
  30. PartDefinition bone4 = 4.addOrReplaceChild("bone4", CubeListBuilder.create().texOffs(2, 10).addBox(-4.0F, -6.0F, 0.0F, 8.0F, 6.0F, 0.0F, new CubeDeformation(0.01F)), PartPose.offset(0.0F, 0.0F, 0.0F));
  31. ^
  32. C:\Users\*****\MCreatorWorkspaces\space_ii\src\main\java\net\mcreator\spaceii\client\model\Modelhungry_oashhh.java:134: error: not a statement
  33. PartDefinition 6 = neck.addOrReplaceChild("6", CubeListBuilder.create(), PartPose.offsetAndRotation(0.0F, -6.0F, 0.0F, 0.5236F, 0.0F, 0.0F));
  34. ^
  35. C:\Users\*****\MCreatorWorkspaces\space_ii\src\main\java\net\mcreator\spaceii\client\model\Modelhungry_oashhh.java:134: error: ';' expected
  36. PartDefinition 6 = neck.addOrReplaceChild("6", CubeListBuilder.create(), PartPose.offsetAndRotation(0.0F, -6.0F, 0.0F, 0.5236F, 0.0F, 0.0F));
  37. ^
  38. C:\Users\*****\MCreatorWorkspaces\space_ii\src\main\java\net\mcreator\spaceii\client\model\Modelhungry_oashhh.java:135: error: ';' expected
  39. PartDefinition bone6 = 6.addOrReplaceChild("bone6", CubeListBuilder.create().texOffs(2, 0).addBox(-3.5F, -6.0F, 0.0F, 7.0F, 6.0F, 0.0F, new CubeDeformation(0.01F)), PartPose.offset(0.0F, 0.0F, 0.0F));
  40. ^
  41. C:\Users\*****\MCreatorWorkspaces\space_ii\src\main\java\net\mcreator\spaceii\client\model\Modelhungry_oashhh.java:141: error: not a statement
  42. PartDefinition 7 = 6.addOrReplaceChild("7", CubeListBuilder.create(), PartPose.offsetAndRotation(0.0F, -6.0F, 0.0F, 0.5236F, 0.0F, 0.0F));
  43. ^
  44. C:\Users\*****\MCreatorWorkspaces\space_ii\src\main\java\net\mcreator\spaceii\client\model\Modelhungry_oashhh.java:141: error: ';' expected
  45. PartDefinition 7 = 6.addOrReplaceChild("7", CubeListBuilder.create(), PartPose.offsetAndRotation(0.0F, -6.0F, 0.0F, 0.5236F, 0.0F, 0.0F));
  46. ^
  47. C:\Users\*****\MCreatorWorkspaces\space_ii\src\main\java\net\mcreator\spaceii\client\model\Modelhungry_oashhh.java:142: error: ';' expected
  48. PartDefinition bone7 = 7.addOrReplaceChild("bone7", CubeListBuilder.create().texOffs(2, 10).addBox(-3.0F, -6.0F, 0.0F, 6.0F, 6.0F, 0.0F, new CubeDeformation(0.0F)), PartPose.offset(0.0F, 0.0F, 0.0F));
  49. ^
  50. 15 errors
  51. FAILURE: Build failed with an exception.
  52. * What went wrong:
  53. Execution failed for task ':compileJava'.
  54. > Compilation failed; see the compiler error output for details.
  55. * Try:
  56. > Run with --stacktrace option to get the stack trace.
  57. > Run with --info or --debug option to get more log output.
  58. > Run with --scan to get full insights.
  59. * Get more help at https://help.gradle.org
  60. BUILD FAILED in 1s
  61. 1 actionable task: 1 executed
  62.  
  63. BUILD FAILED
  64. Task completed in 1 second
  65.  
Advertisement
Add Comment
Please, Sign In to add comment
Advertisement