Advertisement
Guest User

Untitled

a guest
May 14th, 2022
15
Never
Not a member of Pastebin yet? Sign Up, it unlocks many cool features!
  1. C:\Users\MAZcr\MCreatorWorkspaces\toh\src\main\java\net\mcreator\toh\entity\renderer\LightOrbEntityRenderer.java:86: error: cannot find symbol
  2. public void setupAnim(T entity, float limbSwing, float limbSwingAmount, float ageInTicks, float netHeadYaw, float headPitch) {
  3. ^
  4. symbol: class T
  5. location: class net.mcreator.toh.entity.renderer.LightOrbEntityRenderer.Modellightorb
  6. C:\Users\MAZcr\MCreatorWorkspaces\toh\src\main\java\net\mcreator\toh\entity\renderer\LightOrbEntityRenderer.java:63: error: net.mcreator.toh.entity.renderer.LightOrbEntityRenderer.Modellightorb is not abstract and does not override abstract method setRotationAngles(net.minecraft.entity.Entity,float,float,float,float,float) in net.minecraft.client.renderer.entity.model.EntityModel
  7. public static class Modellightorb extends EntityModel<Entity> {
  8. ^
  9. C:\Users\MAZcr\MCreatorWorkspaces\toh\src\main\java\net\mcreator\toh\entity\renderer\LightOrbEntityRenderer.java:67: error: cannot find symbol
  10. texWidth = 16;
  11. ^
  12. symbol: variable texWidth
  13. location: class net.mcreator.toh.entity.renderer.LightOrbEntityRenderer.Modellightorb
  14. C:\Users\MAZcr\MCreatorWorkspaces\toh\src\main\java\net\mcreator\toh\entity\renderer\LightOrbEntityRenderer.java:68: error: cannot find symbol
  15. texHeight = 16;
  16. ^
  17. symbol: variable texHeight
  18. location: class net.mcreator.toh.entity.renderer.LightOrbEntityRenderer.Modellightorb
  19. C:\Users\MAZcr\MCreatorWorkspaces\toh\src\main\java\net\mcreator\toh\entity\renderer\LightOrbEntityRenderer.java:70: error: cannot find symbol
  20. bb_main.setPos(0.0F, 24.0F, 0.0F);
  21. ^
  22. symbol: method setPos(float,float,float)
  23. location: variable bb_main of type net.minecraft.client.renderer.model.ModelRenderer
  24. C:\Users\MAZcr\MCreatorWorkspaces\toh\src\main\java\net\mcreator\toh\entity\renderer\LightOrbEntityRenderer.java:71: error: cannot find symbol
  25. bb_main.texOffs(0, 0).addBox(-1.5F, -3.0F, -1.5F, 3.0F, 3.0F, 3.0F, 0.0F, false);
  26. ^
  27. symbol: method texOffs(int,int)
  28. location: variable bb_main of type net.minecraft.client.renderer.model.ModelRenderer
  29. C:\Users\MAZcr\MCreatorWorkspaces\toh\src\main\java\net\mcreator\toh\entity\renderer\LightOrbEntityRenderer.java:74: error: method does not override or implement a method from a supertype
  30. @Override
  31. ^
  32. C:\Users\MAZcr\MCreatorWorkspaces\toh\src\main\java\net\mcreator\toh\entity\renderer\LightOrbEntityRenderer.java:81: error: cannot find symbol
  33. modelRenderer.xRot = x;
  34. ^
  35. symbol: variable xRot
  36. location: variable modelRenderer of type net.minecraft.client.renderer.model.ModelRenderer
  37. C:\Users\MAZcr\MCreatorWorkspaces\toh\src\main\java\net\mcreator\toh\entity\renderer\LightOrbEntityRenderer.java:82: error: cannot find symbol
  38. modelRenderer.yRot = y;
  39. ^
  40. symbol: variable yRot
  41. location: variable modelRenderer of type net.minecraft.client.renderer.model.ModelRenderer
  42. C:\Users\MAZcr\MCreatorWorkspaces\toh\src\main\java\net\mcreator\toh\entity\renderer\LightOrbEntityRenderer.java:83: error: cannot find symbol
  43. modelRenderer.zRot = z;
  44. ^
  45. symbol: variable zRot
  46. location: variable modelRenderer of type net.minecraft.client.renderer.model.ModelRenderer
  47. Note: Some input files use unchecked or unsafe operations.
  48. Note: Recompile with -Xlint:unchecked for details.
  49. 10 errors
  50.  
  51. FAILURE: Build failed with an exception.
  52.  
  53. * What went wrong:
  54. Execution failed for task ':compileJava'.
  55. > Compilation failed; see the compiler error output for details.
  56.  
  57. * Try:
  58. Run with --stacktrace option to get the stack trace. Run with --info or --debug option to get more log output. Run with --scan to get full insights.
  59.  
  60. * Get more help at https://help.gradle.org
  61.  
  62. Deprecated Gradle features were used in this build, making it incompatible with Gradle 8.0.
  63.  
  64. You can use '--warning-mode all' to show the individual deprecation warnings and determine if they come from your own scripts or plugins.
  65.  
  66. See https://docs.gradle.org/7.2/userguide/command_line_interface.html#sec:command_line_warnings
  67.  
  68. BUILD FAILED in 3s
  69. 1 actionable task: 1 executed
Advertisement
RAW Paste Data Copied
Advertisement