Advertisement
damian101

aomenc vmaf build

Jul 19th, 2023 (edited)
1,700
0
Never
Not a member of Pastebin yet? Sign Up, it unlocks many cool features!
Make 21.28 KB | None | 0 0
  1. [ 99%] Built target photon_noise_table
  2. /home/damian101/git-clone/aom/aom_dsp/bitwriter.c: In function ‘aom_stop_encode.isra’:
  3. /home/damian101/git-clone/aom/aom_dsp/bitwriter.c:27:3: warning: ‘bytes’ may be used uninitialized [-Wmaybe-uninitialized]
  4.    27 |   memcpy(w->buffer, data, bytes);
  5.       |   ^
  6. /home/damian101/git-clone/aom/aom_dsp/bitwriter.c:23:12: note: ‘bytes’ was declared here
  7.    23 |   uint32_t bytes;
  8.       |            ^
  9. In function ‘write_tile_obu_size’,
  10.     inlined from ‘pack_tiles_in_tg_obus’ at /home/damian101/git-clone/aom/av1/encoder/bitstream.c:4039:5,
  11.     inlined from ‘write_tiles_in_tg_obus’ at /home/damian101/git-clone/aom/av1/encoder/bitstream.c:4069:10,
  12.     inlined from ‘av1_pack_bitstream’ at /home/damian101/git-clone/aom/av1/encoder/bitstream.c:4207:17:
  13. /home/damian101/git-clone/aom/av1/encoder/bitstream.c:3963:6: warning: ‘payload_size’ may be used uninitialized [-Wmaybe-uninitialized]
  14.  3963 |   if (new_payload_size != payload_size) {
  15.       |      ^
  16. /home/damian101/git-clone/aom/av1/encoder/bitstream.c: In function ‘av1_pack_bitstream’:
  17. /home/damian101/git-clone/aom/av1/encoder/bitstream.c:3953:12: note: ‘payload_size’ was declared here
  18.  3953 |   uint64_t payload_size;
  19.       |            ^
  20. In function ‘write_tile_obu_size’,
  21.     inlined from ‘pack_tiles_in_tg_obus’ at /home/damian101/git-clone/aom/av1/encoder/bitstream.c:4039:5,
  22.     inlined from ‘write_tiles_in_tg_obus’ at /home/damian101/git-clone/aom/av1/encoder/bitstream.c:4069:10,
  23.     inlined from ‘av1_pack_bitstream’ at /home/damian101/git-clone/aom/av1/encoder/bitstream.c:4207:17:
  24. /home/damian101/git-clone/aom/av1/encoder/bitstream.c:3961:18: warning: ‘length_field_size’ may be used uninitialized [-Wmaybe-uninitialized]
  25.  3961 |   const uint64_t new_payload_size =
  26.       |                  ^
  27. /home/damian101/git-clone/aom/av1/encoder/bitstream.c: In function ‘av1_pack_bitstream’:
  28. /home/damian101/git-clone/aom/av1/encoder/bitstream.c:3954:10: note: ‘length_field_size’ was declared here
  29.  3954 |   size_t length_field_size;
  30.       |          ^
  31. In function ‘write_tile_obu_size’,
  32.     inlined from ‘pack_tiles_in_tg_obus’ at /home/damian101/git-clone/aom/av1/encoder/bitstream.c:4039:5,
  33.     inlined from ‘write_tiles_in_tg_obus’ at /home/damian101/git-clone/aom/av1/encoder/bitstream.c:4069:10,
  34.     inlined from ‘av1_pack_bitstream’ at /home/damian101/git-clone/aom/av1/encoder/bitstream.c:4207:17:
  35. /home/damian101/git-clone/aom/av1/encoder/bitstream.c:3968:8: warning: ‘new_length_field_size’ may be used uninitialized [-Wmaybe-uninitialized]
  36.  3968 |     if (new_length_field_size < length_field_size) {
  37.       |        ^
  38. /home/damian101/git-clone/aom/av1/encoder/bitstream.c: In function ‘av1_pack_bitstream’:
  39. /home/damian101/git-clone/aom/av1/encoder/bitstream.c:3964:12: note: ‘new_length_field_size’ was declared here
  40.  3964 |     size_t new_length_field_size;
  41.       |            ^
  42. /usr/bin/ld: /tmp/ccEsGwqA.ltrans3.ltrans.o: in function `encoder_encode':
  43. <artificial>:(.text+0x72ce): undefined reference to `vmaf_model_load_from_path'
  44. /usr/bin/ld: /tmp/ccEsGwqA.ltrans7.ltrans.o: in function `av1_remove_compressor':
  45. <artificial>:(.text+0xe2a4): undefined reference to `vmaf_model_destroy'
  46. /usr/bin/ld: /tmp/ccEsGwqA.ltrans9.ltrans.o: in function `encode_frame_to_data_rate':
  47. <artificial>:(.text+0x2153): undefined reference to `vmaf_picture_alloc'
  48. /usr/bin/ld: <artificial>:(.text+0x218a): undefined reference to `vmaf_picture_alloc'
  49. /usr/bin/ld: <artificial>:(.text+0x22c1): undefined reference to `vmaf_read_pictures'
  50. /usr/bin/ld: <artificial>:(.text+0x22d3): undefined reference to `vmaf_picture_unref'
  51. /usr/bin/ld: <artificial>:(.text+0x22dd): undefined reference to `vmaf_picture_unref'
  52. /usr/bin/ld: <artificial>:(.text+0x2915): undefined reference to `vmaf_read_pictures'
  53. /usr/bin/ld: <artificial>:(.text+0x2999): undefined reference to `vmaf_score_at_index'
  54. /usr/bin/ld: <artificial>:(.text+0x2a89): undefined reference to `vmaf_close'
  55. /usr/bin/ld: <artificial>:(.text+0x5184): undefined reference to `vmaf_read_pictures'
  56. /usr/bin/ld: /tmp/ccEsGwqA.ltrans25.ltrans.o: in function `aom_init_vmaf_context':
  57. <artificial>:(.text+0x196f3): undefined reference to `vmaf_init'
  58. /usr/bin/ld: <artificial>:(.text+0x1972c): undefined reference to `vmaf_feature_dictionary_set'
  59. /usr/bin/ld: <artificial>:(.text+0x19748): undefined reference to `vmaf_model_feature_overload'
  60. /usr/bin/ld: <artificial>:(.text+0x1975c): undefined reference to `vmaf_use_features_from_model'
  61. /usr/bin/ld: <artificial>:(.text+0x197b3): undefined reference to `vmaf_feature_dictionary_set'
  62. /usr/bin/ld: <artificial>:(.text+0x197cf): undefined reference to `vmaf_model_feature_overload'
  63. /usr/bin/ld: <artificial>:(.text+0x197f1): undefined reference to `vmaf_feature_dictionary_set'
  64. /usr/bin/ld: <artificial>:(.text+0x19808): undefined reference to `vmaf_model_feature_overload'
  65. /usr/bin/ld: /tmp/ccEsGwqA.ltrans25.ltrans.o: in function `aom_calc_vmaf':
  66. <artificial>:(.text+0x198eb): undefined reference to `vmaf_picture_alloc'
  67. /usr/bin/ld: <artificial>:(.text+0x19914): undefined reference to `vmaf_picture_alloc'
  68. /usr/bin/ld: <artificial>:(.text+0x19a02): undefined reference to `vmaf_read_pictures'
  69. /usr/bin/ld: <artificial>:(.text+0x19a1a): undefined reference to `vmaf_read_pictures'
  70. /usr/bin/ld: <artificial>:(.text+0x19a2c): undefined reference to `vmaf_picture_unref'
  71. /usr/bin/ld: <artificial>:(.text+0x19a36): undefined reference to `vmaf_picture_unref'
  72. /usr/bin/ld: <artificial>:(.text+0x19a4c): undefined reference to `vmaf_score_at_index'
  73. /usr/bin/ld: <artificial>:(.text+0x19a56): undefined reference to `vmaf_close'
  74. collect2: error: ld returned 1 exit status
  75. make[2]: *** [CMakeFiles/aomenc.dir/build.make:182: aomenc] Error 1
  76. make[1]: *** [CMakeFiles/Makefile2:1415: CMakeFiles/aomenc.dir/all] Error 2
  77. make[1]: *** Waiting for unfinished jobs....
  78. /home/damian101/git-clone/aom/aom_dsp/bitwriter.c: In function ‘aom_stop_encode.isra’:
  79. /home/damian101/git-clone/aom/aom_dsp/bitwriter.c:27:3: warning: ‘bytes’ may be used uninitialized [-Wmaybe-uninitialized]
  80.    27 |   memcpy(w->buffer, data, bytes);
  81.       |   ^
  82. /home/damian101/git-clone/aom/aom_dsp/bitwriter.c:23:12: note: ‘bytes’ was declared here
  83.    23 |   uint32_t bytes;
  84.       |            ^
  85. /home/damian101/git-clone/aom/aom_dsp/bitwriter.c: In function ‘aom_stop_encode.isra’:
  86. /home/damian101/git-clone/aom/aom_dsp/bitwriter.c:27:3: warning: ‘bytes’ may be used uninitialized [-Wmaybe-uninitialized]
  87.    27 |   memcpy(w->buffer, data, bytes);
  88.       |   ^
  89. /home/damian101/git-clone/aom/aom_dsp/bitwriter.c:23:12: note: ‘bytes’ was declared here
  90.    23 |   uint32_t bytes;
  91.       |            ^
  92. In function ‘write_tile_obu_size’,
  93.     inlined from ‘pack_tiles_in_tg_obus’ at /home/damian101/git-clone/aom/av1/encoder/bitstream.c:4039:5,
  94.     inlined from ‘write_tiles_in_tg_obus’ at /home/damian101/git-clone/aom/av1/encoder/bitstream.c:4069:10,
  95.     inlined from ‘av1_pack_bitstream’ at /home/damian101/git-clone/aom/av1/encoder/bitstream.c:4207:17:
  96. /home/damian101/git-clone/aom/av1/encoder/bitstream.c:3963:6: warning: ‘payload_size’ may be used uninitialized [-Wmaybe-uninitialized]
  97.  3963 |   if (new_payload_size != payload_size) {
  98.       |      ^
  99. /home/damian101/git-clone/aom/av1/encoder/bitstream.c: In function ‘av1_pack_bitstream’:
  100. /home/damian101/git-clone/aom/av1/encoder/bitstream.c:3953:12: note: ‘payload_size’ was declared here
  101.  3953 |   uint64_t payload_size;
  102.       |            ^
  103. In function ‘write_tile_obu_size’,
  104.     inlined from ‘pack_tiles_in_tg_obus’ at /home/damian101/git-clone/aom/av1/encoder/bitstream.c:4039:5,
  105.     inlined from ‘write_tiles_in_tg_obus’ at /home/damian101/git-clone/aom/av1/encoder/bitstream.c:4069:10,
  106.     inlined from ‘av1_pack_bitstream’ at /home/damian101/git-clone/aom/av1/encoder/bitstream.c:4207:17:
  107. /home/damian101/git-clone/aom/av1/encoder/bitstream.c:3961:18: warning: ‘length_field_size’ may be used uninitialized [-Wmaybe-uninitialized]
  108.  3961 |   const uint64_t new_payload_size =
  109.       |                  ^
  110. /home/damian101/git-clone/aom/av1/encoder/bitstream.c: In function ‘av1_pack_bitstream’:
  111. /home/damian101/git-clone/aom/av1/encoder/bitstream.c:3954:10: note: ‘length_field_size’ was declared here
  112.  3954 |   size_t length_field_size;
  113.       |          ^
  114. In function ‘write_tile_obu_size’,
  115.     inlined from ‘pack_tiles_in_tg_obus’ at /home/damian101/git-clone/aom/av1/encoder/bitstream.c:4039:5,
  116.     inlined from ‘write_tiles_in_tg_obus’ at /home/damian101/git-clone/aom/av1/encoder/bitstream.c:4069:10,
  117.     inlined from ‘av1_pack_bitstream’ at /home/damian101/git-clone/aom/av1/encoder/bitstream.c:4207:17:
  118. /home/damian101/git-clone/aom/av1/encoder/bitstream.c:3968:8: warning: ‘new_length_field_size’ may be used uninitialized [-Wmaybe-uninitialized]
  119.  3968 |     if (new_length_field_size < length_field_size) {
  120.       |        ^
  121. /home/damian101/git-clone/aom/av1/encoder/bitstream.c: In function ‘av1_pack_bitstream’:
  122. /home/damian101/git-clone/aom/av1/encoder/bitstream.c:3964:12: note: ‘new_length_field_size’ was declared here
  123.  3964 |     size_t new_length_field_size;
  124.       |            ^
  125. /usr/bin/ld: /tmp/ccyJxzxE.ltrans1.ltrans.o: in function `encoder_encode':
  126. <artificial>:(.text+0x2eee): undefined reference to `vmaf_model_load_from_path'
  127. /usr/bin/ld: /tmp/ccyJxzxE.ltrans5.ltrans.o: in function `av1_remove_compressor':
  128. <artificial>:(.text+0xe2a4): undefined reference to `vmaf_model_destroy'
  129. /usr/bin/ld: /tmp/ccyJxzxE.ltrans7.ltrans.o: in function `encode_frame_to_data_rate':
  130. <artificial>:(.text+0x2153): undefined reference to `vmaf_picture_alloc'
  131. /usr/bin/ld: <artificial>:(.text+0x218a): undefined reference to `vmaf_picture_alloc'
  132. /usr/bin/ld: <artificial>:(.text+0x22c1): undefined reference to `vmaf_read_pictures'
  133. /usr/bin/ld: <artificial>:(.text+0x22d3): undefined reference to `vmaf_picture_unref'
  134. /usr/bin/ld: <artificial>:(.text+0x22dd): undefined reference to `vmaf_picture_unref'
  135. /usr/bin/ld: <artificial>:(.text+0x2915): undefined reference to `vmaf_read_pictures'
  136. /usr/bin/ld: <artificial>:(.text+0x2999): undefined reference to `vmaf_score_at_index'
  137. /usr/bin/ld: <artificial>:(.text+0x2a89): undefined reference to `vmaf_close'
  138. /usr/bin/ld: <artificial>:(.text+0x5184): undefined reference to `vmaf_read_pictures'
  139. /usr/bin/ld: /tmp/ccyJxzxE.ltrans23.ltrans.o: in function `aom_init_vmaf_context':
  140. <artificial>:(.text+0x196f3): undefined reference to `vmaf_init'
  141. /usr/bin/ld: <artificial>:(.text+0x1972c): undefined reference to `vmaf_feature_dictionary_set'
  142. /usr/bin/ld: <artificial>:(.text+0x19748): undefined reference to `vmaf_model_feature_overload'
  143. /usr/bin/ld: <artificial>:(.text+0x1975c): undefined reference to `vmaf_use_features_from_model'
  144. /usr/bin/ld: <artificial>:(.text+0x197b3): undefined reference to `vmaf_feature_dictionary_set'
  145. /usr/bin/ld: <artificial>:(.text+0x197cf): undefined reference to `vmaf_model_feature_overload'
  146. /usr/bin/ld: <artificial>:(.text+0x197f1): undefined reference to `vmaf_feature_dictionary_set'
  147. /usr/bin/ld: <artificial>:(.text+0x19808): undefined reference to `vmaf_model_feature_overload'
  148. /usr/bin/ld: /tmp/ccyJxzxE.ltrans23.ltrans.o: in function `aom_calc_vmaf':
  149. <artificial>:(.text+0x198eb): undefined reference to `vmaf_picture_alloc'
  150. /usr/bin/ld: <artificial>:(.text+0x19914): undefined reference to `vmaf_picture_alloc'
  151. /usr/bin/ld: <artificial>:(.text+0x19a02): undefined reference to `vmaf_read_pictures'
  152. /usr/bin/ld: <artificial>:(.text+0x19a1a): undefined reference to `vmaf_read_pictures'
  153. /usr/bin/ld: <artificial>:(.text+0x19a2c): undefined reference to `vmaf_picture_unref'
  154. /usr/bin/ld: <artificial>:(.text+0x19a36): undefined reference to `vmaf_picture_unref'
  155. /usr/bin/ld: <artificial>:(.text+0x19a4c): undefined reference to `vmaf_score_at_index'
  156. /usr/bin/ld: <artificial>:(.text+0x19a56): undefined reference to `vmaf_close'
  157. collect2: error: ld returned 1 exit status
  158. make[2]: *** [CMakeFiles/set_maps.dir/build.make:178: examples/set_maps] Error 1
  159. make[1]: *** [CMakeFiles/Makefile2:1475: CMakeFiles/set_maps.dir/all] Error 2
  160. /usr/bin/ld: /tmp/ccPXsDXg.ltrans1.ltrans.o: in function `encoder_encode':
  161. <artificial>:(.text+0x2eee): undefined reference to `vmaf_model_load_from_path'
  162. /usr/bin/ld: /tmp/ccPXsDXg.ltrans5.ltrans.o: in function `av1_remove_compressor':
  163. <artificial>:(.text+0xe2a4): undefined reference to `vmaf_model_destroy'
  164. /usr/bin/ld: /tmp/ccPXsDXg.ltrans7.ltrans.o: in function `encode_frame_to_data_rate':
  165. <artificial>:(.text+0x2153): undefined reference to `vmaf_picture_alloc'
  166. /usr/bin/ld: <artificial>:(.text+0x218a): undefined reference to `vmaf_picture_alloc'
  167. /usr/bin/ld: <artificial>:(.text+0x22c1): undefined reference to `vmaf_read_pictures'
  168. /usr/bin/ld: <artificial>:(.text+0x22d3): undefined reference to `vmaf_picture_unref'
  169. /usr/bin/ld: <artificial>:(.text+0x22dd): undefined reference to `vmaf_picture_unref'
  170. /usr/bin/ld: <artificial>:(.text+0x2915): undefined reference to `vmaf_read_pictures'
  171. /usr/bin/ld: <artificial>:(.text+0x2999): undefined reference to `vmaf_score_at_index'
  172. /usr/bin/ld: <artificial>:(.text+0x2a89): undefined reference to `vmaf_close'
  173. /usr/bin/ld: <artificial>:(.text+0x5184): undefined reference to `vmaf_read_pictures'
  174. /usr/bin/ld: /tmp/ccPXsDXg.ltrans23.ltrans.o: in function `aom_init_vmaf_context':
  175. <artificial>:(.text+0x196f3): undefined reference to `vmaf_init'
  176. /usr/bin/ld: <artificial>:(.text+0x1972c): undefined reference to `vmaf_feature_dictionary_set'
  177. /usr/bin/ld: <artificial>:(.text+0x19748): undefined reference to `vmaf_model_feature_overload'
  178. /usr/bin/ld: <artificial>:(.text+0x1975c): undefined reference to `vmaf_use_features_from_model'
  179. /usr/bin/ld: <artificial>:(.text+0x197b3): undefined reference to `vmaf_feature_dictionary_set'
  180. /usr/bin/ld: <artificial>:(.text+0x197cf): undefined reference to `vmaf_model_feature_overload'
  181. /usr/bin/ld: <artificial>:(.text+0x197f1): undefined reference to `vmaf_feature_dictionary_set'
  182. /usr/bin/ld: <artificial>:(.text+0x19808): undefined reference to `vmaf_model_feature_overload'
  183. /usr/bin/ld: /tmp/ccPXsDXg.ltrans23.ltrans.o: in function `aom_calc_vmaf':
  184. <artificial>:(.text+0x198eb): undefined reference to `vmaf_picture_alloc'
  185. /usr/bin/ld: <artificial>:(.text+0x19914): undefined reference to `vmaf_picture_alloc'
  186. /usr/bin/ld: <artificial>:(.text+0x19a02): undefined reference to `vmaf_read_pictures'
  187. /usr/bin/ld: <artificial>:(.text+0x19a1a): undefined reference to `vmaf_read_pictures'
  188. /usr/bin/ld: <artificial>:(.text+0x19a2c): undefined reference to `vmaf_picture_unref'
  189. /usr/bin/ld: <artificial>:(.text+0x19a36): undefined reference to `vmaf_picture_unref'
  190. /usr/bin/ld: <artificial>:(.text+0x19a4c): undefined reference to `vmaf_score_at_index'
  191. /usr/bin/ld: <artificial>:(.text+0x19a56): undefined reference to `vmaf_close'
  192. collect2: error: ld returned 1 exit status
  193. make[2]: *** [CMakeFiles/lossless_encoder.dir/build.make:178: examples/lossless_encoder] Error 1
  194. make[1]: *** [CMakeFiles/Makefile2:1445: CMakeFiles/lossless_encoder.dir/all] Error 2
  195. /home/damian101/git-clone/aom/aom_dsp/bitwriter.c: In function ‘aom_stop_encode.isra’:
  196. /home/damian101/git-clone/aom/aom_dsp/bitwriter.c:27:3: warning: ‘bytes’ may be used uninitialized [-Wmaybe-uninitialized]
  197.    27 |   memcpy(w->buffer, data, bytes);
  198.       |   ^
  199. /home/damian101/git-clone/aom/aom_dsp/bitwriter.c:23:12: note: ‘bytes’ was declared here
  200.    23 |   uint32_t bytes;
  201.       |            ^
  202. /usr/bin/ld: /tmp/ccfhp18n.ltrans1.ltrans.o: in function `encoder_encode':
  203. <artificial>:(.text+0x2eee): undefined reference to `vmaf_model_load_from_path'
  204. /usr/bin/ld: /tmp/ccfhp18n.ltrans5.ltrans.o: in function `av1_remove_compressor':
  205. <artificial>:(.text+0xe2a4): undefined reference to `vmaf_model_destroy'
  206. /usr/bin/ld: /tmp/ccfhp18n.ltrans7.ltrans.o: in function `encode_frame_to_data_rate':
  207. <artificial>:(.text+0x2153): undefined reference to `vmaf_picture_alloc'
  208. /usr/bin/ld: <artificial>:(.text+0x218a): undefined reference to `vmaf_picture_alloc'
  209. /usr/bin/ld: <artificial>:(.text+0x22c1): undefined reference to `vmaf_read_pictures'
  210. /usr/bin/ld: <artificial>:(.text+0x22d3): undefined reference to `vmaf_picture_unref'
  211. /usr/bin/ld: <artificial>:(.text+0x22dd): undefined reference to `vmaf_picture_unref'
  212. /usr/bin/ld: <artificial>:(.text+0x2915): undefined reference to `vmaf_read_pictures'
  213. /usr/bin/ld: <artificial>:(.text+0x2999): undefined reference to `vmaf_score_at_index'
  214. /usr/bin/ld: <artificial>:(.text+0x2a89): undefined reference to `vmaf_close'
  215. /usr/bin/ld: <artificial>:(.text+0x5184): undefined reference to `vmaf_read_pictures'
  216. /usr/bin/ld: /tmp/ccfhp18n.ltrans23.ltrans.o: in function `aom_init_vmaf_context':
  217. <artificial>:(.text+0x196f3): undefined reference to `vmaf_init'
  218. /usr/bin/ld: <artificial>:(.text+0x1972c): undefined reference to `vmaf_feature_dictionary_set'
  219. /usr/bin/ld: <artificial>:(.text+0x19748): undefined reference to `vmaf_model_feature_overload'
  220. /usr/bin/ld: <artificial>:(.text+0x1975c): undefined reference to `vmaf_use_features_from_model'
  221. /usr/bin/ld: <artificial>:(.text+0x197b3): undefined reference to `vmaf_feature_dictionary_set'
  222. /usr/bin/ld: <artificial>:(.text+0x197cf): undefined reference to `vmaf_model_feature_overload'
  223. /usr/bin/ld: <artificial>:(.text+0x197f1): undefined reference to `vmaf_feature_dictionary_set'
  224. /usr/bin/ld: <artificial>:(.text+0x19808): undefined reference to `vmaf_model_feature_overload'
  225. /usr/bin/ld: /tmp/ccfhp18n.ltrans23.ltrans.o: in function `aom_calc_vmaf':
  226. <artificial>:(.text+0x198eb): undefined reference to `vmaf_picture_alloc'
  227. /usr/bin/ld: <artificial>:(.text+0x19914): undefined reference to `vmaf_picture_alloc'
  228. /usr/bin/ld: <artificial>:(.text+0x19a02): undefined reference to `vmaf_read_pictures'
  229. /usr/bin/ld: <artificial>:(.text+0x19a1a): undefined reference to `vmaf_read_pictures'
  230. /usr/bin/ld: <artificial>:(.text+0x19a2c): undefined reference to `vmaf_picture_unref'
  231. /usr/bin/ld: <artificial>:(.text+0x19a36): undefined reference to `vmaf_picture_unref'
  232. /usr/bin/ld: <artificial>:(.text+0x19a4c): undefined reference to `vmaf_score_at_index'
  233. /usr/bin/ld: <artificial>:(.text+0x19a56): undefined reference to `vmaf_close'
  234. collect2: error: ld returned 1 exit status
  235. make[2]: *** [CMakeFiles/simple_encoder.dir/build.make:178: examples/simple_encoder] Error 1
  236. make[1]: *** [CMakeFiles/Makefile2:1505: CMakeFiles/simple_encoder.dir/all] Error 2
  237. /usr/bin/ld: /tmp/ccfrWz2Z.ltrans1.ltrans.o: in function `encoder_encode':
  238. <artificial>:(.text+0x2eee): undefined reference to `vmaf_model_load_from_path'
  239. /usr/bin/ld: /tmp/ccfrWz2Z.ltrans5.ltrans.o: in function `av1_remove_compressor':
  240. <artificial>:(.text+0xe2a4): undefined reference to `vmaf_model_destroy'
  241. /usr/bin/ld: /tmp/ccfrWz2Z.ltrans7.ltrans.o: in function `encode_frame_to_data_rate':
  242. <artificial>:(.text+0x2153): undefined reference to `vmaf_picture_alloc'
  243. /usr/bin/ld: <artificial>:(.text+0x218a): undefined reference to `vmaf_picture_alloc'
  244. /usr/bin/ld: <artificial>:(.text+0x22c1): undefined reference to `vmaf_read_pictures'
  245. /usr/bin/ld: <artificial>:(.text+0x22d3): undefined reference to `vmaf_picture_unref'
  246. /usr/bin/ld: <artificial>:(.text+0x22dd): undefined reference to `vmaf_picture_unref'
  247. /usr/bin/ld: <artificial>:(.text+0x2915): undefined reference to `vmaf_read_pictures'
  248. /usr/bin/ld: <artificial>:(.text+0x2999): undefined reference to `vmaf_score_at_index'
  249. /usr/bin/ld: <artificial>:(.text+0x2a89): undefined reference to `vmaf_close'
  250. /usr/bin/ld: <artificial>:(.text+0x5184): undefined reference to `vmaf_read_pictures'
  251. /usr/bin/ld: /tmp/ccfrWz2Z.ltrans23.ltrans.o: in function `aom_init_vmaf_context':
  252. <artificial>:(.text+0x196f3): undefined reference to `vmaf_init'
  253. /usr/bin/ld: <artificial>:(.text+0x1972c): undefined reference to `vmaf_feature_dictionary_set'
  254. /usr/bin/ld: <artificial>:(.text+0x19748): undefined reference to `vmaf_model_feature_overload'
  255. /usr/bin/ld: <artificial>:(.text+0x1975c): undefined reference to `vmaf_use_features_from_model'
  256. /usr/bin/ld: <artificial>:(.text+0x197b3): undefined reference to `vmaf_feature_dictionary_set'
  257. /usr/bin/ld: <artificial>:(.text+0x197cf): undefined reference to `vmaf_model_feature_overload'
  258. /usr/bin/ld: <artificial>:(.text+0x197f1): undefined reference to `vmaf_feature_dictionary_set'
  259. /usr/bin/ld: <artificial>:(.text+0x19808): undefined reference to `vmaf_model_feature_overload'
  260. /usr/bin/ld: /tmp/ccfrWz2Z.ltrans23.ltrans.o: in function `aom_calc_vmaf':
  261. <artificial>:(.text+0x198eb): undefined reference to `vmaf_picture_alloc'
  262. /usr/bin/ld: <artificial>:(.text+0x19914): undefined reference to `vmaf_picture_alloc'
  263. /usr/bin/ld: <artificial>:(.text+0x19a02): undefined reference to `vmaf_read_pictures'
  264. /usr/bin/ld: <artificial>:(.text+0x19a1a): undefined reference to `vmaf_read_pictures'
  265. /usr/bin/ld: <artificial>:(.text+0x19a2c): undefined reference to `vmaf_picture_unref'
  266. /usr/bin/ld: <artificial>:(.text+0x19a36): undefined reference to `vmaf_picture_unref'
  267. /usr/bin/ld: <artificial>:(.text+0x19a4c): undefined reference to `vmaf_score_at_index'
  268. /usr/bin/ld: <artificial>:(.text+0x19a56): undefined reference to `vmaf_close'
  269. collect2: error: ld returned 1 exit status
  270. make[2]: *** [CMakeFiles/twopass_encoder.dir/build.make:178: examples/twopass_encoder] Error 1
  271. make[1]: *** [CMakeFiles/Makefile2:1535: CMakeFiles/twopass_encoder.dir/all] Error 2
  272. make: *** [Makefile:136: all] Error 2
Advertisement
Add Comment
Please, Sign In to add comment
Advertisement