Advertisement
Suubi7

Exclusion of voided Memberships error

Feb 22nd, 2021
30
0
Never
Not a member of Pastebin yet? Sign Up, it unlocks many cool features!
text 88.60 KB | None | 0 0
  1.  
  2. C:\Users\Suubi-Joshua\openmrs-core>git status
  3. On branch TRUNK-5451
  4. nothing to commit, working tree clean
  5.  
  6. C:\Users\Suubi-Joshua\openmrs-core>git branch
  7. * TRUNK-5451
  8. master
  9.  
  10. C:\Users\Suubi-Joshua\openmrs-core>git status
  11. On branch TRUNK-5451
  12. nothing to commit, working tree clean
  13.  
  14. C:\Users\Suubi-Joshua\openmrs-core>git status
  15. On branch TRUNK-5451
  16. Changes not staged for commit:
  17. (use "git add <file>..." to update what will be committed)
  18. (use "git restore <file>..." to discard changes in working directory)
  19. modified: api/src/main/java/org/openmrs/Cohort.java
  20.  
  21. no changes added to commit (use "git add" and/or "git commit -a")
  22.  
  23. C:\Users\Suubi-Joshua\openmrs-core>mvn clean package
  24. Java HotSpot(TM) 64-Bit Server VM warning: ignoring option MaxPermSize=512m; support was removed in 8.0
  25. [INFO] Scanning for projects...
  26. [INFO] ------------------------------------------------------------------------
  27. [INFO] Reactor Build Order:
  28. [INFO]
  29. [INFO] OpenMRS [pom]
  30. [INFO] openmrs-tools [jar]
  31. [INFO] openmrs-test [pom]
  32. [INFO] openmrs-api [jar]
  33. [INFO] openmrs-web [jar]
  34. [INFO] openmrs-webapp [war]
  35. [INFO] openmrs-liquibase [jar]
  36. [INFO]
  37. [INFO] ------------------------< org.openmrs:openmrs >-------------------------
  38. [INFO] Building OpenMRS 2.5.0-SNAPSHOT [1/7]
  39. [INFO] --------------------------------[ pom ]---------------------------------
  40. [INFO]
  41. [INFO] --- maven-clean-plugin:2.5:clean (default-clean) @ openmrs ---
  42. [INFO] Deleting C:\Users\Suubi-Joshua\openmrs-core\target
  43. [INFO]
  44. [INFO] --- buildnumber-maven-plugin:1.4:create (default) @ openmrs ---
  45. [INFO] ShortRevision tag detected. The value is '6'.
  46. [INFO] Executing: cmd.exe /X /C "git rev-parse --verify --short=6 HEAD"
  47. [INFO] Working directory: C:\Users\Suubi-Joshua\openmrs-core
  48. [INFO] Storing buildNumber: db60de at timestamp: 1614015316569
  49. [INFO] Storing buildScmBranch: TRUNK-5451
  50. [INFO]
  51. [INFO] --- build-helper-maven-plugin:3.2.0:parse-version (parse-version) @ openmrs ---
  52. [INFO]
  53. [INFO] --- maven-jar-plugin:3.2.0:test-jar (default) @ openmrs ---
  54. [WARNING] JAR will be empty - no content was marked for inclusion!
  55. [INFO] Building jar: C:\Users\Suubi-Joshua\openmrs-core\target\openmrs-2.5.0-SNAPSHOT-tests.jar
  56. [INFO]
  57. [INFO] ------------------< org.openmrs.tools:openmrs-tools >-------------------
  58. [INFO] Building openmrs-tools 2.5.0-SNAPSHOT [2/7]
  59. [INFO] --------------------------------[ jar ]---------------------------------
  60. [INFO]
  61. [INFO] --- maven-clean-plugin:2.5:clean (default-clean) @ openmrs-tools ---
  62. [INFO] Deleting C:\Users\Suubi-Joshua\openmrs-core\tools\target
  63. [INFO]
  64. [INFO] --- buildnumber-maven-plugin:1.4:create (default) @ openmrs-tools ---
  65. [INFO]
  66. [INFO] --- build-helper-maven-plugin:3.2.0:parse-version (parse-version) @ openmrs-tools ---
  67. [INFO]
  68. [INFO] --- maven-resources-plugin:3.2.0:resources (default-resources) @ openmrs-tools ---
  69. [INFO] Using 'UTF-8' encoding to copy filtered resources.
  70. [INFO] Using 'UTF-8' encoding to copy filtered properties files.
  71. [INFO] Copying 4 resources
  72. [INFO]
  73. [INFO] --- maven-compiler-plugin:3.8.1:compile (default-compile) @ openmrs-tools ---
  74. [INFO] No sources to compile
  75. [INFO]
  76. [INFO] --- maven-resources-plugin:3.2.0:testResources (default-testResources) @ openmrs-tools ---
  77. [INFO] Using 'UTF-8' encoding to copy filtered resources.
  78. [INFO] Using 'UTF-8' encoding to copy filtered properties files.
  79. [INFO] skip non existing resourceDirectory C:\Users\Suubi-Joshua\openmrs-core\tools\src\test\resources
  80. [INFO]
  81. [INFO] --- maven-compiler-plugin:3.8.1:testCompile (default-testCompile) @ openmrs-tools ---
  82. [INFO] No sources to compile
  83. [INFO]
  84. [INFO] --- maven-surefire-plugin:2.22.2:test (default-test) @ openmrs-tools ---
  85. [INFO] No tests to run.
  86. [INFO]
  87. [INFO] --- maven-jar-plugin:3.2.0:jar (default-jar) @ openmrs-tools ---
  88. [INFO] Building jar: C:\Users\Suubi-Joshua\openmrs-core\tools\target\openmrs-tools-2.5.0-SNAPSHOT.jar
  89. [INFO]
  90. [INFO] --- maven-jar-plugin:3.2.0:test-jar (default) @ openmrs-tools ---
  91. [WARNING] JAR will be empty - no content was marked for inclusion!
  92. [INFO] Building jar: C:\Users\Suubi-Joshua\openmrs-core\tools\target\openmrs-tools-2.5.0-SNAPSHOT-tests.jar
  93. [INFO]
  94. [INFO] -------------------< org.openmrs.test:openmrs-test >--------------------
  95. [INFO] Building openmrs-test 2.5.0-SNAPSHOT [3/7]
  96. [INFO] --------------------------------[ pom ]---------------------------------
  97. [INFO]
  98. [INFO] --- maven-clean-plugin:2.5:clean (default-clean) @ openmrs-test ---
  99. [INFO] Deleting C:\Users\Suubi-Joshua\openmrs-core\test\target
  100. [INFO]
  101. [INFO] --- buildnumber-maven-plugin:1.4:create (default) @ openmrs-test ---
  102. [INFO]
  103. [INFO] --- build-helper-maven-plugin:3.2.0:parse-version (parse-version) @ openmrs-test ---
  104. [INFO]
  105. [INFO] --- maven-jar-plugin:3.2.0:test-jar (default) @ openmrs-test ---
  106. [WARNING] JAR will be empty - no content was marked for inclusion!
  107. [INFO] Building jar: C:\Users\Suubi-Joshua\openmrs-core\test\target\openmrs-test-2.5.0-SNAPSHOT-tests.jar
  108. [INFO]
  109. [INFO] --------------------< org.openmrs.api:openmrs-api >---------------------
  110. [INFO] Building openmrs-api 2.5.0-SNAPSHOT [4/7]
  111. [INFO] --------------------------------[ jar ]---------------------------------
  112. [INFO]
  113. [INFO] --- maven-clean-plugin:2.5:clean (default-clean) @ openmrs-api ---
  114. [INFO] Deleting C:\Users\Suubi-Joshua\openmrs-core\api\target
  115. [INFO]
  116. [INFO] --- buildnumber-maven-plugin:1.4:create (default) @ openmrs-api ---
  117. [INFO]
  118. [INFO] --- build-helper-maven-plugin:3.2.0:parse-version (parse-version) @ openmrs-api ---
  119. [INFO]
  120. [INFO] --- jacoco-maven-plugin:0.8.6:prepare-agent (prepare-agent) @ openmrs-api ---
  121. [INFO] argLine set to -javaagent:C:\\Users\\Suubi-Joshua\\.m2\\repository\\org\\jacoco\\org.jacoco.agent\\0.8.6\\org.jacoco.agent-0.8.6-runtime.jar=destfile=C:\\Users\\Suubi-Joshua\\openmrs-core\\api\\target\\jacoco.exec,includes=org/openmrs/** -Duser.language=en -Duser.region=US -Xmx2g -Djava.locale.providers=COMPAT
  122. [INFO]
  123. [INFO] --- maven-java-formatter-plugin:0.3:format (default) @ openmrs-api ---
  124. [INFO] Using 'UTF-8' encoding to format source files.
  125. [INFO] Number of files to be formatted: 1083
  126. [INFO] Successfully formatted: 0 file(s)
  127. [INFO] Fail to format : 0 file(s)
  128. [INFO] Skipped : 1083 file(s)
  129. [INFO] Approximate time taken: 10s
  130. [INFO]
  131. [INFO] --- maven-resources-plugin:3.2.0:resources (default-resources) @ openmrs-api ---
  132. [INFO] Using 'UTF-8' encoding to copy filtered resources.
  133. [INFO] Using 'UTF-8' encoding to copy filtered properties files.
  134. [INFO] Copying 1 resource
  135. [INFO] Copying 149 resources
  136. [INFO] The encoding used to copy filtered properties files have not been set. This means that the same encoding will be used to copy filtered properties files as when copying other filtered resources. This might not be what you want! Run your build with --debug to see which files might be affected. Read more at https://maven.apache.org/plugins/maven-resources-plugin/examples/filtering-properties-files.html
  137. [INFO]
  138. [INFO] --- maven-compiler-plugin:3.8.1:compile (default-compile) @ openmrs-api ---
  139. [INFO] Changes detected - recompiling the module!
  140. [INFO] Compiling 724 source files to C:\Users\Suubi-Joshua\openmrs-core\api\target\classes
  141. [INFO] /C:/Users/Suubi-Joshua/openmrs-core/api/src/main/java/org/openmrs/PersonName.java: Some input files use or override a deprecated API.
  142. [INFO] /C:/Users/Suubi-Joshua/openmrs-core/api/src/main/java/org/openmrs/PersonName.java: Recompile with -Xlint:deprecation for details.
  143. [INFO] /C:/Users/Suubi-Joshua/openmrs-core/api/src/main/java/org/openmrs/BaseCustomizableMetadata.java: Some input files use unchecked or unsafe operations.
  144. [INFO] /C:/Users/Suubi-Joshua/openmrs-core/api/src/main/java/org/openmrs/BaseCustomizableMetadata.java: Recompile with -Xlint:unchecked for details.
  145. [INFO] -------------------------------------------------------------
  146. [ERROR] COMPILATION ERROR :
  147. [INFO] -------------------------------------------------------------
  148. [ERROR] /C:/Users/Suubi-Joshua/openmrs-core/api/src/main/java/org/openmrs/Cohort.java:[187,79] local variables referenced from a lambda expression must be final or effectively final
  149. [INFO] 1 error
  150. [INFO] -------------------------------------------------------------
  151. [INFO] ------------------------------------------------------------------------
  152. [INFO] Reactor Summary for OpenMRS 2.5.0-SNAPSHOT:
  153. [INFO]
  154. [INFO] OpenMRS ............................................ SUCCESS [ 2.964 s]
  155. [INFO] openmrs-tools ...................................... SUCCESS [ 1.800 s]
  156. [INFO] openmrs-test ....................................... SUCCESS [ 0.467 s]
  157. [INFO] openmrs-api ........................................ FAILURE [ 34.542 s]
  158. [INFO] openmrs-web ........................................ SKIPPED
  159. [INFO] openmrs-webapp ..................................... SKIPPED
  160. [INFO] openmrs-liquibase .................................. SKIPPED
  161. [INFO] ------------------------------------------------------------------------
  162. [INFO] BUILD FAILURE
  163. [INFO] ------------------------------------------------------------------------
  164. [INFO] Total time: 40.499 s
  165. [INFO] Finished at: 2021-02-22T20:35:54+03:00
  166. [INFO] ------------------------------------------------------------------------
  167. [ERROR] Failed to execute goal org.apache.maven.plugins:maven-compiler-plugin:3.8.1:compile (default-compile) on project openmrs-api: Compilation failure
  168. [ERROR] /C:/Users/Suubi-Joshua/openmrs-core/api/src/main/java/org/openmrs/Cohort.java:[187,79] local variables referenced from a lambda expression must be final or effectively final
  169. [ERROR]
  170. [ERROR] -> [Help 1]
  171. [ERROR]
  172. [ERROR] To see the full stack trace of the errors, re-run Maven with the -e switch.
  173. [ERROR] Re-run Maven using the -X switch to enable full debug logging.
  174. [ERROR]
  175. [ERROR] For more information about the errors and possible solutions, please read the following articles:
  176. [ERROR] [Help 1] http://cwiki.apache.org/confluence/display/MAVEN/MojoFailureException
  177. [ERROR]
  178. [ERROR] After correcting the problems, you can resume the build with the command
  179. [ERROR] mvn <args> -rf :openmrs-api
  180.  
  181. C:\Users\Suubi-Joshua\openmrs-core> mvn clean package
  182. Java HotSpot(TM) 64-Bit Server VM warning: ignoring option MaxPermSize=512m; support was removed in 8.0
  183. [INFO] Scanning for projects...
  184. [INFO] ------------------------------------------------------------------------
  185. [INFO] Reactor Build Order:
  186. [INFO]
  187. [INFO] OpenMRS [pom]
  188. [INFO] openmrs-tools [jar]
  189. [INFO] openmrs-test [pom]
  190. [INFO] openmrs-api [jar]
  191. [INFO] openmrs-web [jar]
  192. [INFO] openmrs-webapp [war]
  193. [INFO] openmrs-liquibase [jar]
  194. [INFO]
  195. [INFO] ------------------------< org.openmrs:openmrs >-------------------------
  196. [INFO] Building OpenMRS 2.5.0-SNAPSHOT [1/7]
  197. [INFO] --------------------------------[ pom ]---------------------------------
  198. [INFO]
  199. [INFO] --- maven-clean-plugin:2.5:clean (default-clean) @ openmrs ---
  200. [INFO] Deleting C:\Users\Suubi-Joshua\openmrs-core\target
  201. [INFO]
  202. [INFO] --- buildnumber-maven-plugin:1.4:create (default) @ openmrs ---
  203. [INFO] ShortRevision tag detected. The value is '6'.
  204. [INFO] Executing: cmd.exe /X /C "git rev-parse --verify --short=6 HEAD"
  205. [INFO] Working directory: C:\Users\Suubi-Joshua\openmrs-core
  206. [INFO] Storing buildNumber: db60de at timestamp: 1614015434296
  207. [INFO] Storing buildScmBranch: TRUNK-5451
  208. [INFO]
  209. [INFO] --- build-helper-maven-plugin:3.2.0:parse-version (parse-version) @ openmrs ---
  210. [INFO]
  211. [INFO] --- maven-jar-plugin:3.2.0:test-jar (default) @ openmrs ---
  212. [WARNING] JAR will be empty - no content was marked for inclusion!
  213. [INFO] Building jar: C:\Users\Suubi-Joshua\openmrs-core\target\openmrs-2.5.0-SNAPSHOT-tests.jar
  214. [INFO]
  215. [INFO] ------------------< org.openmrs.tools:openmrs-tools >-------------------
  216. [INFO] Building openmrs-tools 2.5.0-SNAPSHOT [2/7]
  217. [INFO] --------------------------------[ jar ]---------------------------------
  218. [INFO]
  219. [INFO] --- maven-clean-plugin:2.5:clean (default-clean) @ openmrs-tools ---
  220. [INFO] Deleting C:\Users\Suubi-Joshua\openmrs-core\tools\target
  221. [INFO]
  222. [INFO] --- buildnumber-maven-plugin:1.4:create (default) @ openmrs-tools ---
  223. [INFO]
  224. [INFO] --- build-helper-maven-plugin:3.2.0:parse-version (parse-version) @ openmrs-tools ---
  225. [INFO]
  226. [INFO] --- maven-resources-plugin:3.2.0:resources (default-resources) @ openmrs-tools ---
  227. [INFO] Using 'UTF-8' encoding to copy filtered resources.
  228. [INFO] Using 'UTF-8' encoding to copy filtered properties files.
  229. [INFO] Copying 4 resources
  230. [INFO]
  231. [INFO] --- maven-compiler-plugin:3.8.1:compile (default-compile) @ openmrs-tools ---
  232. [INFO] No sources to compile
  233. [INFO]
  234. [INFO] --- maven-resources-plugin:3.2.0:testResources (default-testResources) @ openmrs-tools ---
  235. [INFO] Using 'UTF-8' encoding to copy filtered resources.
  236. [INFO] Using 'UTF-8' encoding to copy filtered properties files.
  237. [INFO] skip non existing resourceDirectory C:\Users\Suubi-Joshua\openmrs-core\tools\src\test\resources
  238. [INFO]
  239. [INFO] --- maven-compiler-plugin:3.8.1:testCompile (default-testCompile) @ openmrs-tools ---
  240. [INFO] No sources to compile
  241. [INFO]
  242. [INFO] --- maven-surefire-plugin:2.22.2:test (default-test) @ openmrs-tools ---
  243. [INFO] No tests to run.
  244. [INFO]
  245. [INFO] --- maven-jar-plugin:3.2.0:jar (default-jar) @ openmrs-tools ---
  246. [INFO] Building jar: C:\Users\Suubi-Joshua\openmrs-core\tools\target\openmrs-tools-2.5.0-SNAPSHOT.jar
  247. [INFO]
  248. [INFO] --- maven-jar-plugin:3.2.0:test-jar (default) @ openmrs-tools ---
  249. [WARNING] JAR will be empty - no content was marked for inclusion!
  250. [INFO] Building jar: C:\Users\Suubi-Joshua\openmrs-core\tools\target\openmrs-tools-2.5.0-SNAPSHOT-tests.jar
  251. [INFO]
  252. [INFO] -------------------< org.openmrs.test:openmrs-test >--------------------
  253. [INFO] Building openmrs-test 2.5.0-SNAPSHOT [3/7]
  254. [INFO] --------------------------------[ pom ]---------------------------------
  255. [INFO]
  256. [INFO] --- maven-clean-plugin:2.5:clean (default-clean) @ openmrs-test ---
  257. [INFO] Deleting C:\Users\Suubi-Joshua\openmrs-core\test\target
  258. [INFO]
  259. [INFO] --- buildnumber-maven-plugin:1.4:create (default) @ openmrs-test ---
  260. [INFO]
  261. [INFO] --- build-helper-maven-plugin:3.2.0:parse-version (parse-version) @ openmrs-test ---
  262. [INFO]
  263. [INFO] --- maven-jar-plugin:3.2.0:test-jar (default) @ openmrs-test ---
  264. [WARNING] JAR will be empty - no content was marked for inclusion!
  265. [INFO] Building jar: C:\Users\Suubi-Joshua\openmrs-core\test\target\openmrs-test-2.5.0-SNAPSHOT-tests.jar
  266. [INFO]
  267. [INFO] --------------------< org.openmrs.api:openmrs-api >---------------------
  268. [INFO] Building openmrs-api 2.5.0-SNAPSHOT [4/7]
  269. [INFO] --------------------------------[ jar ]---------------------------------
  270. [INFO]
  271. [INFO] --- maven-clean-plugin:2.5:clean (default-clean) @ openmrs-api ---
  272. [INFO] Deleting C:\Users\Suubi-Joshua\openmrs-core\api\target
  273. [INFO]
  274. [INFO] --- buildnumber-maven-plugin:1.4:create (default) @ openmrs-api ---
  275. [INFO]
  276. [INFO] --- build-helper-maven-plugin:3.2.0:parse-version (parse-version) @ openmrs-api ---
  277. [INFO]
  278. [INFO] --- jacoco-maven-plugin:0.8.6:prepare-agent (prepare-agent) @ openmrs-api ---
  279. [INFO] argLine set to -javaagent:C:\\Users\\Suubi-Joshua\\.m2\\repository\\org\\jacoco\\org.jacoco.agent\\0.8.6\\org.jacoco.agent-0.8.6-runtime.jar=destfile=C:\\Users\\Suubi-Joshua\\openmrs-core\\api\\target\\jacoco.exec,includes=org/openmrs/** -Duser.language=en -Duser.region=US -Xmx2g -Djava.locale.providers=COMPAT
  280. [INFO]
  281. [INFO] --- maven-java-formatter-plugin:0.3:format (default) @ openmrs-api ---
  282. [INFO] Using 'UTF-8' encoding to format source files.
  283. [INFO] Number of files to be formatted: 1083
  284. [INFO] Successfully formatted: 0 file(s)
  285. [INFO] Fail to format : 0 file(s)
  286. [INFO] Skipped : 1083 file(s)
  287. [INFO] Approximate time taken: 6s
  288. [INFO]
  289. [INFO] --- maven-resources-plugin:3.2.0:resources (default-resources) @ openmrs-api ---
  290. [INFO] Using 'UTF-8' encoding to copy filtered resources.
  291. [INFO] Using 'UTF-8' encoding to copy filtered properties files.
  292. [INFO] Copying 1 resource
  293. [INFO] Copying 149 resources
  294. [INFO] The encoding used to copy filtered properties files have not been set. This means that the same encoding will be used to copy filtered properties files as when copying other filtered resources. This might not be what you want! Run your build with --debug to see which files might be affected. Read more at https://maven.apache.org/plugins/maven-resources-plugin/examples/filtering-properties-files.html
  295. [INFO]
  296. [INFO] --- maven-compiler-plugin:3.8.1:compile (default-compile) @ openmrs-api ---
  297. [INFO] Changes detected - recompiling the module!
  298. [INFO] Compiling 724 source files to C:\Users\Suubi-Joshua\openmrs-core\api\target\classes
  299. [INFO] -------------------------------------------------------------
  300. [ERROR] COMPILATION ERROR :
  301. [INFO] -------------------------------------------------------------
  302. [ERROR] /C:/Users/Suubi-Joshua/openmrs-core/api/src/main/java/org/openmrs/Cohort.java:[183,36] <identifier> expected
  303. [INFO] 1 error
  304. [INFO] -------------------------------------------------------------
  305. [INFO] ------------------------------------------------------------------------
  306. [INFO] Reactor Summary for OpenMRS 2.5.0-SNAPSHOT:
  307. [INFO]
  308. [INFO] OpenMRS ............................................ SUCCESS [ 2.748 s]
  309. [INFO] openmrs-tools ...................................... SUCCESS [ 1.874 s]
  310. [INFO] openmrs-test ....................................... SUCCESS [ 0.401 s]
  311. [INFO] openmrs-api ........................................ FAILURE [ 15.796 s]
  312. [INFO] openmrs-web ........................................ SKIPPED
  313. [INFO] openmrs-webapp ..................................... SKIPPED
  314. [INFO] openmrs-liquibase .................................. SKIPPED
  315. [INFO] ------------------------------------------------------------------------
  316. [INFO] BUILD FAILURE
  317. [INFO] ------------------------------------------------------------------------
  318. [INFO] Total time: 21.459 s
  319. [INFO] Finished at: 2021-02-22T20:37:33+03:00
  320. [INFO] ------------------------------------------------------------------------
  321. [ERROR] Failed to execute goal org.apache.maven.plugins:maven-compiler-plugin:3.8.1:compile (default-compile) on project openmrs-api: Compilation failure
  322. [ERROR] /C:/Users/Suubi-Joshua/openmrs-core/api/src/main/java/org/openmrs/Cohort.java:[183,36] <identifier> expected
  323. [ERROR]
  324. [ERROR] -> [Help 1]
  325. [ERROR]
  326. [ERROR] To see the full stack trace of the errors, re-run Maven with the -e switch.
  327. [ERROR] Re-run Maven using the -X switch to enable full debug logging.
  328. [ERROR]
  329. [ERROR] For more information about the errors and possible solutions, please read the following articles:
  330. [ERROR] [Help 1] http://cwiki.apache.org/confluence/display/MAVEN/MojoFailureException
  331. [ERROR]
  332. [ERROR] After correcting the problems, you can resume the build with the command
  333. [ERROR] mvn <args> -rf :openmrs-api
  334.  
  335. C:\Users\Suubi-Joshua\openmrs-core>mvn clean package
  336. Java HotSpot(TM) 64-Bit Server VM warning: ignoring option MaxPermSize=512m; support was removed in 8.0
  337. [INFO] Scanning for projects...
  338. [INFO] ------------------------------------------------------------------------
  339. [INFO] Reactor Build Order:
  340. [INFO]
  341. [INFO] OpenMRS [pom]
  342. [INFO] openmrs-tools [jar]
  343. [INFO] openmrs-test [pom]
  344. [INFO] openmrs-api [jar]
  345. [INFO] openmrs-web [jar]
  346. [INFO] openmrs-webapp [war]
  347. [INFO] openmrs-liquibase [jar]
  348. [INFO]
  349. [INFO] ------------------------< org.openmrs:openmrs >-------------------------
  350. [INFO] Building OpenMRS 2.5.0-SNAPSHOT [1/7]
  351. [INFO] --------------------------------[ pom ]---------------------------------
  352. [INFO]
  353. [INFO] --- maven-clean-plugin:2.5:clean (default-clean) @ openmrs ---
  354. [INFO] Deleting C:\Users\Suubi-Joshua\openmrs-core\target
  355. [INFO]
  356. [INFO] --- buildnumber-maven-plugin:1.4:create (default) @ openmrs ---
  357. [INFO] ShortRevision tag detected. The value is '6'.
  358. [INFO] Executing: cmd.exe /X /C "git rev-parse --verify --short=6 HEAD"
  359. [INFO] Working directory: C:\Users\Suubi-Joshua\openmrs-core
  360. [INFO] Storing buildNumber: db60de at timestamp: 1614016082578
  361. [INFO] Storing buildScmBranch: TRUNK-5451
  362. [INFO]
  363. [INFO] --- build-helper-maven-plugin:3.2.0:parse-version (parse-version) @ openmrs ---
  364. [INFO]
  365. [INFO] --- maven-jar-plugin:3.2.0:test-jar (default) @ openmrs ---
  366. [WARNING] JAR will be empty - no content was marked for inclusion!
  367. [INFO] Building jar: C:\Users\Suubi-Joshua\openmrs-core\target\openmrs-2.5.0-SNAPSHOT-tests.jar
  368. [INFO]
  369. [INFO] ------------------< org.openmrs.tools:openmrs-tools >-------------------
  370. [INFO] Building openmrs-tools 2.5.0-SNAPSHOT [2/7]
  371. [INFO] --------------------------------[ jar ]---------------------------------
  372. [INFO]
  373. [INFO] --- maven-clean-plugin:2.5:clean (default-clean) @ openmrs-tools ---
  374. [INFO] Deleting C:\Users\Suubi-Joshua\openmrs-core\tools\target
  375. [INFO]
  376. [INFO] --- buildnumber-maven-plugin:1.4:create (default) @ openmrs-tools ---
  377. [INFO]
  378. [INFO] --- build-helper-maven-plugin:3.2.0:parse-version (parse-version) @ openmrs-tools ---
  379. [INFO]
  380. [INFO] --- maven-resources-plugin:3.2.0:resources (default-resources) @ openmrs-tools ---
  381. [INFO] Using 'UTF-8' encoding to copy filtered resources.
  382. [INFO] Using 'UTF-8' encoding to copy filtered properties files.
  383. [INFO] Copying 4 resources
  384. [INFO]
  385. [INFO] --- maven-compiler-plugin:3.8.1:compile (default-compile) @ openmrs-tools ---
  386. [INFO] No sources to compile
  387. [INFO]
  388. [INFO] --- maven-resources-plugin:3.2.0:testResources (default-testResources) @ openmrs-tools ---
  389. [INFO] Using 'UTF-8' encoding to copy filtered resources.
  390. [INFO] Using 'UTF-8' encoding to copy filtered properties files.
  391. [INFO] skip non existing resourceDirectory C:\Users\Suubi-Joshua\openmrs-core\tools\src\test\resources
  392. [INFO]
  393. [INFO] --- maven-compiler-plugin:3.8.1:testCompile (default-testCompile) @ openmrs-tools ---
  394. [INFO] No sources to compile
  395. [INFO]
  396. [INFO] --- maven-surefire-plugin:2.22.2:test (default-test) @ openmrs-tools ---
  397. [INFO] No tests to run.
  398. [INFO]
  399. [INFO] --- maven-jar-plugin:3.2.0:jar (default-jar) @ openmrs-tools ---
  400. [INFO] Building jar: C:\Users\Suubi-Joshua\openmrs-core\tools\target\openmrs-tools-2.5.0-SNAPSHOT.jar
  401. [INFO]
  402. [INFO] --- maven-jar-plugin:3.2.0:test-jar (default) @ openmrs-tools ---
  403. [WARNING] JAR will be empty - no content was marked for inclusion!
  404. [INFO] Building jar: C:\Users\Suubi-Joshua\openmrs-core\tools\target\openmrs-tools-2.5.0-SNAPSHOT-tests.jar
  405. [INFO]
  406. [INFO] -------------------< org.openmrs.test:openmrs-test >--------------------
  407. [INFO] Building openmrs-test 2.5.0-SNAPSHOT [3/7]
  408. [INFO] --------------------------------[ pom ]---------------------------------
  409. [INFO]
  410. [INFO] --- maven-clean-plugin:2.5:clean (default-clean) @ openmrs-test ---
  411. [INFO] Deleting C:\Users\Suubi-Joshua\openmrs-core\test\target
  412. [INFO]
  413. [INFO] --- buildnumber-maven-plugin:1.4:create (default) @ openmrs-test ---
  414. [INFO]
  415. [INFO] --- build-helper-maven-plugin:3.2.0:parse-version (parse-version) @ openmrs-test ---
  416. [INFO]
  417. [INFO] --- maven-jar-plugin:3.2.0:test-jar (default) @ openmrs-test ---
  418. [WARNING] JAR will be empty - no content was marked for inclusion!
  419. [INFO] Building jar: C:\Users\Suubi-Joshua\openmrs-core\test\target\openmrs-test-2.5.0-SNAPSHOT-tests.jar
  420. [INFO]
  421. [INFO] --------------------< org.openmrs.api:openmrs-api >---------------------
  422. [INFO] Building openmrs-api 2.5.0-SNAPSHOT [4/7]
  423. [INFO] --------------------------------[ jar ]---------------------------------
  424. [INFO]
  425. [INFO] --- maven-clean-plugin:2.5:clean (default-clean) @ openmrs-api ---
  426. [INFO] Deleting C:\Users\Suubi-Joshua\openmrs-core\api\target
  427. [INFO]
  428. [INFO] --- buildnumber-maven-plugin:1.4:create (default) @ openmrs-api ---
  429. [INFO]
  430. [INFO] --- build-helper-maven-plugin:3.2.0:parse-version (parse-version) @ openmrs-api ---
  431. [INFO]
  432. [INFO] --- jacoco-maven-plugin:0.8.6:prepare-agent (prepare-agent) @ openmrs-api ---
  433. [INFO] argLine set to -javaagent:C:\\Users\\Suubi-Joshua\\.m2\\repository\\org\\jacoco\\org.jacoco.agent\\0.8.6\\org.jacoco.agent-0.8.6-runtime.jar=destfile=C:\\Users\\Suubi-Joshua\\openmrs-core\\api\\target\\jacoco.exec,includes=org/openmrs/** -Duser.language=en -Duser.region=US -Xmx2g -Djava.locale.providers=COMPAT
  434. [INFO]
  435. [INFO] --- maven-java-formatter-plugin:0.3:format (default) @ openmrs-api ---
  436. [INFO] Using 'UTF-8' encoding to format source files.
  437. [INFO] Number of files to be formatted: 1083
  438. [INFO] Successfully formatted: 0 file(s)
  439. [INFO] Fail to format : 0 file(s)
  440. [INFO] Skipped : 1083 file(s)
  441. [INFO] Approximate time taken: 6s
  442. [INFO]
  443. [INFO] --- maven-resources-plugin:3.2.0:resources (default-resources) @ openmrs-api ---
  444. [INFO] Using 'UTF-8' encoding to copy filtered resources.
  445. [INFO] Using 'UTF-8' encoding to copy filtered properties files.
  446. [INFO] Copying 1 resource
  447. [INFO] Copying 149 resources
  448. [INFO] The encoding used to copy filtered properties files have not been set. This means that the same encoding will be used to copy filtered properties files as when copying other filtered resources. This might not be what you want! Run your build with --debug to see which files might be affected. Read more at https://maven.apache.org/plugins/maven-resources-plugin/examples/filtering-properties-files.html
  449. [INFO]
  450. [INFO] --- maven-compiler-plugin:3.8.1:compile (default-compile) @ openmrs-api ---
  451. [INFO] Changes detected - recompiling the module!
  452. [INFO] Compiling 724 source files to C:\Users\Suubi-Joshua\openmrs-core\api\target\classes
  453. [INFO] /C:/Users/Suubi-Joshua/openmrs-core/api/src/main/java/org/openmrs/PersonName.java: Some input files use or override a deprecated API.
  454. [INFO] /C:/Users/Suubi-Joshua/openmrs-core/api/src/main/java/org/openmrs/PersonName.java: Recompile with -Xlint:deprecation for details.
  455. [INFO] /C:/Users/Suubi-Joshua/openmrs-core/api/src/main/java/org/openmrs/BaseCustomizableMetadata.java: Some input files use unchecked or unsafe operations.
  456. [INFO] /C:/Users/Suubi-Joshua/openmrs-core/api/src/main/java/org/openmrs/BaseCustomizableMetadata.java: Recompile with -Xlint:unchecked for details.
  457. [INFO]
  458. [INFO] --- maven-resources-plugin:3.2.0:testResources (default-testResources) @ openmrs-api ---
  459. [INFO] Using 'UTF-8' encoding to copy filtered resources.
  460. [INFO] Using 'UTF-8' encoding to copy filtered properties files.
  461. [INFO] Copying 147 resources
  462. [INFO]
  463. [INFO] --- maven-compiler-plugin:3.8.1:testCompile (default-testCompile) @ openmrs-api ---
  464. [INFO] Changes detected - recompiling the module!
  465. [INFO] Compiling 359 source files to C:\Users\Suubi-Joshua\openmrs-core\api\target\test-classes
  466. [INFO] /C:/Users/Suubi-Joshua/openmrs-core/api/src/test/java/org/openmrs/test/jupiter/BaseContextSensitiveTest.java: Some input files use or override a deprecated API.
  467. [INFO] /C:/Users/Suubi-Joshua/openmrs-core/api/src/test/java/org/openmrs/test/jupiter/BaseContextSensitiveTest.java: Recompile with -Xlint:deprecation for details.
  468. [INFO] /C:/Users/Suubi-Joshua/openmrs-core/api/src/test/java/org/openmrs/api/AdministrationServiceTest.java: Some input files use unchecked or unsafe operations.
  469. [INFO] /C:/Users/Suubi-Joshua/openmrs-core/api/src/test/java/org/openmrs/api/AdministrationServiceTest.java: Recompile with -Xlint:unchecked for details.
  470. [INFO]
  471. [INFO] --- maven-surefire-plugin:2.22.2:test (default-test) @ openmrs-api ---
  472. [INFO]
  473. [INFO] -------------------------------------------------------
  474. [INFO] T E S T S
  475. [INFO] -------------------------------------------------------
  476. [INFO] Running liquibase.ext.change.core.InsertWithUuidDataChangeTest
  477. [INFO] Tests run: 2, Failures: 0, Errors: 0, Skipped: 0, Time elapsed: 0.476 s - in liquibase.ext.change.core.InsertWithUuidDataChangeTest
  478. [INFO] Running liquibase.ext.datatype.core.MySQLBooleanTypeTest
  479. [INFO] Tests run: 3, Failures: 0, Errors: 0, Skipped: 0, Time elapsed: 0.321 s - in liquibase.ext.datatype.core.MySQLBooleanTypeTest
  480. [INFO] Running liquibase.ext.sqlgenerator.core.ModifyColumnChangeTest
  481. [INFO] Tests run: 2, Failures: 0, Errors: 0, Skipped: 0, Time elapsed: 0.008 s - in liquibase.ext.sqlgenerator.core.ModifyColumnChangeTest
  482. [INFO] Running liquibase.ext.sqlgenerator.core.ModifyColumnGeneratorTest
  483. [INFO] Tests run: 8, Failures: 0, Errors: 0, Skipped: 0, Time elapsed: 2.034 s - in liquibase.ext.sqlgenerator.core.ModifyColumnGeneratorTest
  484. [INFO] Running org.openmrs.AllergenTest
  485. [INFO] Tests run: 6, Failures: 0, Errors: 0, Skipped: 0, Time elapsed: 35.609 s - in org.openmrs.AllergenTest
  486. [INFO] Running org.openmrs.AllergiesTest
  487. [INFO] Tests run: 26, Failures: 0, Errors: 0, Skipped: 0, Time elapsed: 3.683 s - in org.openmrs.AllergiesTest
  488. [INFO] Running org.openmrs.annotation.OpenmrsProfileExcludeFilterTest
  489. [WARNING] Tests run: 8, Failures: 0, Errors: 0, Skipped: 2, Time elapsed: 0.326 s - in org.openmrs.annotation.OpenmrsProfileExcludeFilterTest
  490. [INFO] Running org.openmrs.annotation.OpenmrsProfileExcludeFilterWithModulesTest
  491. [INFO] Tests run: 1, Failures: 0, Errors: 0, Skipped: 0, Time elapsed: 5.696 s - in org.openmrs.annotation.OpenmrsProfileExcludeFilterWithModulesTest
  492. [INFO] Running org.openmrs.annotation.OpenmrsProfileIncludeFilterTest
  493. [INFO] Tests run: 2, Failures: 0, Errors: 0, Skipped: 0, Time elapsed: 3.15 s - in org.openmrs.annotation.OpenmrsProfileIncludeFilterTest
  494. [INFO] Running org.openmrs.annotation.StartModuleAnnotationReuseTest
  495. [INFO] Tests run: 1, Failures: 0, Errors: 0, Skipped: 0, Time elapsed: 5.421 s - in org.openmrs.annotation.StartModuleAnnotationReuseTest
  496. [INFO] Running org.openmrs.annotation.StartModuleAnnotationTest
  497. [INFO] Tests run: 1, Failures: 0, Errors: 0, Skipped: 0, Time elapsed: 4.501 s - in org.openmrs.annotation.StartModuleAnnotationTest
  498. [INFO] Running org.openmrs.aop.AuthorizationAdviceTest
  499. [INFO] Tests run: 2, Failures: 0, Errors: 0, Skipped: 0, Time elapsed: 2.88 s - in org.openmrs.aop.AuthorizationAdviceTest
  500. [INFO] Running org.openmrs.aop.RequiredDataAdviceTest
  501. [INFO] Tests run: 26, Failures: 0, Errors: 0, Skipped: 0, Time elapsed: 0.878 s - in org.openmrs.aop.RequiredDataAdviceTest
  502. [INFO] Running org.openmrs.api.AdministrationServiceTest
  503. [WARNING] Tests run: 57, Failures: 0, Errors: 0, Skipped: 4, Time elapsed: 5.018 s - in org.openmrs.api.AdministrationServiceTest
  504. [INFO] Running org.openmrs.api.AdministrationServiceUnitTest
  505. [INFO] Tests run: 5, Failures: 0, Errors: 0, Skipped: 0, Time elapsed: 0.032 s - in org.openmrs.api.AdministrationServiceUnitTest
  506. [INFO] Running org.openmrs.api.cache.CachePropertiesUtilTest
  507. [INFO] Tests run: 1, Failures: 0, Errors: 0, Skipped: 0, Time elapsed: 0.006 s - in org.openmrs.api.cache.CachePropertiesUtilTest
  508. [INFO] Running org.openmrs.api.cache.OpenmrsCacheManagerFactoryBeanTest
  509. [INFO] Tests run: 1, Failures: 0, Errors: 0, Skipped: 0, Time elapsed: 2.433 s - in org.openmrs.api.cache.OpenmrsCacheManagerFactoryBeanTest
  510. [INFO] Running org.openmrs.api.CohortServiceTest
  511. [ERROR] Tests run: 39, Failures: 2, Errors: 0, Skipped: 0, Time elapsed: 8.71 s <<< FAILURE! - in org.openmrs.api.CohortServiceTest
  512. [ERROR] getMemberships_shouldReturnVoidedMemberships Time elapsed: 0.191 s <<< FAILURE!
  513. org.opentest4j.AssertionFailedError: expected: <3> but was: <1>
  514. at org.openmrs.api.CohortServiceTest.getMemberships_shouldReturnVoidedMemberships(CohortServiceTest.java:655)
  515.  
  516. [ERROR] getMemberships_shouldReturnUnvoidedMemberships Time elapsed: 0.22 s <<< FAILURE!
  517. org.opentest4j.AssertionFailedError: expected: <2> but was: <3>
  518. at org.openmrs.api.CohortServiceTest.getMemberships_shouldReturnUnvoidedMemberships(CohortServiceTest.java:680)
  519.  
  520. [INFO] Running org.openmrs.api.ConceptServiceTest
  521. [WARNING] Tests run: 245, Failures: 0, Errors: 0, Skipped: 1, Time elapsed: 240.738 s - in org.openmrs.api.ConceptServiceTest
  522. [INFO] Running org.openmrs.api.context.ContextTest
  523. [INFO] Tests run: 17, Failures: 0, Errors: 0, Skipped: 0, Time elapsed: 2.741 s - in org.openmrs.api.context.ContextTest
  524. [INFO] Running org.openmrs.api.context.ContextWithModuleTest
  525. [INFO] Tests run: 1, Failures: 0, Errors: 0, Skipped: 0, Time elapsed: 2.376 s - in org.openmrs.api.context.ContextWithModuleTest
  526. [INFO] Running org.openmrs.api.context.DaemonTest
  527. [INFO] Tests run: 10, Failures: 0, Errors: 0, Skipped: 0, Time elapsed: 2.551 s - in org.openmrs.api.context.DaemonTest
  528. [INFO] Running org.openmrs.api.DatatypeServiceTest
  529. [INFO] Tests run: 2, Failures: 0, Errors: 0, Skipped: 0, Time elapsed: 2.228 s - in org.openmrs.api.DatatypeServiceTest
  530. [INFO] Running org.openmrs.api.db.ConceptDAOTest
  531. [WARNING] Tests run: 13, Failures: 0, Errors: 0, Skipped: 2, Time elapsed: 2.95 s - in org.openmrs.api.db.ConceptDAOTest
  532. [INFO] Running org.openmrs.api.db.ContextDAOTest
  533. [INFO] Tests run: 24, Failures: 0, Errors: 0, Skipped: 0, Time elapsed: 3.308 s - in org.openmrs.api.db.ContextDAOTest
  534. [INFO] Running org.openmrs.api.db.EncounterDAOTest
  535. [INFO] Tests run: 4, Failures: 0, Errors: 0, Skipped: 0, Time elapsed: 2.891 s - in org.openmrs.api.db.EncounterDAOTest
  536. [INFO] Running org.openmrs.api.db.hibernate.AuditableInterceptorTest
  537. Security framework of XStream not explicitly initialized, using predefined black list on your own risk.
  538. [INFO] Tests run: 15, Failures: 0, Errors: 0, Skipped: 0, Time elapsed: 2.921 s - in org.openmrs.api.db.hibernate.AuditableInterceptorTest
  539. [INFO] Running org.openmrs.api.db.hibernate.DropMillisecondsHibernateInterceptorTest
  540. [INFO] Tests run: 4, Failures: 0, Errors: 0, Skipped: 0, Time elapsed: 4.099 s - in org.openmrs.api.db.hibernate.DropMillisecondsHibernateInterceptorTest
  541. [INFO] Running org.openmrs.api.db.hibernate.HibernateAdministrationDAOTest
  542. [INFO] Tests run: 4, Failures: 0, Errors: 0, Skipped: 0, Time elapsed: 2.558 s - in org.openmrs.api.db.hibernate.HibernateAdministrationDAOTest
  543. [INFO] Running org.openmrs.api.db.hibernate.HibernateConceptDAOTest
  544. [INFO] Tests run: 11, Failures: 0, Errors: 0, Skipped: 0, Time elapsed: 10.786 s - in org.openmrs.api.db.hibernate.HibernateConceptDAOTest
  545. [INFO] Running org.openmrs.api.db.hibernate.HibernateConditionDAOTest
  546. [INFO] Tests run: 6, Failures: 0, Errors: 0, Skipped: 0, Time elapsed: 6.37 s - in org.openmrs.api.db.hibernate.HibernateConditionDAOTest
  547. [INFO] Running org.openmrs.api.db.hibernate.HibernateDiagnosisDAOTest
  548. [INFO] Tests run: 9, Failures: 0, Errors: 0, Skipped: 0, Time elapsed: 2.569 s - in org.openmrs.api.db.hibernate.HibernateDiagnosisDAOTest
  549. [INFO] Running org.openmrs.api.db.hibernate.HibernateFormDAOTest
  550. [INFO] Tests run: 1, Failures: 0, Errors: 0, Skipped: 0, Time elapsed: 2.364 s - in org.openmrs.api.db.hibernate.HibernateFormDAOTest
  551. [INFO] Running org.openmrs.api.db.hibernate.HibernateLocationDAOTest
  552. [INFO] Tests run: 3, Failures: 0, Errors: 0, Skipped: 0, Time elapsed: 2.607 s - in org.openmrs.api.db.hibernate.HibernateLocationDAOTest
  553. [INFO] Running org.openmrs.api.db.hibernate.HibernateObsDAOTest
  554. [INFO] Tests run: 1, Failures: 0, Errors: 0, Skipped: 0, Time elapsed: 2.118 s - in org.openmrs.api.db.hibernate.HibernateObsDAOTest
  555. [INFO] Running org.openmrs.api.db.hibernate.HibernateOrderDAOTest
  556. [INFO] Tests run: 10, Failures: 0, Errors: 0, Skipped: 0, Time elapsed: 3.415 s - in org.openmrs.api.db.hibernate.HibernateOrderDAOTest
  557. [INFO] Running org.openmrs.api.db.hibernate.HibernatePatientDAOTest
  558. [INFO] Tests run: 2, Failures: 0, Errors: 0, Skipped: 0, Time elapsed: 3.615 s - in org.openmrs.api.db.hibernate.HibernatePatientDAOTest
  559. [INFO] Running org.openmrs.api.db.hibernate.HibernatePersonDAOTest
  560. [INFO] Tests run: 41, Failures: 0, Errors: 0, Skipped: 0, Time elapsed: 39.359 s - in org.openmrs.api.db.hibernate.HibernatePersonDAOTest
  561. [INFO] Running org.openmrs.api.db.hibernate.HibernateProviderDAOTest
  562. [INFO] Tests run: 3, Failures: 0, Errors: 0, Skipped: 0, Time elapsed: 2.194 s - in org.openmrs.api.db.hibernate.HibernateProviderDAOTest
  563. [INFO] Running org.openmrs.api.db.hibernate.ImmutableEntityInterceptorTest
  564. [INFO] Tests run: 4, Failures: 0, Errors: 0, Skipped: 0, Time elapsed: 1.816 s - in org.openmrs.api.db.hibernate.ImmutableEntityInterceptorTest
  565. [INFO] Running org.openmrs.api.db.hibernate.PatientSearchCriteriaTest
  566. [INFO] Tests run: 18, Failures: 0, Errors: 0, Skipped: 0, Time elapsed: 2.413 s - in org.openmrs.api.db.hibernate.PatientSearchCriteriaTest
  567. [INFO] Running org.openmrs.api.db.hibernate.PersonAttributeHelperTest
  568. [INFO] Tests run: 5, Failures: 0, Errors: 0, Skipped: 0, Time elapsed: 2.447 s - in org.openmrs.api.db.hibernate.PersonAttributeHelperTest
  569. [INFO] Running org.openmrs.api.db.hibernate.ProviderDAOTest
  570. [INFO] Tests run: 3, Failures: 0, Errors: 0, Skipped: 0, Time elapsed: 2.236 s - in org.openmrs.api.db.hibernate.ProviderDAOTest
  571. [INFO] Running org.openmrs.api.db.PatientDAOTest
  572. [WARNING] Tests run: 159, Failures: 0, Errors: 0, Skipped: 1, Time elapsed: 167.886 s - in org.openmrs.api.db.PatientDAOTest
  573. [INFO] Running org.openmrs.api.db.PersonDAOTest
  574. [INFO] Tests run: 3, Failures: 0, Errors: 0, Skipped: 0, Time elapsed: 2.242 s - in org.openmrs.api.db.PersonDAOTest
  575. [INFO] Running org.openmrs.api.db.ProgramWorkflowDAOTest
  576. [INFO] Tests run: 5, Failures: 0, Errors: 0, Skipped: 0, Time elapsed: 2.089 s - in org.openmrs.api.db.ProgramWorkflowDAOTest
  577. [INFO] Running org.openmrs.api.db.SerializedObjectDAOTest
  578. [WARNING] Tests run: 1, Failures: 0, Errors: 0, Skipped: 1, Time elapsed: 0.003 s - in org.openmrs.api.db.SerializedObjectDAOTest
  579. [INFO] Running org.openmrs.api.db.UserDAOTest
  580. [INFO] Tests run: 8, Failures: 0, Errors: 0, Skipped: 0, Time elapsed: 2.122 s - in org.openmrs.api.db.UserDAOTest
  581. [INFO] Running org.openmrs.api.db.VisitDAOTest
  582. [INFO] Tests run: 3, Failures: 0, Errors: 0, Skipped: 0, Time elapsed: 2.591 s - in org.openmrs.api.db.VisitDAOTest
  583. [INFO] Running org.openmrs.api.EncounterServiceTest
  584. [WARNING] Tests run: 144, Failures: 0, Errors: 0, Skipped: 2, Time elapsed: 49.184 s - in org.openmrs.api.EncounterServiceTest
  585. [INFO] Running org.openmrs.api.FormServiceTest
  586. [INFO] Tests run: 48, Failures: 0, Errors: 0, Skipped: 0, Time elapsed: 3.452 s - in org.openmrs.api.FormServiceTest
  587. [INFO] Running org.openmrs.api.handler.BaseRetireHandlerTest
  588. [INFO] Tests run: 8, Failures: 0, Errors: 0, Skipped: 0, Time elapsed: 0.006 s - in org.openmrs.api.handler.BaseRetireHandlerTest
  589. [INFO] Running org.openmrs.api.handler.BaseUnretireHandlerTest
  590. [INFO] Tests run: 6, Failures: 0, Errors: 0, Skipped: 0, Time elapsed: 0.009 s - in org.openmrs.api.handler.BaseUnretireHandlerTest
  591. [INFO] Running org.openmrs.api.handler.BaseUnvoidHandlerTest
  592. [INFO] Tests run: 6, Failures: 0, Errors: 0, Skipped: 0, Time elapsed: 0.003 s - in org.openmrs.api.handler.BaseUnvoidHandlerTest
  593. [INFO] Running org.openmrs.api.handler.BaseVoidHandlerTest
  594. [INFO] Tests run: 8, Failures: 0, Errors: 0, Skipped: 0, Time elapsed: 0.003 s - in org.openmrs.api.handler.BaseVoidHandlerTest
  595. [INFO] Running org.openmrs.api.handler.ConceptNameSaveHandlerTest
  596. [INFO] Tests run: 4, Failures: 0, Errors: 0, Skipped: 0, Time elapsed: 2.361 s - in org.openmrs.api.handler.ConceptNameSaveHandlerTest
  597. [INFO] Running org.openmrs.api.handler.ExistingOrNewVisitAssignmentHandlerTest
  598. [INFO] Tests run: 5, Failures: 0, Errors: 0, Skipped: 0, Time elapsed: 3.824 s - in org.openmrs.api.handler.ExistingOrNewVisitAssignmentHandlerTest
  599. [INFO] Running org.openmrs.api.handler.ExistingVisitAssignmentHandlerTest
  600. [INFO] Tests run: 3, Failures: 0, Errors: 0, Skipped: 0, Time elapsed: 3.61 s - in org.openmrs.api.handler.ExistingVisitAssignmentHandlerTest
  601. [INFO] Running org.openmrs.api.handler.OpenmrsMetadataSaveHandlerTest
  602. [INFO] Tests run: 2, Failures: 0, Errors: 0, Skipped: 0, Time elapsed: 0.004 s - in org.openmrs.api.handler.OpenmrsMetadataSaveHandlerTest
  603. [INFO] Running org.openmrs.api.handler.OpenmrsObjectSaveHandlerTest
  604. [INFO] Tests run: 5, Failures: 0, Errors: 0, Skipped: 0, Time elapsed: 0.004 s - in org.openmrs.api.handler.OpenmrsObjectSaveHandlerTest
  605. [INFO] Running org.openmrs.api.handler.PatientDataUnvoidHandlerTest
  606. [INFO] Tests run: 3, Failures: 0, Errors: 0, Skipped: 0, Time elapsed: 4.861 s - in org.openmrs.api.handler.PatientDataUnvoidHandlerTest
  607. [INFO] Running org.openmrs.api.handler.PatientDataVoidHandlerTest
  608. [ERROR] Tests run: 2, Failures: 1, Errors: 0, Skipped: 0, Time elapsed: 3.194 s <<< FAILURE! - in org.openmrs.api.handler.PatientDataVoidHandlerTest
  609. [ERROR] handle_shouldVoidCohortMemberships Time elapsed: 2.14 s <<< FAILURE!
  610. org.opentest4j.AssertionFailedError: expected: <1> but was: <3>
  611. at org.openmrs.api.handler.PatientDataVoidHandlerTest.handle_shouldVoidCohortMemberships(PatientDataVoidHandlerTest.java:135)
  612.  
  613. [INFO] Running org.openmrs.api.handler.PersonSaveHandlerTest
  614. [INFO] Tests run: 1, Failures: 0, Errors: 0, Skipped: 0, Time elapsed: 2.221 s - in org.openmrs.api.handler.PersonSaveHandlerTest
  615. [INFO] Running org.openmrs.api.handler.PersonUnvoidHandlerTest
  616. [INFO] Tests run: 6, Failures: 0, Errors: 0, Skipped: 0, Time elapsed: 0.004 s - in org.openmrs.api.handler.PersonUnvoidHandlerTest
  617. [INFO] Running org.openmrs.api.handler.PersonVoidHandlerTest
  618. [INFO] Tests run: 8, Failures: 0, Errors: 0, Skipped: 0, Time elapsed: 2.194 s - in org.openmrs.api.handler.PersonVoidHandlerTest
  619. [INFO] Running org.openmrs.api.handler.RequiredReasonVoidSaveHandlerTest
  620. [INFO] Tests run: 5, Failures: 0, Errors: 0, Skipped: 0, Time elapsed: 2.433 s - in org.openmrs.api.handler.RequiredReasonVoidSaveHandlerTest
  621. [INFO] Running org.openmrs.api.handler.RequireVoidReasonVoidHandlerTest
  622. [INFO] Tests run: 5, Failures: 0, Errors: 0, Skipped: 0, Time elapsed: 2.444 s - in org.openmrs.api.handler.RequireVoidReasonVoidHandlerTest
  623. [INFO] Running org.openmrs.api.impl.ConceptServiceImplTest
  624. [INFO] Tests run: 63, Failures: 0, Errors: 0, Skipped: 0, Time elapsed: 3.37 s - in org.openmrs.api.impl.ConceptServiceImplTest
  625. [INFO] Running org.openmrs.api.impl.ConditionServiceImplTest
  626. [INFO] Tests run: 12, Failures: 0, Errors: 0, Skipped: 0, Time elapsed: 2.509 s - in org.openmrs.api.impl.ConditionServiceImplTest
  627. [INFO] Running org.openmrs.api.impl.DiagnosisServiceImplTest
  628. [INFO] Tests run: 11, Failures: 0, Errors: 0, Skipped: 0, Time elapsed: 3.032 s - in org.openmrs.api.impl.DiagnosisServiceImplTest
  629. [INFO] Running org.openmrs.api.impl.GlobalLocaleListTest
  630. [INFO] Tests run: 2, Failures: 0, Errors: 0, Skipped: 0, Time elapsed: 0.004 s - in org.openmrs.api.impl.GlobalLocaleListTest
  631. [INFO] Running org.openmrs.api.impl.PatientServiceImplTest
  632. [INFO] Tests run: 14, Failures: 0, Errors: 0, Skipped: 0, Time elapsed: 1.282 s - in org.openmrs.api.impl.PatientServiceImplTest
  633. [INFO] Running org.openmrs.api.impl.SerializationServiceImplTest
  634. [INFO] Tests run: 1, Failures: 0, Errors: 0, Skipped: 0, Time elapsed: 0.003 s - in org.openmrs.api.impl.SerializationServiceImplTest
  635. [INFO] Running org.openmrs.api.LocationServiceTest
  636. [INFO] Tests run: 70, Failures: 0, Errors: 0, Skipped: 0, Time elapsed: 9.017 s - in org.openmrs.api.LocationServiceTest
  637. [INFO] Running org.openmrs.api.ObsServiceTest
  638. [INFO] Tests run: 80, Failures: 0, Errors: 0, Skipped: 0, Time elapsed: 7.222 s - in org.openmrs.api.ObsServiceTest
  639. [INFO] Running org.openmrs.api.OpenmrsServiceTest
  640. [WARNING] Tests run: 1, Failures: 0, Errors: 0, Skipped: 1, Time elapsed: 0.244 s - in org.openmrs.api.OpenmrsServiceTest
  641. [INFO] Running org.openmrs.api.OrderServiceTest
  642. [WARNING] Tests run: 204, Failures: 0, Errors: 0, Skipped: 3, Time elapsed: 19.889 s - in org.openmrs.api.OrderServiceTest
  643. [INFO] Running org.openmrs.api.OrderSetServiceTest
  644. [INFO] Tests run: 21, Failures: 0, Errors: 0, Skipped: 0, Time elapsed: 3.908 s - in org.openmrs.api.OrderSetServiceTest
  645. [INFO] Running org.openmrs.api.PatientServiceAllergyTest
  646. [INFO] Tests run: 16, Failures: 0, Errors: 0, Skipped: 0, Time elapsed: 4.162 s - in org.openmrs.api.PatientServiceAllergyTest
  647. [INFO] Running org.openmrs.api.PatientServiceTest
  648. [WARNING] Tests run: 169, Failures: 0, Errors: 0, Skipped: 1, Time elapsed: 149.719 s - in org.openmrs.api.PatientServiceTest
  649. [INFO] Running org.openmrs.api.PersonServiceTest
  650. [INFO] Tests run: 148, Failures: 0, Errors: 0, Skipped: 0, Time elapsed: 12.928 s - in org.openmrs.api.PersonServiceTest
  651. [INFO] Running org.openmrs.api.ProgramWorkflowServiceTest
  652. [INFO] Tests run: 63, Failures: 0, Errors: 0, Skipped: 0, Time elapsed: 13.138 s - in org.openmrs.api.ProgramWorkflowServiceTest
  653. [INFO] Running org.openmrs.api.ProgramWorkflowServiceUnitTest
  654. [INFO] Tests run: 12, Failures: 0, Errors: 0, Skipped: 0, Time elapsed: 0.03 s - in org.openmrs.api.ProgramWorkflowServiceUnitTest
  655. [INFO] Running org.openmrs.api.ProviderServiceTest
  656. [INFO] Tests run: 40, Failures: 0, Errors: 0, Skipped: 0, Time elapsed: 5.825 s - in org.openmrs.api.ProviderServiceTest
  657. [INFO] Running org.openmrs.api.UserServiceTest
  658. [WARNING] Tests run: 109, Failures: 0, Errors: 0, Skipped: 1, Time elapsed: 21.987 s - in org.openmrs.api.UserServiceTest
  659. [INFO] Running org.openmrs.api.VisitServiceTest
  660. [INFO] Tests run: 68, Failures: 0, Errors: 0, Skipped: 0, Time elapsed: 5.059 s - in org.openmrs.api.VisitServiceTest
  661. [INFO] Running org.openmrs.attribute.AttributeIntegrationTest
  662. [INFO] Tests run: 1, Failures: 0, Errors: 0, Skipped: 0, Time elapsed: 2.231 s - in org.openmrs.attribute.AttributeIntegrationTest
  663. [INFO] Running org.openmrs.BaseCustomizableMetadataTest
  664. [INFO] Tests run: 2, Failures: 0, Errors: 0, Skipped: 0, Time elapsed: 2.369 s - in org.openmrs.BaseCustomizableMetadataTest
  665. [INFO] Running org.openmrs.BaseFormRecordableOpenmrsDataTest
  666. [INFO] Tests run: 10, Failures: 0, Errors: 0, Skipped: 0, Time elapsed: 0.005 s - in org.openmrs.BaseFormRecordableOpenmrsDataTest
  667. [INFO] Running org.openmrs.BaseOpenmrsObjectTest
  668. [INFO] Tests run: 20, Failures: 0, Errors: 0, Skipped: 0, Time elapsed: 2.204 s - in org.openmrs.BaseOpenmrsObjectTest
  669. [INFO] Running org.openmrs.CohortMembershipTest
  670. [INFO] Tests run: 21, Failures: 0, Errors: 0, Skipped: 0, Time elapsed: 0.004 s - in org.openmrs.CohortMembershipTest
  671. [INFO] Running org.openmrs.CohortTest
  672. [INFO] Tests run: 15, Failures: 0, Errors: 0, Skipped: 0, Time elapsed: 0.411 s - in org.openmrs.CohortTest
  673. [INFO] Running org.openmrs.comparator.PatientIdentifierTypeDefaultComparatorTest
  674. [INFO] Tests run: 1, Failures: 0, Errors: 0, Skipped: 0, Time elapsed: 0.003 s - in org.openmrs.comparator.PatientIdentifierTypeDefaultComparatorTest
  675. [INFO] Running org.openmrs.ConceptComponentTest
  676. [INFO] Tests run: 1, Failures: 0, Errors: 0, Skipped: 0, Time elapsed: 2.254 s - in org.openmrs.ConceptComponentTest
  677. [INFO] Running org.openmrs.ConceptNumericTest
  678. [INFO] Tests run: 8, Failures: 0, Errors: 0, Skipped: 0, Time elapsed: 2.108 s - in org.openmrs.ConceptNumericTest
  679. [INFO] Running org.openmrs.ConceptReferenceTermTest
  680. [INFO] Tests run: 3, Failures: 0, Errors: 0, Skipped: 0, Time elapsed: 0.005 s - in org.openmrs.ConceptReferenceTermTest
  681. [INFO] Running org.openmrs.ConceptTest
  682. [INFO] Tests run: 73, Failures: 0, Errors: 0, Skipped: 0, Time elapsed: 2.965 s - in org.openmrs.ConceptTest
  683. [INFO] Running org.openmrs.customdatatype.CustomDatatypeUtilTest
  684. [INFO] Tests run: 1, Failures: 0, Errors: 0, Skipped: 0, Time elapsed: 2.098 s - in org.openmrs.customdatatype.CustomDatatypeUtilTest
  685. [INFO] Running org.openmrs.customdatatype.datatype.BaseMetadataDatatypeTest
  686. [INFO] Tests run: 1, Failures: 0, Errors: 0, Skipped: 0, Time elapsed: 0.004 s - in org.openmrs.customdatatype.datatype.BaseMetadataDatatypeTest
  687. [INFO] Running org.openmrs.customdatatype.datatype.BaseOpenmrsDatatypeTest
  688. [INFO] Tests run: 1, Failures: 0, Errors: 0, Skipped: 0, Time elapsed: 0.003 s - in org.openmrs.customdatatype.datatype.BaseOpenmrsDatatypeTest
  689. [INFO] Running org.openmrs.customdatatype.datatype.DateDatatypeTest
  690. [INFO] Tests run: 2, Failures: 0, Errors: 0, Skipped: 0, Time elapsed: 0.005 s - in org.openmrs.customdatatype.datatype.DateDatatypeTest
  691. [INFO] Running org.openmrs.customdatatype.datatype.RegexValidatedTextTest
  692. [INFO] Tests run: 3, Failures: 0, Errors: 0, Skipped: 0, Time elapsed: 0.005 s - in org.openmrs.customdatatype.datatype.RegexValidatedTextTest
  693. [INFO] Running org.openmrs.DrugOrderTest
  694. [INFO] Tests run: 22, Failures: 0, Errors: 0, Skipped: 0, Time elapsed: 0.227 s - in org.openmrs.DrugOrderTest
  695. [INFO] Running org.openmrs.DrugTest
  696. [INFO] Tests run: 2, Failures: 0, Errors: 0, Skipped: 0, Time elapsed: 2.144 s - in org.openmrs.DrugTest
  697. [INFO] Running org.openmrs.DurationTest
  698. [INFO] Tests run: 11, Failures: 0, Errors: 0, Skipped: 0, Time elapsed: 2.272 s - in org.openmrs.DurationTest
  699. [INFO] Running org.openmrs.EncounterProviderTest
  700. [INFO] Tests run: 1, Failures: 0, Errors: 0, Skipped: 0, Time elapsed: 0.006 s - in org.openmrs.EncounterProviderTest
  701. [INFO] Running org.openmrs.EncounterRoleTest
  702. [INFO] Tests run: 1, Failures: 0, Errors: 0, Skipped: 0, Time elapsed: 0.002 s - in org.openmrs.EncounterRoleTest
  703. [INFO] Running org.openmrs.EncounterTest
  704. [INFO] Tests run: 66, Failures: 0, Errors: 0, Skipped: 0, Time elapsed: 0.251 s - in org.openmrs.EncounterTest
  705. [INFO] Running org.openmrs.EncounterTypeTest
  706. [INFO] Tests run: 1, Failures: 0, Errors: 0, Skipped: 0, Time elapsed: 0.002 s - in org.openmrs.EncounterTypeTest
  707. [INFO] Running org.openmrs.FormTest
  708. [INFO] Tests run: 1, Failures: 0, Errors: 0, Skipped: 0, Time elapsed: 0.003 s - in org.openmrs.FormTest
  709. [INFO] Running org.openmrs.hl7.handler.ORUR01HandlerTest
  710. [INFO] Tests run: 39, Failures: 0, Errors: 0, Skipped: 0, Time elapsed: 12.306 s - in org.openmrs.hl7.handler.ORUR01HandlerTest
  711. [INFO] Running org.openmrs.hl7.HL7ServiceTest
  712. [WARNING] Tests run: 29, Failures: 0, Errors: 0, Skipped: 2, Time elapsed: 5.335 s - in org.openmrs.hl7.HL7ServiceTest
  713. [INFO] Running org.openmrs.hl7.HL7UtilTest
  714. [INFO] Tests run: 5, Failures: 0, Errors: 0, Skipped: 0, Time elapsed: 0.005 s - in org.openmrs.hl7.HL7UtilTest
  715. [INFO] Running org.openmrs.layout.name.NameTemplateTest
  716. [INFO] Tests run: 2, Failures: 0, Errors: 0, Skipped: 0, Time elapsed: 2.051 s - in org.openmrs.layout.name.NameTemplateTest
  717. [INFO] Running org.openmrs.liquibase.ChangeLogDetectiveTest
  718. [INFO] Tests run: 11, Failures: 0, Errors: 0, Skipped: 0, Time elapsed: 0.156 s - in org.openmrs.liquibase.ChangeLogDetectiveTest
  719. [INFO] Running org.openmrs.liquibase.ChangeLogVersionFinderTest
  720. [INFO] Tests run: 15, Failures: 0, Errors: 0, Skipped: 0, Time elapsed: 0.038 s - in org.openmrs.liquibase.ChangeLogVersionFinderTest
  721. [INFO] Running org.openmrs.liquibase.ChangeLogVersionsTest
  722. [INFO] Tests run: 3, Failures: 0, Errors: 0, Skipped: 0, Time elapsed: 1.058 s - in org.openmrs.liquibase.ChangeLogVersionsTest
  723. [INFO] Running org.openmrs.LocationTest
  724. [INFO] Tests run: 3, Failures: 0, Errors: 0, Skipped: 0, Time elapsed: 0.003 s - in org.openmrs.LocationTest
  725. [INFO] Running org.openmrs.logic.result.EmptyResultTest
  726. [INFO] Tests run: 2, Failures: 0, Errors: 0, Skipped: 0, Time elapsed: 0.003 s - in org.openmrs.logic.result.EmptyResultTest
  727. [INFO] Running org.openmrs.logic.result.ResultTest
  728. [INFO] Tests run: 17, Failures: 0, Errors: 0, Skipped: 0, Time elapsed: 0.004 s - in org.openmrs.logic.result.ResultTest
  729. [INFO] Running org.openmrs.messagesource.impl.CachedMessageSourceTest
  730. [INFO] Tests run: 2, Failures: 0, Errors: 0, Skipped: 0, Time elapsed: 0.003 s - in org.openmrs.messagesource.impl.CachedMessageSourceTest
  731. [INFO] Running org.openmrs.messagesource.impl.DefaultMessageSourceServiceImplTest
  732. [INFO] Tests run: 1, Failures: 0, Errors: 0, Skipped: 0, Time elapsed: 0.003 s - in org.openmrs.messagesource.impl.DefaultMessageSourceServiceImplTest
  733. [INFO] Running org.openmrs.messagesource.MessageSourceServiceTest
  734. [INFO] Tests run: 1, Failures: 0, Errors: 0, Skipped: 0, Time elapsed: 2.197 s - in org.openmrs.messagesource.MessageSourceServiceTest
  735. [INFO] Running org.openmrs.messagesource.PresentationMessageMapTest
  736. [INFO] Tests run: 2, Failures: 0, Errors: 0, Skipped: 0, Time elapsed: 0.004 s - in org.openmrs.messagesource.PresentationMessageMapTest
  737. [INFO] Running org.openmrs.module.ModuleActivatorTest
  738. [INFO] Tests run: 11, Failures: 0, Errors: 0, Skipped: 0, Time elapsed: 8.119 s - in org.openmrs.module.ModuleActivatorTest
  739. [INFO] Running org.openmrs.module.ModuleClassLoaderTest
  740. [INFO] Tests run: 10, Failures: 0, Errors: 0, Skipped: 0, Time elapsed: 2.252 s - in org.openmrs.module.ModuleClassLoaderTest
  741. [INFO] Running org.openmrs.module.ModuleExtensionsTest
  742. [INFO] Tests run: 10, Failures: 0, Errors: 0, Skipped: 0, Time elapsed: 0.086 s - in org.openmrs.module.ModuleExtensionsTest
  743. [INFO] Running org.openmrs.module.ModuleFactoryTest
  744. [INFO] Tests run: 9, Failures: 0, Errors: 0, Skipped: 0, Time elapsed: 2.902 s - in org.openmrs.module.ModuleFactoryTest
  745. [INFO] Running org.openmrs.module.ModuleFileParserTest
  746. [INFO] Tests run: 6, Failures: 0, Errors: 0, Skipped: 0, Time elapsed: 2.148 s - in org.openmrs.module.ModuleFileParserTest
  747. [INFO] Running org.openmrs.module.ModuleFileParserUnitTest
  748. [Fatal Error] :1:67: XML document structures must start and end within the same entity.
  749. [Fatal Error] :-1:-1: Premature end of file.
  750. [INFO] Tests run: 73, Failures: 0, Errors: 0, Skipped: 0, Time elapsed: 1.019 s - in org.openmrs.module.ModuleFileParserUnitTest
  751. [INFO] Running org.openmrs.module.ModuleInteroperabilityTest
  752. [INFO] Tests run: 1, Failures: 0, Errors: 0, Skipped: 0, Time elapsed: 1.488 s - in org.openmrs.module.ModuleInteroperabilityTest
  753. [INFO] Running org.openmrs.module.ModuleTest
  754. [INFO] Tests run: 9, Failures: 0, Errors: 0, Skipped: 0, Time elapsed: 0.003 s - in org.openmrs.module.ModuleTest
  755. [INFO] Running org.openmrs.module.ModuleUtilTest
  756. [INFO] Tests run: 56, Failures: 0, Errors: 0, Skipped: 0, Time elapsed: 3.149 s - in org.openmrs.module.ModuleUtilTest
  757. [INFO] Running org.openmrs.module.UpdateFileParserTest
  758. [INFO] Tests run: 3, Failures: 0, Errors: 0, Skipped: 0, Time elapsed: 0.005 s - in org.openmrs.module.UpdateFileParserTest
  759. [INFO] Running org.openmrs.module.VersionComparatorTest
  760. [INFO] Tests run: 1, Failures: 0, Errors: 0, Skipped: 0, Time elapsed: 0.003 s - in org.openmrs.module.VersionComparatorTest
  761. [INFO] Running org.openmrs.notification.AlertServiceTest
  762. [INFO] Tests run: 3, Failures: 0, Errors: 0, Skipped: 0, Time elapsed: 2.133 s - in org.openmrs.notification.AlertServiceTest
  763. [INFO] Running org.openmrs.notification.db.hibernate.HibernateAlertDAOTest
  764. [INFO] Tests run: 5, Failures: 0, Errors: 0, Skipped: 0, Time elapsed: 2.225 s - in org.openmrs.notification.db.hibernate.HibernateAlertDAOTest
  765. [INFO] Running org.openmrs.notification.MessageTest
  766. [INFO] Tests run: 4, Failures: 0, Errors: 0, Skipped: 0, Time elapsed: 0.002 s - in org.openmrs.notification.MessageTest
  767. [INFO] Running org.openmrs.obs.AbstractHandlerTest
  768. [INFO] Tests run: 4, Failures: 0, Errors: 0, Skipped: 0, Time elapsed: 2.63 s - in org.openmrs.obs.AbstractHandlerTest
  769. [INFO] Running org.openmrs.obs.BinaryDataHandlerTest
  770. [INFO] Tests run: 4, Failures: 0, Errors: 0, Skipped: 0, Time elapsed: 2.07 s - in org.openmrs.obs.BinaryDataHandlerTest
  771. [INFO] Running org.openmrs.obs.BinaryStreamHandlerTest
  772. [WARNING] Tests run: 4, Failures: 0, Errors: 0, Skipped: 1, Time elapsed: 2.505 s - in org.openmrs.obs.BinaryStreamHandlerTest
  773. [INFO] Running org.openmrs.obs.ImageHandlerTest
  774. [INFO] Tests run: 5, Failures: 0, Errors: 0, Skipped: 0, Time elapsed: 2.421 s - in org.openmrs.obs.ImageHandlerTest
  775. [INFO] Running org.openmrs.obs.MediaHandlerTest
  776. [WARNING] Tests run: 4, Failures: 0, Errors: 0, Skipped: 1, Time elapsed: 2.211 s - in org.openmrs.obs.MediaHandlerTest
  777. [INFO] Running org.openmrs.obs.TextHandlerTest
  778. [INFO] Tests run: 4, Failures: 0, Errors: 0, Skipped: 0, Time elapsed: 2.15 s - in org.openmrs.obs.TextHandlerTest
  779. [INFO] Running org.openmrs.ObsBehaviorTest
  780. [WARNING] Tests run: 3, Failures: 0, Errors: 0, Skipped: 1, Time elapsed: 2.238 s - in org.openmrs.ObsBehaviorTest
  781. [INFO] Running org.openmrs.ObsTest
  782. [INFO] Tests run: 48, Failures: 0, Errors: 0, Skipped: 0, Time elapsed: 0.029 s - in org.openmrs.ObsTest
  783. [INFO] Running org.openmrs.OpenmrsTestAnnotationsTest
  784. [INFO] Tests run: 2, Failures: 0, Errors: 0, Skipped: 0, Time elapsed: 2.542 s - in org.openmrs.OpenmrsTestAnnotationsTest
  785. [INFO] Running org.openmrs.OpenmrsTestsTest
  786. [INFO] Tests run: 5, Failures: 0, Errors: 0, Skipped: 0, Time elapsed: 0.535 s - in org.openmrs.OpenmrsTestsTest
  787. [INFO] Running org.openmrs.order.OrderUtilTest
  788. [INFO] Tests run: 15, Failures: 0, Errors: 0, Skipped: 0, Time elapsed: 0.003 s - in org.openmrs.order.OrderUtilTest
  789. [INFO] Running org.openmrs.OrderEntryIntegrationTest
  790. [INFO] Tests run: 15, Failures: 0, Errors: 0, Skipped: 0, Time elapsed: 4.149 s - in org.openmrs.OrderEntryIntegrationTest
  791. [INFO] Running org.openmrs.OrderGroupTest
  792. [INFO] Tests run: 3, Failures: 0, Errors: 0, Skipped: 0, Time elapsed: 0.002 s - in org.openmrs.OrderGroupTest
  793. [INFO] Running org.openmrs.OrderTest
  794. [INFO] Tests run: 64, Failures: 0, Errors: 0, Skipped: 0, Time elapsed: 2.833 s - in org.openmrs.OrderTest
  795. [INFO] Running org.openmrs.OrderTypeTest
  796. [INFO] Tests run: 3, Failures: 0, Errors: 0, Skipped: 0, Time elapsed: 0.004 s - in org.openmrs.OrderTypeTest
  797. [INFO] Running org.openmrs.patient.impl.LuhnIdentifierValidatorTest
  798. [INFO] Tests run: 3, Failures: 0, Errors: 0, Skipped: 0, Time elapsed: 0.005 s - in org.openmrs.patient.impl.LuhnIdentifierValidatorTest
  799. [INFO] Running org.openmrs.patient.impl.VerhoeffIdentifierValidatorTest
  800. [INFO] Tests run: 8, Failures: 0, Errors: 0, Skipped: 0, Time elapsed: 0.004 s - in org.openmrs.patient.impl.VerhoeffIdentifierValidatorTest
  801. [INFO] Running org.openmrs.PatientProgramTest
  802. [INFO] Tests run: 5, Failures: 0, Errors: 0, Skipped: 0, Time elapsed: 0.002 s - in org.openmrs.PatientProgramTest
  803. [INFO] Running org.openmrs.PatientStateTest
  804. [INFO] Tests run: 13, Failures: 0, Errors: 0, Skipped: 0, Time elapsed: 0.002 s - in org.openmrs.PatientStateTest
  805. [INFO] Running org.openmrs.PatientTest
  806. [INFO] Tests run: 9, Failures: 0, Errors: 0, Skipped: 0, Time elapsed: 0.002 s - in org.openmrs.PatientTest
  807. [INFO] Running org.openmrs.PersonAddressTest
  808. [INFO] Tests run: 15, Failures: 0, Errors: 0, Skipped: 0, Time elapsed: 0.002 s - in org.openmrs.PersonAddressTest
  809. [INFO] Running org.openmrs.PersonAttributeTest
  810. [INFO] Tests run: 6, Failures: 0, Errors: 0, Skipped: 0, Time elapsed: 2.062 s - in org.openmrs.PersonAttributeTest
  811. [INFO] Running org.openmrs.PersonNameTest
  812. [INFO] Tests run: 19, Failures: 0, Errors: 0, Skipped: 0, Time elapsed: 0.01 s - in org.openmrs.PersonNameTest
  813. [INFO] Running org.openmrs.PersonTest
  814. [INFO] Tests run: 36, Failures: 0, Errors: 0, Skipped: 0, Time elapsed: 3.051 s - in org.openmrs.PersonTest
  815. [INFO] Running org.openmrs.propertyeditor.CohortEditorTest
  816. [INFO] Tests run: 8, Failures: 0, Errors: 0, Skipped: 0, Time elapsed: 2.851 s - in org.openmrs.propertyeditor.CohortEditorTest
  817. [INFO] Running org.openmrs.propertyeditor.ConceptAnswerEditorTest
  818. [INFO] Tests run: 8, Failures: 0, Errors: 0, Skipped: 0, Time elapsed: 2.563 s - in org.openmrs.propertyeditor.ConceptAnswerEditorTest
  819. [INFO] Running org.openmrs.propertyeditor.ConceptAnswersEditorTest
  820. [INFO] Tests run: 1, Failures: 0, Errors: 0, Skipped: 0, Time elapsed: 2.112 s - in org.openmrs.propertyeditor.ConceptAnswersEditorTest
  821. [INFO] Running org.openmrs.propertyeditor.ConceptAttributeTypeEditorTest
  822. [INFO] Tests run: 8, Failures: 0, Errors: 0, Skipped: 0, Time elapsed: 3.207 s - in org.openmrs.propertyeditor.ConceptAttributeTypeEditorTest
  823. [INFO] Running org.openmrs.propertyeditor.ConceptClassEditorTest
  824. [INFO] Tests run: 8, Failures: 0, Errors: 0, Skipped: 0, Time elapsed: 2.77 s - in org.openmrs.propertyeditor.ConceptClassEditorTest
  825. [INFO] Running org.openmrs.propertyeditor.ConceptDatatypeEditorTest
  826. [INFO] Tests run: 8, Failures: 0, Errors: 0, Skipped: 0, Time elapsed: 2.433 s - in org.openmrs.propertyeditor.ConceptDatatypeEditorTest
  827. [INFO] Running org.openmrs.propertyeditor.ConceptEditorTest
  828. [INFO] Tests run: 8, Failures: 0, Errors: 0, Skipped: 0, Time elapsed: 2.257 s - in org.openmrs.propertyeditor.ConceptEditorTest
  829. [INFO] Running org.openmrs.propertyeditor.ConceptMapTypeEditorTest
  830. [INFO] Tests run: 8, Failures: 0, Errors: 0, Skipped: 0, Time elapsed: 2.011 s - in org.openmrs.propertyeditor.ConceptMapTypeEditorTest
  831. [INFO] Running org.openmrs.propertyeditor.ConceptNameEditorTest
  832. [INFO] Tests run: 8, Failures: 0, Errors: 0, Skipped: 0, Time elapsed: 2.245 s - in org.openmrs.propertyeditor.ConceptNameEditorTest
  833. [INFO] Running org.openmrs.propertyeditor.ConceptNumericEditorTest
  834. [INFO] Tests run: 8, Failures: 0, Errors: 0, Skipped: 0, Time elapsed: 2.268 s - in org.openmrs.propertyeditor.ConceptNumericEditorTest
  835. [INFO] Running org.openmrs.propertyeditor.ConceptReferenceTermEditorTest
  836. [INFO] Tests run: 8, Failures: 0, Errors: 0, Skipped: 0, Time elapsed: 2.214 s - in org.openmrs.propertyeditor.ConceptReferenceTermEditorTest
  837. [INFO] Running org.openmrs.propertyeditor.ConceptSourceEditorTest
  838. [INFO] Tests run: 8, Failures: 0, Errors: 0, Skipped: 0, Time elapsed: 2.096 s - in org.openmrs.propertyeditor.ConceptSourceEditorTest
  839. [INFO] Running org.openmrs.propertyeditor.DateOrDatetimeEditorTest
  840. [INFO] Tests run: 6, Failures: 0, Errors: 0, Skipped: 0, Time elapsed: 0.005 s - in org.openmrs.propertyeditor.DateOrDatetimeEditorTest
  841. [INFO] Running org.openmrs.propertyeditor.DrugEditorTest
  842. [INFO] Tests run: 8, Failures: 0, Errors: 0, Skipped: 0, Time elapsed: 2.191 s - in org.openmrs.propertyeditor.DrugEditorTest
  843. [INFO] Running org.openmrs.propertyeditor.EncounterEditorTest
  844. [INFO] Tests run: 8, Failures: 0, Errors: 0, Skipped: 0, Time elapsed: 2.171 s - in org.openmrs.propertyeditor.EncounterEditorTest
  845. [INFO] Running org.openmrs.propertyeditor.EncounterTypeEditorTest
  846. [INFO] Tests run: 8, Failures: 0, Errors: 0, Skipped: 0, Time elapsed: 2.345 s - in org.openmrs.propertyeditor.EncounterTypeEditorTest
  847. [INFO] Running org.openmrs.propertyeditor.FormEditorTest
  848. [INFO] Tests run: 8, Failures: 0, Errors: 0, Skipped: 0, Time elapsed: 2.247 s - in org.openmrs.propertyeditor.FormEditorTest
  849. [INFO] Running org.openmrs.propertyeditor.LocationAttributeTypeEditorTest
  850. [INFO] Tests run: 8, Failures: 0, Errors: 0, Skipped: 0, Time elapsed: 2.288 s - in org.openmrs.propertyeditor.LocationAttributeTypeEditorTest
  851. [INFO] Running org.openmrs.propertyeditor.LocationEditorTest
  852. [INFO] Tests run: 8, Failures: 0, Errors: 0, Skipped: 0, Time elapsed: 2.189 s - in org.openmrs.propertyeditor.LocationEditorTest
  853. [INFO] Running org.openmrs.propertyeditor.LocationTagEditorTest
  854. [INFO] Tests run: 8, Failures: 0, Errors: 0, Skipped: 0, Time elapsed: 2.824 s - in org.openmrs.propertyeditor.LocationTagEditorTest
  855. [INFO] Running org.openmrs.propertyeditor.OrderEditorTest
  856. [INFO] Tests run: 8, Failures: 0, Errors: 0, Skipped: 0, Time elapsed: 2.19 s - in org.openmrs.propertyeditor.OrderEditorTest
  857. [INFO] Running org.openmrs.propertyeditor.PatientEditorTest
  858. [INFO] Tests run: 8, Failures: 0, Errors: 0, Skipped: 0, Time elapsed: 2.281 s - in org.openmrs.propertyeditor.PatientEditorTest
  859. [INFO] Running org.openmrs.propertyeditor.PatientIdentifierTypeEditorTest
  860. [INFO] Tests run: 8, Failures: 0, Errors: 0, Skipped: 0, Time elapsed: 2.292 s - in org.openmrs.propertyeditor.PatientIdentifierTypeEditorTest
  861. [INFO] Running org.openmrs.propertyeditor.PersonAttributeEditorTest
  862. [INFO] Tests run: 8, Failures: 0, Errors: 0, Skipped: 0, Time elapsed: 2.018 s - in org.openmrs.propertyeditor.PersonAttributeEditorTest
  863. [INFO] Running org.openmrs.propertyeditor.PersonAttributeTypeEditorTest
  864. [INFO] Tests run: 8, Failures: 0, Errors: 0, Skipped: 0, Time elapsed: 1.993 s - in org.openmrs.propertyeditor.PersonAttributeTypeEditorTest
  865. [INFO] Running org.openmrs.propertyeditor.PersonEditorTest
  866. [INFO] Tests run: 8, Failures: 0, Errors: 0, Skipped: 0, Time elapsed: 2.033 s - in org.openmrs.propertyeditor.PersonEditorTest
  867. [INFO] Running org.openmrs.propertyeditor.PrivilegeEditorTest
  868. [INFO] Tests run: 2, Failures: 0, Errors: 0, Skipped: 0, Time elapsed: 2.346 s - in org.openmrs.propertyeditor.PrivilegeEditorTest
  869. [INFO] Running org.openmrs.propertyeditor.ProgramEditorTest
  870. [INFO] Tests run: 4, Failures: 0, Errors: 0, Skipped: 0, Time elapsed: 1.966 s - in org.openmrs.propertyeditor.ProgramEditorTest
  871. [INFO] Running org.openmrs.propertyeditor.ProgramWorkflowEditorTest
  872. [INFO] Tests run: 8, Failures: 0, Errors: 0, Skipped: 0, Time elapsed: 3.183 s - in org.openmrs.propertyeditor.ProgramWorkflowEditorTest
  873. [INFO] Running org.openmrs.propertyeditor.ProgramWorkflowStateEditorTest
  874. [INFO] Tests run: 8, Failures: 0, Errors: 0, Skipped: 0, Time elapsed: 2.279 s - in org.openmrs.propertyeditor.ProgramWorkflowStateEditorTest
  875. [INFO] Running org.openmrs.propertyeditor.ProviderEditorTest
  876. [WARNING] Tests run: 8, Failures: 0, Errors: 0, Skipped: 1, Time elapsed: 2.21 s - in org.openmrs.propertyeditor.ProviderEditorTest
  877. [INFO] Running org.openmrs.propertyeditor.RoleEditorTest
  878. [INFO] Tests run: 2, Failures: 0, Errors: 0, Skipped: 0, Time elapsed: 2.324 s - in org.openmrs.propertyeditor.RoleEditorTest
  879. [INFO] Running org.openmrs.propertyeditor.UserEditorTest
  880. [INFO] Tests run: 8, Failures: 0, Errors: 0, Skipped: 0, Time elapsed: 2.223 s - in org.openmrs.propertyeditor.UserEditorTest
  881. [INFO] Running org.openmrs.propertyeditor.VisitEditorTest
  882. [INFO] Tests run: 8, Failures: 0, Errors: 0, Skipped: 0, Time elapsed: 2.082 s - in org.openmrs.propertyeditor.VisitEditorTest
  883. [INFO] Running org.openmrs.propertyeditor.VisitTypeEditorTest
  884. [INFO] Tests run: 8, Failures: 0, Errors: 0, Skipped: 0, Time elapsed: 2.202 s - in org.openmrs.propertyeditor.VisitTypeEditorTest
  885. [INFO] Running org.openmrs.propertyeditor.WorkflowCollectionEditorTest
  886. [INFO] Tests run: 1, Failures: 0, Errors: 0, Skipped: 0, Time elapsed: 2.066 s - in org.openmrs.propertyeditor.WorkflowCollectionEditorTest
  887. [INFO] Running org.openmrs.ProviderTest
  888. [INFO] Tests run: 2, Failures: 0, Errors: 0, Skipped: 0, Time elapsed: 0.002 s - in org.openmrs.ProviderTest
  889. [INFO] Running org.openmrs.RoleTest
  890. [INFO] Tests run: 8, Failures: 0, Errors: 0, Skipped: 0, Time elapsed: 0.002 s - in org.openmrs.RoleTest
  891. [INFO] Running org.openmrs.scheduler.SchedulerServiceTest
  892. [WARNING] Tests run: 1, Failures: 0, Errors: 0, Skipped: 1, Time elapsed: 0.003 s - in org.openmrs.scheduler.SchedulerServiceTest
  893. [INFO] Running org.openmrs.scheduler.SchedulerUtilTest
  894. [INFO] Tests run: 1, Failures: 0, Errors: 0, Skipped: 0, Time elapsed: 0.003 s - in org.openmrs.scheduler.SchedulerUtilTest
  895. [INFO] Running org.openmrs.scheduler.timer.TimerSchedulerServiceImplTest
  896. [INFO] Tests run: 1, Failures: 0, Errors: 0, Skipped: 0, Time elapsed: 2.144 s - in org.openmrs.scheduler.timer.TimerSchedulerServiceImplTest
  897. [INFO] Running org.openmrs.serialization.JavaSerializationTest
  898. [INFO] Tests run: 2, Failures: 0, Errors: 0, Skipped: 0, Time elapsed: 0.007 s - in org.openmrs.serialization.JavaSerializationTest
  899. [INFO] Running org.openmrs.serialization.SimpleXStreamSerializerTest
  900. Security framework of XStream not explicitly initialized, using predefined black list on your own risk.
  901. Security framework of XStream not explicitly initialized, using predefined black list on your own risk.
  902. Security framework of XStream not explicitly initialized, using predefined black list on your own risk.
  903. [INFO] Tests run: 5, Failures: 0, Errors: 0, Skipped: 0, Time elapsed: 0.037 s - in org.openmrs.serialization.SimpleXStreamSerializerTest
  904. [INFO] Running org.openmrs.SimpleDosingInstructionsTest
  905. [INFO] Tests run: 10, Failures: 0, Errors: 0, Skipped: 0, Time elapsed: 2.329 s - in org.openmrs.SimpleDosingInstructionsTest
  906. [INFO] Running org.openmrs.test.matchers.HasFieldErrorsTest
  907. [INFO] Tests run: 13, Failures: 0, Errors: 0, Skipped: 0, Time elapsed: 0.004 s - in org.openmrs.test.matchers.HasFieldErrorsTest
  908. [INFO] Running org.openmrs.test.matchers.HasGlobalErrorsTest
  909. [INFO] Tests run: 7, Failures: 0, Errors: 0, Skipped: 0, Time elapsed: 0.003 s - in org.openmrs.test.matchers.HasGlobalErrorsTest
  910. [INFO] Running org.openmrs.TestOrderTest
  911. [INFO] Tests run: 4, Failures: 0, Errors: 0, Skipped: 0, Time elapsed: 0.003 s - in org.openmrs.TestOrderTest
  912. [INFO] Running org.openmrs.UserTest
  913. [INFO] Tests run: 9, Failures: 0, Errors: 0, Skipped: 0, Time elapsed: 0.084 s - in org.openmrs.UserTest
  914. [INFO] Running org.openmrs.util.databasechange.ClassLoaderFileOpenerTest
  915. [INFO] Tests run: 3, Failures: 0, Errors: 0, Skipped: 0, Time elapsed: 0.004 s - in org.openmrs.util.databasechange.ClassLoaderFileOpenerTest
  916. [INFO] Running org.openmrs.util.DatabaseUpdaterTest
  917. [INFO] Tests run: 5, Failures: 0, Errors: 0, Skipped: 0, Time elapsed: 12.02 s - in org.openmrs.util.DatabaseUpdaterTest
  918. [INFO] Running org.openmrs.util.DateUtilTest
  919. [INFO] Tests run: 1, Failures: 0, Errors: 0, Skipped: 0, Time elapsed: 0.003 s - in org.openmrs.util.DateUtilTest
  920. [INFO] Running org.openmrs.util.DoubleRangeTest
  921. [INFO] Tests run: 28, Failures: 0, Errors: 0, Skipped: 0, Time elapsed: 0.004 s - in org.openmrs.util.DoubleRangeTest
  922. [INFO] Running org.openmrs.util.DrugsByNameComparatorTest
  923. [INFO] Tests run: 4, Failures: 0, Errors: 0, Skipped: 0, Time elapsed: 0.003 s - in org.openmrs.util.DrugsByNameComparatorTest
  924. [INFO] Running org.openmrs.util.ExceptionUtilTest
  925. [INFO] Tests run: 1, Failures: 0, Errors: 0, Skipped: 0, Time elapsed: 0.002 s - in org.openmrs.util.ExceptionUtilTest
  926. [INFO] Running org.openmrs.util.FormatTest
  927. [INFO] Tests run: 8, Failures: 0, Errors: 0, Skipped: 0, Time elapsed: 0.003 s - in org.openmrs.util.FormatTest
  928. [INFO] Running org.openmrs.util.GraphTest
  929. [INFO] Tests run: 2, Failures: 0, Errors: 0, Skipped: 0, Time elapsed: 0.002 s - in org.openmrs.util.GraphTest
  930. [INFO] Running org.openmrs.util.HandlerUtilTest
  931. [INFO] Tests run: 6, Failures: 0, Errors: 0, Skipped: 0, Time elapsed: 2.199 s - in org.openmrs.util.HandlerUtilTest
  932. [INFO] Running org.openmrs.util.HttpClientTest
  933. [INFO] Tests run: 1, Failures: 0, Errors: 0, Skipped: 0, Time elapsed: 0.069 s - in org.openmrs.util.HttpClientTest
  934. [INFO] Running org.openmrs.util.HttpUrlTest
  935. [INFO] Tests run: 6, Failures: 0, Errors: 0, Skipped: 0, Time elapsed: 0.002 s - in org.openmrs.util.HttpUrlTest
  936. [INFO] Running org.openmrs.util.JavaVersionTest
  937. [INFO] Tests run: 1, Failures: 0, Errors: 0, Skipped: 0, Time elapsed: 0.003 s - in org.openmrs.util.JavaVersionTest
  938. [INFO] Running org.openmrs.util.LocaleUtilityTest
  939. [INFO] Tests run: 21, Failures: 0, Errors: 0, Skipped: 0, Time elapsed: 2.653 s - in org.openmrs.util.LocaleUtilityTest
  940. [INFO] Running org.openmrs.util.LocationUtilityTest
  941. [INFO] Tests run: 2, Failures: 0, Errors: 0, Skipped: 0, Time elapsed: 2.157 s - in org.openmrs.util.LocationUtilityTest
  942. [INFO] Running org.openmrs.util.Log4JCompatibilityTest
  943. [INFO] Tests run: 1, Failures: 0, Errors: 0, Skipped: 0, Time elapsed: 0.024 s - in org.openmrs.util.Log4JCompatibilityTest
  944. [INFO] Running org.openmrs.util.MemoryAppenderTest
  945. [INFO] Tests run: 3, Failures: 0, Errors: 0, Skipped: 0, Time elapsed: 0.048 s - in org.openmrs.util.MemoryAppenderTest
  946. [INFO] Running org.openmrs.util.NaturalStringsTest
  947. [INFO] Tests run: 40, Failures: 0, Errors: 0, Skipped: 0, Time elapsed: 0.011 s - in org.openmrs.util.NaturalStringsTest
  948. [INFO] Running org.openmrs.util.OpenmrsSecurityManagerTest
  949. [INFO] Tests run: 2, Failures: 0, Errors: 0, Skipped: 0, Time elapsed: 0.003 s - in org.openmrs.util.OpenmrsSecurityManagerTest
  950. [INFO] Running org.openmrs.util.OpenmrsUtilTest
  951. DEBUG - LoggingAdvice.invoke(115) |2021-02-22T21:08:46,797| In method AdministrationService.getGlobalProperty. Arguments: String=log.level, String=,
  952. DEBUG - LoggingAdvice.invoke(115) |2021-02-22T21:08:46,803| In method AdministrationService.getGlobalProperty. Arguments: String=log.level,
  953. DEBUG - LoggingAdvice.invoke(155) |2021-02-22T21:08:46,804| Exiting method getGlobalProperty. execution time: 2 ms
  954. DEBUG - LoggingAdvice.invoke(155) |2021-02-22T21:08:46,805| Exiting method getGlobalProperty. execution time: 8 ms
  955. WARN - OpenmrsUtil.applyLogLevel(637) |2021-02-22T21:08:48,107| Log level invalid string is invalid. Valid values are trace, debug, info, warn, error or fatal
  956. DEBUG - LoggingAdvice.invoke(115) |2021-02-22T21:08:50,013| In method AdministrationService.getGlobalProperty. Arguments: String=log.level, String=,
  957. DEBUG - LoggingAdvice.invoke(115) |2021-02-22T21:08:50,014| In method AdministrationService.getGlobalProperty. Arguments: String=log.level,
  958. DEBUG - LoggingAdvice.invoke(155) |2021-02-22T21:08:50,015| Exiting method getGlobalProperty. execution time: 1 ms
  959. DEBUG - LoggingAdvice.invoke(155) |2021-02-22T21:08:50,015| Exiting method getGlobalProperty. execution time: 4 ms
  960. [INFO] Tests run: 57, Failures: 0, Errors: 0, Skipped: 0, Time elapsed: 7.285 s - in org.openmrs.util.OpenmrsUtilTest
  961. [INFO] Running org.openmrs.util.OpenmrsUtilUnitTest
  962. [INFO] Tests run: 49, Failures: 0, Errors: 0, Skipped: 0, Time elapsed: 0.013 s - in org.openmrs.util.OpenmrsUtilUnitTest
  963. [INFO] Running org.openmrs.util.PersonByNameComparatorTest
  964. [INFO] Tests run: 4, Failures: 0, Errors: 0, Skipped: 0, Time elapsed: 0.003 s - in org.openmrs.util.PersonByNameComparatorTest
  965. [INFO] Running org.openmrs.util.ProviderByPersonNameComparatorTest
  966. [INFO] Tests run: 6, Failures: 0, Errors: 0, Skipped: 0, Time elapsed: 0.008 s - in org.openmrs.util.ProviderByPersonNameComparatorTest
  967. [INFO] Running org.openmrs.util.ReflectTest
  968. [INFO] Tests run: 18, Failures: 0, Errors: 0, Skipped: 0, Time elapsed: 0.004 s - in org.openmrs.util.ReflectTest
  969. [INFO] Running org.openmrs.util.SecurityTest
  970. [INFO] Tests run: 7, Failures: 0, Errors: 0, Skipped: 0, Time elapsed: 0.513 s - in org.openmrs.util.SecurityTest
  971. [INFO] Running org.openmrs.util.UpgradeUtilTest
  972. [INFO] Tests run: 2, Failures: 0, Errors: 0, Skipped: 0, Time elapsed: 2.312 s - in org.openmrs.util.UpgradeUtilTest
  973. [INFO] Running org.openmrs.util.UserByNameComparatorTest
  974. [INFO] Tests run: 1, Failures: 0, Errors: 0, Skipped: 0, Time elapsed: 0.006 s - in org.openmrs.util.UserByNameComparatorTest
  975. [INFO] Running org.openmrs.validator.AlertValidatorTest
  976. [INFO] Tests run: 5, Failures: 0, Errors: 0, Skipped: 0, Time elapsed: 2.16 s - in org.openmrs.validator.AlertValidatorTest
  977. [INFO] Running org.openmrs.validator.AllergyValidatorTest
  978. [INFO] Tests run: 9, Failures: 0, Errors: 0, Skipped: 0, Time elapsed: 0.232 s - in org.openmrs.validator.AllergyValidatorTest
  979. [INFO] Running org.openmrs.validator.BaseAttributeTypeValidatorTest
  980. [INFO] Tests run: 16, Failures: 0, Errors: 0, Skipped: 0, Time elapsed: 7.985 s - in org.openmrs.validator.BaseAttributeTypeValidatorTest
  981. [INFO] Running org.openmrs.validator.CohortValidatorTest
  982. [INFO] Tests run: 7, Failures: 0, Errors: 0, Skipped: 0, Time elapsed: 2.935 s - in org.openmrs.validator.CohortValidatorTest
  983. [INFO] Running org.openmrs.validator.ConceptAttributeTypeValidatorTest
  984. [INFO] Tests run: 8, Failures: 0, Errors: 0, Skipped: 0, Time elapsed: 2.433 s - in org.openmrs.validator.ConceptAttributeTypeValidatorTest
  985. [INFO] Running org.openmrs.validator.ConceptClassValidatorTest
  986. [INFO] Tests run: 6, Failures: 0, Errors: 0, Skipped: 0, Time elapsed: 2.289 s - in org.openmrs.validator.ConceptClassValidatorTest
  987. [INFO] Running org.openmrs.validator.ConceptDatatypeValidatorTest
  988. [INFO] Tests run: 5, Failures: 0, Errors: 0, Skipped: 0, Time elapsed: 2.092 s - in org.openmrs.validator.ConceptDatatypeValidatorTest
  989. [INFO] Running org.openmrs.validator.ConceptDrugValidatorTest
  990. [INFO] Tests run: 3, Failures: 0, Errors: 0, Skipped: 0, Time elapsed: 0.004 s - in org.openmrs.validator.ConceptDrugValidatorTest
  991. [INFO] Running org.openmrs.validator.ConceptMapTypeValidatorTest
  992. [INFO] Tests run: 8, Failures: 0, Errors: 0, Skipped: 0, Time elapsed: 2.808 s - in org.openmrs.validator.ConceptMapTypeValidatorTest
  993. [INFO] Running org.openmrs.validator.ConceptNameTagValidatorTest
  994. [INFO] Tests run: 7, Failures: 0, Errors: 0, Skipped: 0, Time elapsed: 3.229 s - in org.openmrs.validator.ConceptNameTagValidatorTest
  995. [INFO] Running org.openmrs.validator.ConceptReferenceTermValidatorTest
  996. [Field error in object 'term' on field 'conceptReferenceTermMaps[1].termB': rejected value [weight term(WGT234)]; codes [ConceptReferenceTerm.termToTerm.alreadyMapped.term.conceptReferenceTermMaps[1].termB,ConceptReferenceTerm.termToTerm.alreadyMapped.term.conceptReferenceTermMaps.termB,ConceptReferenceTerm.termToTerm.alreadyMapped.conceptReferenceTermMaps[1].termB,ConceptReferenceTerm.termToTerm.alreadyMapped.conceptReferenceTermMaps.termB,ConceptReferenceTerm.termToTerm.alreadyMapped.termB,ConceptReferenceTerm.termToTerm.alreadyMapped.org.openmrs.ConceptReferenceTerm,ConceptReferenceTerm.termToTerm.alreadyMapped]; arguments []; default message [Cannot map a reference term multiple times to the same concept reference term]]
  997. [WARNING] Tests run: 18, Failures: 0, Errors: 0, Skipped: 3, Time elapsed: 2.976 s - in org.openmrs.validator.ConceptReferenceTermValidatorTest
  998. [INFO] Running org.openmrs.validator.ConceptSourceValidatorTest
  999. [INFO] Tests run: 6, Failures: 0, Errors: 0, Skipped: 0, Time elapsed: 2.956 s - in org.openmrs.validator.ConceptSourceValidatorTest
  1000. [INFO] Running org.openmrs.validator.ConceptValidatorTest
  1001. [INFO] Tests run: 31, Failures: 0, Errors: 0, Skipped: 0, Time elapsed: 3.061 s - in org.openmrs.validator.ConceptValidatorTest
  1002. [INFO] Running org.openmrs.validator.ConditionValidatorTest
  1003. [INFO] Tests run: 4, Failures: 0, Errors: 0, Skipped: 0, Time elapsed: 0.004 s - in org.openmrs.validator.ConditionValidatorTest
  1004. [INFO] Running org.openmrs.validator.DiagnosisValidatorTest
  1005. [INFO] Tests run: 6, Failures: 0, Errors: 0, Skipped: 0, Time elapsed: 2.437 s - in org.openmrs.validator.DiagnosisValidatorTest
  1006. [INFO] Running org.openmrs.validator.DrugOrderValidatorTest
  1007. [INFO] Tests run: 37, Failures: 0, Errors: 0, Skipped: 0, Time elapsed: 5.747 s - in org.openmrs.validator.DrugOrderValidatorTest
  1008. [INFO] Running org.openmrs.validator.DrugValidatorTest
  1009. [INFO] Tests run: 9, Failures: 0, Errors: 0, Skipped: 0, Time elapsed: 2.571 s - in org.openmrs.validator.DrugValidatorTest
  1010. [INFO] Running org.openmrs.validator.EncounterRoleValidatorTest
  1011. [INFO] Tests run: 5, Failures: 0, Errors: 0, Skipped: 0, Time elapsed: 2.28 s - in org.openmrs.validator.EncounterRoleValidatorTest
  1012. [INFO] Running org.openmrs.validator.EncounterTypeValidatorTest
  1013. [INFO] Tests run: 7, Failures: 0, Errors: 0, Skipped: 0, Time elapsed: 1.959 s - in org.openmrs.validator.EncounterTypeValidatorTest
  1014. [INFO] Running org.openmrs.validator.EncounterValidatorTest
  1015. [INFO] Tests run: 12, Failures: 0, Errors: 0, Skipped: 0, Time elapsed: 2.22 s - in org.openmrs.validator.EncounterValidatorTest
  1016. [INFO] Running org.openmrs.validator.FieldTypeValidatorTest
  1017. [INFO] Tests run: 5, Failures: 0, Errors: 0, Skipped: 0, Time elapsed: 2.647 s - in org.openmrs.validator.FieldTypeValidatorTest
  1018. [INFO] Running org.openmrs.validator.FieldValidatorTest
  1019. [INFO] Tests run: 8, Failures: 0, Errors: 0, Skipped: 0, Time elapsed: 3.055 s - in org.openmrs.validator.FieldValidatorTest
  1020. [INFO] Running org.openmrs.validator.FormValidatorTest
  1021. [INFO] Tests run: 8, Failures: 0, Errors: 0, Skipped: 0, Time elapsed: 3.234 s - in org.openmrs.validator.FormValidatorTest
  1022. [INFO] Running org.openmrs.validator.HL7SourceValidatorTest
  1023. [INFO] Tests run: 2, Failures: 0, Errors: 0, Skipped: 0, Time elapsed: 2.749 s - in org.openmrs.validator.HL7SourceValidatorTest
  1024. [INFO] Running org.openmrs.validator.ImplementationIdValidatorTest
  1025. [INFO] Tests run: 8, Failures: 0, Errors: 0, Skipped: 0, Time elapsed: 2.204 s - in org.openmrs.validator.ImplementationIdValidatorTest
  1026. [INFO] Running org.openmrs.validator.LocationAttributeTypeValidatorTest
  1027. [INFO] Tests run: 6, Failures: 0, Errors: 0, Skipped: 0, Time elapsed: 3.564 s - in org.openmrs.validator.LocationAttributeTypeValidatorTest
  1028. [INFO] Running org.openmrs.validator.LocationTagValidatorTest
  1029. [INFO] Tests run: 2, Failures: 0, Errors: 0, Skipped: 0, Time elapsed: 2.263 s - in org.openmrs.validator.LocationTagValidatorTest
  1030. [INFO] Running org.openmrs.validator.LocationValidatorTest
  1031. [INFO] Tests run: 9, Failures: 0, Errors: 0, Skipped: 0, Time elapsed: 2.184 s - in org.openmrs.validator.LocationValidatorTest
  1032. [INFO] Running org.openmrs.validator.ObsValidatorTest
  1033. [INFO] Tests run: 22, Failures: 0, Errors: 0, Skipped: 0, Time elapsed: 2.21 s - in org.openmrs.validator.ObsValidatorTest
  1034. [INFO] Running org.openmrs.validator.OrderFrequencyValidatorTest
  1035. [INFO] Tests run: 9, Failures: 0, Errors: 0, Skipped: 0, Time elapsed: 2.242 s - in org.openmrs.validator.OrderFrequencyValidatorTest
  1036. [INFO] Running org.openmrs.validator.OrderTypeValidatorTest
  1037. [INFO] Tests run: 14, Failures: 0, Errors: 0, Skipped: 0, Time elapsed: 2.152 s - in org.openmrs.validator.OrderTypeValidatorTest
  1038. [INFO] Running org.openmrs.validator.OrderValidatorTest
  1039. [INFO] Tests run: 22, Failures: 0, Errors: 0, Skipped: 0, Time elapsed: 2.543 s - in org.openmrs.validator.OrderValidatorTest
  1040. [INFO] Running org.openmrs.validator.PatientIdentifierTypeValidatorTest
  1041. [INFO] Tests run: 9, Failures: 0, Errors: 0, Skipped: 0, Time elapsed: 2.228 s - in org.openmrs.validator.PatientIdentifierTypeValidatorTest
  1042. [INFO] Running org.openmrs.validator.PatientIdentifierValidatorTest
  1043. [INFO] Tests run: 20, Failures: 0, Errors: 0, Skipped: 0, Time elapsed: 3.203 s - in org.openmrs.validator.PatientIdentifierValidatorTest
  1044. [INFO] Running org.openmrs.validator.PatientProgramValidatorTest
  1045. [INFO] Tests run: 22, Failures: 0, Errors: 0, Skipped: 0, Time elapsed: 2.667 s - in org.openmrs.validator.PatientProgramValidatorTest
  1046. [INFO] Running org.openmrs.validator.PatientValidatorTest
  1047. [INFO] Tests run: 17, Failures: 0, Errors: 0, Skipped: 0, Time elapsed: 2.3 s - in org.openmrs.validator.PatientValidatorTest
  1048. [INFO] Running org.openmrs.validator.PersonAddressValidatorTest
  1049. [INFO] Tests run: 10, Failures: 0, Errors: 0, Skipped: 0, Time elapsed: 2.258 s - in org.openmrs.validator.PersonAddressValidatorTest
  1050. [INFO] Running org.openmrs.validator.PersonAttributeTypeValidatorTest
  1051. [INFO] Tests run: 7, Failures: 0, Errors: 0, Skipped: 0, Time elapsed: 2.282 s - in org.openmrs.validator.PersonAttributeTypeValidatorTest
  1052. [INFO] Running org.openmrs.validator.PersonMergeLogValidatorTest
  1053. [INFO] Tests run: 6, Failures: 0, Errors: 0, Skipped: 0, Time elapsed: 2.099 s - in org.openmrs.validator.PersonMergeLogValidatorTest
  1054. [INFO] Running org.openmrs.validator.PersonNameValidatorTest
  1055. [WARNING] Tests run: 59, Failures: 0, Errors: 0, Skipped: 8, Time elapsed: 2.509 s - in org.openmrs.validator.PersonNameValidatorTest
  1056. [INFO] Running org.openmrs.validator.PersonValidatorTest
  1057. [INFO] Tests run: 13, Failures: 0, Errors: 0, Skipped: 0, Time elapsed: 2.554 s - in org.openmrs.validator.PersonValidatorTest
  1058. [INFO] Running org.openmrs.validator.PrivilegeValidatorTest
  1059. [INFO] Tests run: 5, Failures: 0, Errors: 0, Skipped: 0, Time elapsed: 2.16 s - in org.openmrs.validator.PrivilegeValidatorTest
  1060. [INFO] Running org.openmrs.validator.ProgramValidatorTest
  1061. [INFO] Tests run: 8, Failures: 0, Errors: 0, Skipped: 0, Time elapsed: 2.144 s - in org.openmrs.validator.ProgramValidatorTest
  1062. [INFO] Running org.openmrs.validator.ProviderAttributeTypeValidatorTest
  1063. [INFO] Tests run: 2, Failures: 0, Errors: 0, Skipped: 0, Time elapsed: 2.37 s - in org.openmrs.validator.ProviderAttributeTypeValidatorTest
  1064. [INFO] Running org.openmrs.validator.ProviderValidatorTest
  1065. [INFO] Tests run: 13, Failures: 0, Errors: 0, Skipped: 0, Time elapsed: 2.179 s - in org.openmrs.validator.ProviderValidatorTest
  1066. [INFO] Running org.openmrs.validator.RelationshipTypeValidatorTest
  1067. [INFO] Tests run: 7, Failures: 0, Errors: 0, Skipped: 0, Time elapsed: 2.09 s - in org.openmrs.validator.RelationshipTypeValidatorTest
  1068. [INFO] Running org.openmrs.validator.RelationshipValidatorTest
  1069. [INFO] Tests run: 7, Failures: 0, Errors: 0, Skipped: 0, Time elapsed: 2.105 s - in org.openmrs.validator.RelationshipValidatorTest
  1070. [INFO] Running org.openmrs.validator.RequireNameValidatorTest
  1071. [INFO] Tests run: 2, Failures: 0, Errors: 0, Skipped: 0, Time elapsed: 0.007 s - in org.openmrs.validator.RequireNameValidatorTest
  1072. [INFO] Running org.openmrs.validator.RoleValidatorTest
  1073. [INFO] Tests run: 6, Failures: 0, Errors: 0, Skipped: 0, Time elapsed: 2.076 s - in org.openmrs.validator.RoleValidatorTest
  1074. [INFO] Running org.openmrs.validator.SchedulerFormValidatorTest
  1075. [INFO] Tests run: 10, Failures: 0, Errors: 0, Skipped: 0, Time elapsed: 2.117 s - in org.openmrs.validator.SchedulerFormValidatorTest
  1076. [INFO] Running org.openmrs.validator.StateConversionValidatorTest
  1077. [INFO] Tests run: 4, Failures: 0, Errors: 0, Skipped: 0, Time elapsed: 2.03 s - in org.openmrs.validator.StateConversionValidatorTest
  1078. [INFO] Running org.openmrs.validator.TestOrderValidatorTest
  1079. [INFO] Tests run: 2, Failures: 0, Errors: 0, Skipped: 0, Time elapsed: 2.116 s - in org.openmrs.validator.TestOrderValidatorTest
  1080. [INFO] Running org.openmrs.validator.UserValidatorTest
  1081. [INFO] Tests run: 23, Failures: 0, Errors: 0, Skipped: 0, Time elapsed: 3.442 s - in org.openmrs.validator.UserValidatorTest
  1082. [INFO] Running org.openmrs.validator.ValidateUtilTest
  1083. [INFO] Tests run: 9, Failures: 0, Errors: 0, Skipped: 0, Time elapsed: 2.247 s - in org.openmrs.validator.ValidateUtilTest
  1084. [INFO] Running org.openmrs.validator.VisitAttributeTypeValidatorTest
  1085. [INFO] Tests run: 2, Failures: 0, Errors: 0, Skipped: 0, Time elapsed: 2.157 s - in org.openmrs.validator.VisitAttributeTypeValidatorTest
  1086. [INFO] Running org.openmrs.validator.VisitTypeValidatorTest
  1087. [INFO] Tests run: 2, Failures: 0, Errors: 0, Skipped: 0, Time elapsed: 1.992 s - in org.openmrs.validator.VisitTypeValidatorTest
  1088. [INFO] Running org.openmrs.validator.VisitValidatorTest
  1089. [WARNING] Tests run: 27, Failures: 0, Errors: 0, Skipped: 1, Time elapsed: 3.935 s - in org.openmrs.validator.VisitValidatorTest
  1090. [INFO] Running org.openmrs.annotation.OpenmrsProfileExcludeFilterWithModulesJUnit4Test
  1091. [INFO] Tests run: 1, Failures: 0, Errors: 0, Skipped: 0, Time elapsed: 3.556 s - in org.openmrs.annotation.OpenmrsProfileExcludeFilterWithModulesJUnit4Test
  1092. [INFO] Running org.openmrs.annotation.StartModuleAnnotationJUnit4Test
  1093. [INFO] Tests run: 1, Failures: 0, Errors: 0, Skipped: 0, Time elapsed: 3.431 s - in org.openmrs.annotation.StartModuleAnnotationJUnit4Test
  1094. [INFO] Running org.openmrs.annotation.StartModuleAnnotationReuseJUnit4Test
  1095. [INFO] Tests run: 1, Failures: 0, Errors: 0, Skipped: 0, Time elapsed: 3.226 s - in org.openmrs.annotation.StartModuleAnnotationReuseJUnit4Test
  1096. [INFO] Running org.openmrs.util.ThreadSafeCircularFifoQueueTest
  1097. [INFO] Tests run: 36, Failures: 0, Errors: 0, Skipped: 0, Time elapsed: 0.033 s - in org.openmrs.util.ThreadSafeCircularFifoQueueTest
  1098. [INFO]
  1099. [INFO] Results:
  1100. [INFO]
  1101. [ERROR] Failures:
  1102. [ERROR] CohortServiceTest.getMemberships_shouldReturnUnvoidedMemberships:680 expected: <2> but was: <3>
  1103. [ERROR] CohortServiceTest.getMemberships_shouldReturnVoidedMemberships:655 expected: <3> but was: <1>
  1104. [ERROR] PatientDataVoidHandlerTest.handle_shouldVoidCohortMemberships:135 expected: <1> but was: <3>
  1105. [INFO]
  1106. [ERROR] Tests run: 4350, Failures: 3, Errors: 0, Skipped: 38
  1107. [INFO]
  1108. [INFO] ------------------------------------------------------------------------
  1109. [INFO] Reactor Summary for OpenMRS 2.5.0-SNAPSHOT:
  1110. [INFO]
  1111. [INFO] OpenMRS ............................................ SUCCESS [ 4.641 s]
  1112. [INFO] openmrs-tools ...................................... SUCCESS [ 1.886 s]
  1113. [INFO] openmrs-test ....................................... SUCCESS [ 0.408 s]
  1114. [INFO] openmrs-api ........................................ FAILURE [23:22 min]
  1115. [INFO] openmrs-web ........................................ SKIPPED
  1116. [INFO] openmrs-webapp ..................................... SKIPPED
  1117. [INFO] openmrs-liquibase .................................. SKIPPED
  1118. [INFO] ------------------------------------------------------------------------
  1119. [INFO] BUILD FAILURE
  1120. [INFO] ------------------------------------------------------------------------
  1121. [INFO] Total time: 23:30 min
  1122. [INFO] Finished at: 2021-02-22T21:11:29+03:00
  1123. [INFO] ------------------------------------------------------------------------
  1124. [ERROR] Failed to execute goal org.apache.maven.plugins:maven-surefire-plugin:2.22.2:test (default-test) on project openmrs-api: There are test failures.
  1125. [ERROR]
  1126. [ERROR] Please refer to C:\Users\Suubi-Joshua\openmrs-core\api\target\surefire-reports for the individual test results.
  1127. [ERROR] Please refer to dump files (if any exist) [date].dump, [date]-jvmRun[N].dump and [date].dumpstream.
  1128. [ERROR] -> [Help 1]
  1129. [ERROR]
  1130. [ERROR] To see the full stack trace of the errors, re-run Maven with the -e switch.
  1131. [ERROR] Re-run Maven using the -X switch to enable full debug logging.
  1132. [ERROR]
  1133. [ERROR] For more information about the errors and possible solutions, please read the following articles:
  1134. [ERROR] [Help 1] http://cwiki.apache.org/confluence/display/MAVEN/MojoFailureException
  1135. [ERROR]
  1136. [ERROR] After correcting the problems, you can resume the build with the command
  1137. [ERROR] mvn <args> -rf :openmrs-api
  1138.  
  1139. C:\Users\Suubi-Joshua\openmrs-core>
Advertisement
Add Comment
Please, Sign In to add comment
Advertisement