Advertisement
Guest User

Untitled

a guest
Mar 9th, 2021
53
0
Never
Not a member of Pastebin yet? Sign Up, it unlocks many cool features!
text 60.43 KB | None | 0 0
  1. irynah@irynah-Vostro-3560:/media/irynah/DATA/0NEW-108G/0PROJECTS/OpenMRS-projects/openmrs-contrib-qaframework$ mvn clean test
  2. [INFO] Scanning for projects...
  3. [INFO]
  4. [INFO] ------------------< org.openmrs.contrib:qaframework >-------------------
  5. [INFO] Building OpenMRS QA Framework 1.0-SNAPSHOT
  6. [INFO] --------------------------------[ jar ]---------------------------------
  7. [INFO]
  8. [INFO] --- maven-clean-plugin:2.5:clean (default-clean) @ qaframework ---
  9. [INFO] Deleting /media/irynah/DATA/0NEW-108G/0PROJECTS/OpenMRS-projects/openmrs-contrib-qaframework/target
  10. [INFO]
  11. [INFO] --- maven-java-formatter-plugin:0.4:format (default) @ qaframework ---
  12. [INFO] Using 'UTF-8' encoding to format source files.
  13. [INFO] Number of files to be formatted: 11
  14. [INFO] Successfully formatted: 0 file(s)
  15. [INFO] Fail to format : 0 file(s)
  16. [INFO] Skipped : 11 file(s)
  17. [INFO] Approximate time taken: 0s
  18. [INFO]
  19. [INFO] --- frontend-maven-plugin:1.9.1:install-node-and-npm (install node and npm) @ qaframework ---
  20. [INFO] Node v15.8.0 is already installed.
  21. [INFO]
  22. [INFO] --- maven-resources-plugin:2.6:resources (default-resources) @ qaframework ---
  23. [INFO] Using 'UTF-8' encoding to copy filtered resources.
  24. [INFO] skip non existing resourceDirectory /media/irynah/DATA/0NEW-108G/0PROJECTS/OpenMRS-projects/openmrs-contrib-qaframework/src/main/resources
  25. [INFO]
  26. [INFO] --- maven-compiler-plugin:3.1:compile (default-compile) @ qaframework ---
  27. [INFO] No sources to compile
  28. [INFO]
  29. [INFO] --- maven-resources-plugin:2.6:testResources (default-testResources) @ qaframework ---
  30. [INFO] Using 'UTF-8' encoding to copy filtered resources.
  31. [INFO] Copying 28 resources
  32. [INFO]
  33. [INFO] --- maven-compiler-plugin:3.1:testCompile (default-testCompile) @ qaframework ---
  34. [INFO] Changes detected - recompiling the module!
  35. [INFO] Compiling 11 source files to /media/irynah/DATA/0NEW-108G/0PROJECTS/OpenMRS-projects/openmrs-contrib-qaframework/target/test-classes
  36. [INFO]
  37. [INFO] --- maven-antrun-plugin:1.8:run (make-mac-chromedriver-executable) @ qaframework ---
  38. [INFO] Executing tasks
  39.  
  40. main:
  41. [INFO] Executed tasks
  42. [INFO]
  43. [INFO] --- maven-antrun-plugin:1.8:run (make-linux-chromedriver-executable) @ qaframework ---
  44. [INFO] Executing tasks
  45.  
  46. main:
  47. [INFO] Executed tasks
  48. [INFO]
  49. [INFO] --- maven-antrun-plugin:1.8:run (make-mac-firefoxdriver-executable) @ qaframework ---
  50. [INFO] Executing tasks
  51.  
  52. main:
  53. [INFO] Executed tasks
  54. [INFO]
  55. [INFO] --- maven-surefire-plugin:2.12.4:test (default-test) @ qaframework ---
  56. [INFO] Surefire report directory: /media/irynah/DATA/0NEW-108G/0PROJECTS/OpenMRS-projects/openmrs-contrib-qaframework/target/surefire-reports
  57.  
  58. -------------------------------------------------------
  59. T E S T S
  60. -------------------------------------------------------
  61. Running org.openmrs.contrib.qaframework.RunTest
  62. Running locally...
  63. log4j:WARN No appenders could be found for logger (io.netty.util.internal.logging.InternalLoggerFactory).
  64. log4j:WARN Please initialize the log4j system properly.
  65. Starting ChromeDriver 88.0.4324.96 (68dba2d8a0b149a1d3afac56fa74648032bcf46b-refs/branch-heads/4324@{#1784}) on port 11041
  66. Only local connections are allowed.
  67. Please see https://chromedriver.chromium.org/security-considerations for suggestions on keeping ChromeDriver safe.
  68. ChromeDriver was started successfully.
  69. Mar 09, 2021 8:24:47 PM org.openqa.selenium.remote.ProtocolHandshake createSession
  70. INFO: Detected dialect: W3C
  71. Running locally...
  72. Starting ChromeDriver 88.0.4324.96 (68dba2d8a0b149a1d3afac56fa74648032bcf46b-refs/branch-heads/4324@{#1784}) on port 30651
  73. Only local connections are allowed.
  74. Please see https://chromedriver.chromium.org/security-considerations for suggestions on keeping ChromeDriver safe.
  75. ChromeDriver was started successfully.
  76. Mar 09, 2021 8:24:58 PM org.openqa.selenium.remote.ProtocolHandshake createSession
  77. INFO: Detected dialect: W3C
  78. Running locally...
  79. Starting ChromeDriver 88.0.4324.96 (68dba2d8a0b149a1d3afac56fa74648032bcf46b-refs/branch-heads/4324@{#1784}) on port 28956
  80. Only local connections are allowed.
  81. Please see https://chromedriver.chromium.org/security-considerations for suggestions on keeping ChromeDriver safe.
  82. ChromeDriver was started successfully.
  83. Mar 09, 2021 8:24:59 PM org.openqa.selenium.remote.ProtocolHandshake createSession
  84. INFO: Detected dialect: W3C
  85. Running locally...
  86. Starting ChromeDriver 88.0.4324.96 (68dba2d8a0b149a1d3afac56fa74648032bcf46b-refs/branch-heads/4324@{#1784}) on port 18501
  87. Only local connections are allowed.
  88. Please see https://chromedriver.chromium.org/security-considerations for suggestions on keeping ChromeDriver safe.
  89. ChromeDriver was started successfully.
  90. Mar 09, 2021 8:25:00 PM org.openqa.selenium.remote.ProtocolHandshake createSession
  91. INFO: Detected dialect: W3C
  92. Running locally...
  93. Starting ChromeDriver 88.0.4324.96 (68dba2d8a0b149a1d3afac56fa74648032bcf46b-refs/branch-heads/4324@{#1784}) on port 17671
  94. Only local connections are allowed.
  95. Please see https://chromedriver.chromium.org/security-considerations for suggestions on keeping ChromeDriver safe.
  96. ChromeDriver was started successfully.
  97. Mar 09, 2021 8:25:00 PM org.openqa.selenium.remote.ProtocolHandshake createSession
  98. INFO: Detected dialect: W3C
  99. Running locally...
  100. Starting ChromeDriver 88.0.4324.96 (68dba2d8a0b149a1d3afac56fa74648032bcf46b-refs/branch-heads/4324@{#1784}) on port 10735
  101. Only local connections are allowed.
  102. Please see https://chromedriver.chromium.org/security-considerations for suggestions on keeping ChromeDriver safe.
  103. ChromeDriver was started successfully.
  104. Mar 09, 2021 8:25:01 PM org.openqa.selenium.remote.ProtocolHandshake createSession
  105. INFO: Detected dialect: W3C
  106. Running locally...
  107. Starting ChromeDriver 88.0.4324.96 (68dba2d8a0b149a1d3afac56fa74648032bcf46b-refs/branch-heads/4324@{#1784}) on port 22270
  108. Only local connections are allowed.
  109. Please see https://chromedriver.chromium.org/security-considerations for suggestions on keeping ChromeDriver safe.
  110. ChromeDriver was started successfully.
  111. Mar 09, 2021 8:25:02 PM org.openqa.selenium.remote.ProtocolHandshake createSession
  112. INFO: Detected dialect: W3C
  113. Running locally...
  114. Starting ChromeDriver 88.0.4324.96 (68dba2d8a0b149a1d3afac56fa74648032bcf46b-refs/branch-heads/4324@{#1784}) on port 19216
  115. Only local connections are allowed.
  116. Please see https://chromedriver.chromium.org/security-considerations for suggestions on keeping ChromeDriver safe.
  117. ChromeDriver was started successfully.
  118. Mar 09, 2021 8:25:11 PM org.openqa.selenium.remote.ProtocolHandshake createSession
  119. INFO: Detected dialect: W3C
  120. Running locally...
  121. Starting ChromeDriver 88.0.4324.96 (68dba2d8a0b149a1d3afac56fa74648032bcf46b-refs/branch-heads/4324@{#1784}) on port 13247
  122. Only local connections are allowed.
  123. Please see https://chromedriver.chromium.org/security-considerations for suggestions on keeping ChromeDriver safe.
  124. ChromeDriver was started successfully.
  125. Mar 09, 2021 8:25:13 PM org.openqa.selenium.remote.ProtocolHandshake createSession
  126. INFO: Detected dialect: W3C
  127. Running locally...
  128. Starting ChromeDriver 88.0.4324.96 (68dba2d8a0b149a1d3afac56fa74648032bcf46b-refs/branch-heads/4324@{#1784}) on port 17131
  129. Only local connections are allowed.
  130. Please see https://chromedriver.chromium.org/security-considerations for suggestions on keeping ChromeDriver safe.
  131. ChromeDriver was started successfully.
  132. Mar 09, 2021 8:25:14 PM org.openqa.selenium.remote.ProtocolHandshake createSession
  133. INFO: Detected dialect: W3C
  134. Running locally...
  135. Starting ChromeDriver 88.0.4324.96 (68dba2d8a0b149a1d3afac56fa74648032bcf46b-refs/branch-heads/4324@{#1784}) on port 28739
  136. Only local connections are allowed.
  137. Please see https://chromedriver.chromium.org/security-considerations for suggestions on keeping ChromeDriver safe.
  138. ChromeDriver was started successfully.
  139. Mar 09, 2021 8:25:15 PM org.openqa.selenium.remote.ProtocolHandshake createSession
  140. INFO: Detected dialect: W3C
  141. Running locally...
  142. Starting ChromeDriver 88.0.4324.96 (68dba2d8a0b149a1d3afac56fa74648032bcf46b-refs/branch-heads/4324@{#1784}) on port 11972
  143. Only local connections are allowed.
  144. Please see https://chromedriver.chromium.org/security-considerations for suggestions on keeping ChromeDriver safe.
  145. ChromeDriver was started successfully.
  146. Mar 09, 2021 8:25:16 PM org.openqa.selenium.remote.ProtocolHandshake createSession
  147. INFO: Detected dialect: W3C
  148. Running locally...
  149. Starting ChromeDriver 88.0.4324.96 (68dba2d8a0b149a1d3afac56fa74648032bcf46b-refs/branch-heads/4324@{#1784}) on port 9226
  150. Only local connections are allowed.
  151. Please see https://chromedriver.chromium.org/security-considerations for suggestions on keeping ChromeDriver safe.
  152. ChromeDriver was started successfully.
  153. Mar 09, 2021 8:25:17 PM org.openqa.selenium.remote.ProtocolHandshake createSession
  154. INFO: Detected dialect: W3C
  155. Running locally...
  156. Starting ChromeDriver 88.0.4324.96 (68dba2d8a0b149a1d3afac56fa74648032bcf46b-refs/branch-heads/4324@{#1784}) on port 26516
  157. Only local connections are allowed.
  158. Please see https://chromedriver.chromium.org/security-considerations for suggestions on keeping ChromeDriver safe.
  159. ChromeDriver was started successfully.
  160. Mar 09, 2021 8:25:26 PM org.openqa.selenium.remote.ProtocolHandshake createSession
  161. INFO: Detected dialect: W3C
  162. Running locally...
  163. Starting ChromeDriver 88.0.4324.96 (68dba2d8a0b149a1d3afac56fa74648032bcf46b-refs/branch-heads/4324@{#1784}) on port 8376
  164. Only local connections are allowed.
  165. Please see https://chromedriver.chromium.org/security-considerations for suggestions on keeping ChromeDriver safe.
  166. ChromeDriver was started successfully.
  167. Mar 09, 2021 8:25:27 PM org.openqa.selenium.remote.ProtocolHandshake createSession
  168. INFO: Detected dialect: W3C
  169. Running locally...
  170. Starting ChromeDriver 88.0.4324.96 (68dba2d8a0b149a1d3afac56fa74648032bcf46b-refs/branch-heads/4324@{#1784}) on port 25975
  171. Only local connections are allowed.
  172. Please see https://chromedriver.chromium.org/security-considerations for suggestions on keeping ChromeDriver safe.
  173. ChromeDriver was started successfully.
  174. Mar 09, 2021 8:25:28 PM org.openqa.selenium.remote.ProtocolHandshake createSession
  175. INFO: Detected dialect: W3C
  176. Running locally...
  177. Starting ChromeDriver 88.0.4324.96 (68dba2d8a0b149a1d3afac56fa74648032bcf46b-refs/branch-heads/4324@{#1784}) on port 28987
  178. Only local connections are allowed.
  179. Please see https://chromedriver.chromium.org/security-considerations for suggestions on keeping ChromeDriver safe.
  180. ChromeDriver was started successfully.
  181. Mar 09, 2021 8:25:28 PM org.openqa.selenium.remote.ProtocolHandshake createSession
  182. INFO: Detected dialect: W3C
  183. Running locally...
  184. Starting ChromeDriver 88.0.4324.96 (68dba2d8a0b149a1d3afac56fa74648032bcf46b-refs/branch-heads/4324@{#1784}) on port 14042
  185. Only local connections are allowed.
  186. Please see https://chromedriver.chromium.org/security-considerations for suggestions on keeping ChromeDriver safe.
  187. ChromeDriver was started successfully.
  188. Mar 09, 2021 8:25:29 PM org.openqa.selenium.remote.ProtocolHandshake createSession
  189. INFO: Detected dialect: W3C
  190. Running locally...
  191. Starting ChromeDriver 88.0.4324.96 (68dba2d8a0b149a1d3afac56fa74648032bcf46b-refs/branch-heads/4324@{#1784}) on port 14512
  192. Only local connections are allowed.
  193. Please see https://chromedriver.chromium.org/security-considerations for suggestions on keeping ChromeDriver safe.
  194. ChromeDriver was started successfully.
  195. Mar 09, 2021 8:25:30 PM org.openqa.selenium.remote.ProtocolHandshake createSession
  196. INFO: Detected dialect: W3C
  197. Running locally...
  198. Starting ChromeDriver 88.0.4324.96 (68dba2d8a0b149a1d3afac56fa74648032bcf46b-refs/branch-heads/4324@{#1784}) on port 30384
  199. Only local connections are allowed.
  200. Please see https://chromedriver.chromium.org/security-considerations for suggestions on keeping ChromeDriver safe.
  201. ChromeDriver was started successfully.
  202. Mar 09, 2021 8:25:38 PM org.openqa.selenium.remote.ProtocolHandshake createSession
  203. INFO: Detected dialect: W3C
  204. Running locally...
  205. Starting ChromeDriver 88.0.4324.96 (68dba2d8a0b149a1d3afac56fa74648032bcf46b-refs/branch-heads/4324@{#1784}) on port 9317
  206. Only local connections are allowed.
  207. Please see https://chromedriver.chromium.org/security-considerations for suggestions on keeping ChromeDriver safe.
  208. ChromeDriver was started successfully.
  209. Mar 09, 2021 8:25:38 PM org.openqa.selenium.remote.ProtocolHandshake createSession
  210. INFO: Detected dialect: W3C
  211. Running locally...
  212. Starting ChromeDriver 88.0.4324.96 (68dba2d8a0b149a1d3afac56fa74648032bcf46b-refs/branch-heads/4324@{#1784}) on port 13287
  213. Only local connections are allowed.
  214. Please see https://chromedriver.chromium.org/security-considerations for suggestions on keeping ChromeDriver safe.
  215. ChromeDriver was started successfully.
  216. Mar 09, 2021 8:25:39 PM org.openqa.selenium.remote.ProtocolHandshake createSession
  217. INFO: Detected dialect: W3C
  218. Running locally...
  219. Starting ChromeDriver 88.0.4324.96 (68dba2d8a0b149a1d3afac56fa74648032bcf46b-refs/branch-heads/4324@{#1784}) on port 32564
  220. Only local connections are allowed.
  221. Please see https://chromedriver.chromium.org/security-considerations for suggestions on keeping ChromeDriver safe.
  222. ChromeDriver was started successfully.
  223. Mar 09, 2021 8:25:40 PM org.openqa.selenium.remote.ProtocolHandshake createSession
  224. INFO: Detected dialect: W3C
  225. Running locally...
  226. Starting ChromeDriver 88.0.4324.96 (68dba2d8a0b149a1d3afac56fa74648032bcf46b-refs/branch-heads/4324@{#1784}) on port 2786
  227. Only local connections are allowed.
  228. Please see https://chromedriver.chromium.org/security-considerations for suggestions on keeping ChromeDriver safe.
  229. ChromeDriver was started successfully.
  230. Mar 09, 2021 8:25:41 PM org.openqa.selenium.remote.ProtocolHandshake createSession
  231. INFO: Detected dialect: W3C
  232. Running locally...
  233. Starting ChromeDriver 88.0.4324.96 (68dba2d8a0b149a1d3afac56fa74648032bcf46b-refs/branch-heads/4324@{#1784}) on port 10820
  234. Only local connections are allowed.
  235. Please see https://chromedriver.chromium.org/security-considerations for suggestions on keeping ChromeDriver safe.
  236. ChromeDriver was started successfully.
  237. Mar 09, 2021 8:25:42 PM org.openqa.selenium.remote.ProtocolHandshake createSession
  238. INFO: Detected dialect: W3C
  239. Running locally...
  240. Starting ChromeDriver 88.0.4324.96 (68dba2d8a0b149a1d3afac56fa74648032bcf46b-refs/branch-heads/4324@{#1784}) on port 29933
  241. Only local connections are allowed.
  242. Please see https://chromedriver.chromium.org/security-considerations for suggestions on keeping ChromeDriver safe.
  243. ChromeDriver was started successfully.
  244. Mar 09, 2021 8:25:53 PM org.openqa.selenium.remote.ProtocolHandshake createSession
  245. INFO: Detected dialect: W3C
  246. Running locally...
  247. Starting ChromeDriver 88.0.4324.96 (68dba2d8a0b149a1d3afac56fa74648032bcf46b-refs/branch-heads/4324@{#1784}) on port 12913
  248. Only local connections are allowed.
  249. Please see https://chromedriver.chromium.org/security-considerations for suggestions on keeping ChromeDriver safe.
  250. ChromeDriver was started successfully.
  251. Mar 09, 2021 8:25:54 PM org.openqa.selenium.remote.ProtocolHandshake createSession
  252. INFO: Detected dialect: W3C
  253. Running locally...
  254. Starting ChromeDriver 88.0.4324.96 (68dba2d8a0b149a1d3afac56fa74648032bcf46b-refs/branch-heads/4324@{#1784}) on port 3564
  255. Only local connections are allowed.
  256. Please see https://chromedriver.chromium.org/security-considerations for suggestions on keeping ChromeDriver safe.
  257. ChromeDriver was started successfully.
  258. Mar 09, 2021 8:25:55 PM org.openqa.selenium.remote.ProtocolHandshake createSession
  259. INFO: Detected dialect: W3C
  260. Running locally...
  261. Starting ChromeDriver 88.0.4324.96 (68dba2d8a0b149a1d3afac56fa74648032bcf46b-refs/branch-heads/4324@{#1784}) on port 17301
  262. Only local connections are allowed.
  263. Please see https://chromedriver.chromium.org/security-considerations for suggestions on keeping ChromeDriver safe.
  264. ChromeDriver was started successfully.
  265. Mar 09, 2021 8:25:55 PM org.openqa.selenium.remote.ProtocolHandshake createSession
  266. INFO: Detected dialect: W3C
  267. Running locally...
  268. Starting ChromeDriver 88.0.4324.96 (68dba2d8a0b149a1d3afac56fa74648032bcf46b-refs/branch-heads/4324@{#1784}) on port 31102
  269. Only local connections are allowed.
  270. Please see https://chromedriver.chromium.org/security-considerations for suggestions on keeping ChromeDriver safe.
  271. ChromeDriver was started successfully.
  272. Mar 09, 2021 8:25:56 PM org.openqa.selenium.remote.ProtocolHandshake createSession
  273. INFO: Detected dialect: W3C
  274. Running locally...
  275. Starting ChromeDriver 88.0.4324.96 (68dba2d8a0b149a1d3afac56fa74648032bcf46b-refs/branch-heads/4324@{#1784}) on port 26594
  276. Only local connections are allowed.
  277. Please see https://chromedriver.chromium.org/security-considerations for suggestions on keeping ChromeDriver safe.
  278. ChromeDriver was started successfully.
  279. Mar 09, 2021 8:25:57 PM org.openqa.selenium.remote.ProtocolHandshake createSession
  280. INFO: Detected dialect: W3C
  281. Running locally...
  282. Starting ChromeDriver 88.0.4324.96 (68dba2d8a0b149a1d3afac56fa74648032bcf46b-refs/branch-heads/4324@{#1784}) on port 30482
  283. Only local connections are allowed.
  284. Please see https://chromedriver.chromium.org/security-considerations for suggestions on keeping ChromeDriver safe.
  285. ChromeDriver was started successfully.
  286. Mar 09, 2021 8:26:08 PM org.openqa.selenium.remote.ProtocolHandshake createSession
  287. INFO: Detected dialect: W3C
  288. Running locally...
  289. Starting ChromeDriver 88.0.4324.96 (68dba2d8a0b149a1d3afac56fa74648032bcf46b-refs/branch-heads/4324@{#1784}) on port 21900
  290. Only local connections are allowed.
  291. Please see https://chromedriver.chromium.org/security-considerations for suggestions on keeping ChromeDriver safe.
  292. ChromeDriver was started successfully.
  293. Mar 09, 2021 8:26:09 PM org.openqa.selenium.remote.ProtocolHandshake createSession
  294. INFO: Detected dialect: W3C
  295. Running locally...
  296. Starting ChromeDriver 88.0.4324.96 (68dba2d8a0b149a1d3afac56fa74648032bcf46b-refs/branch-heads/4324@{#1784}) on port 15446
  297. Only local connections are allowed.
  298. Please see https://chromedriver.chromium.org/security-considerations for suggestions on keeping ChromeDriver safe.
  299. ChromeDriver was started successfully.
  300. Mar 09, 2021 8:26:10 PM org.openqa.selenium.remote.ProtocolHandshake createSession
  301. INFO: Detected dialect: W3C
  302. Running locally...
  303. Starting ChromeDriver 88.0.4324.96 (68dba2d8a0b149a1d3afac56fa74648032bcf46b-refs/branch-heads/4324@{#1784}) on port 14033
  304. Only local connections are allowed.
  305. Please see https://chromedriver.chromium.org/security-considerations for suggestions on keeping ChromeDriver safe.
  306. ChromeDriver was started successfully.
  307. Mar 09, 2021 8:26:11 PM org.openqa.selenium.remote.ProtocolHandshake createSession
  308. INFO: Detected dialect: W3C
  309. Running locally...
  310. Starting ChromeDriver 88.0.4324.96 (68dba2d8a0b149a1d3afac56fa74648032bcf46b-refs/branch-heads/4324@{#1784}) on port 25287
  311. Only local connections are allowed.
  312. Please see https://chromedriver.chromium.org/security-considerations for suggestions on keeping ChromeDriver safe.
  313. ChromeDriver was started successfully.
  314. Mar 09, 2021 8:26:12 PM org.openqa.selenium.remote.ProtocolHandshake createSession
  315. INFO: Detected dialect: W3C
  316. Running locally...
  317. Starting ChromeDriver 88.0.4324.96 (68dba2d8a0b149a1d3afac56fa74648032bcf46b-refs/branch-heads/4324@{#1784}) on port 31000
  318. Only local connections are allowed.
  319. Please see https://chromedriver.chromium.org/security-considerations for suggestions on keeping ChromeDriver safe.
  320. ChromeDriver was started successfully.
  321. Mar 09, 2021 8:26:12 PM org.openqa.selenium.remote.ProtocolHandshake createSession
  322. INFO: Detected dialect: W3C
  323. Running locally...
  324. Starting ChromeDriver 88.0.4324.96 (68dba2d8a0b149a1d3afac56fa74648032bcf46b-refs/branch-heads/4324@{#1784}) on port 16201
  325. Only local connections are allowed.
  326. Please see https://chromedriver.chromium.org/security-considerations for suggestions on keeping ChromeDriver safe.
  327. ChromeDriver was started successfully.
  328. Mar 09, 2021 8:26:26 PM org.openqa.selenium.remote.ProtocolHandshake createSession
  329. INFO: Detected dialect: W3C
  330. Running locally...
  331. Starting ChromeDriver 88.0.4324.96 (68dba2d8a0b149a1d3afac56fa74648032bcf46b-refs/branch-heads/4324@{#1784}) on port 15301
  332. Only local connections are allowed.
  333. Please see https://chromedriver.chromium.org/security-considerations for suggestions on keeping ChromeDriver safe.
  334. ChromeDriver was started successfully.
  335. Mar 09, 2021 8:26:27 PM org.openqa.selenium.remote.ProtocolHandshake createSession
  336. INFO: Detected dialect: W3C
  337. Running locally...
  338. Starting ChromeDriver 88.0.4324.96 (68dba2d8a0b149a1d3afac56fa74648032bcf46b-refs/branch-heads/4324@{#1784}) on port 19911
  339. Only local connections are allowed.
  340. Please see https://chromedriver.chromium.org/security-considerations for suggestions on keeping ChromeDriver safe.
  341. ChromeDriver was started successfully.
  342. Mar 09, 2021 8:26:28 PM org.openqa.selenium.remote.ProtocolHandshake createSession
  343. INFO: Detected dialect: W3C
  344. Running locally...
  345. Starting ChromeDriver 88.0.4324.96 (68dba2d8a0b149a1d3afac56fa74648032bcf46b-refs/branch-heads/4324@{#1784}) on port 20898
  346. Only local connections are allowed.
  347. Please see https://chromedriver.chromium.org/security-considerations for suggestions on keeping ChromeDriver safe.
  348. ChromeDriver was started successfully.
  349. Mar 09, 2021 8:26:28 PM org.openqa.selenium.remote.ProtocolHandshake createSession
  350. INFO: Detected dialect: W3C
  351. Running locally...
  352. Starting ChromeDriver 88.0.4324.96 (68dba2d8a0b149a1d3afac56fa74648032bcf46b-refs/branch-heads/4324@{#1784}) on port 26197
  353. Only local connections are allowed.
  354. Please see https://chromedriver.chromium.org/security-considerations for suggestions on keeping ChromeDriver safe.
  355. ChromeDriver was started successfully.
  356. Mar 09, 2021 8:26:29 PM org.openqa.selenium.remote.ProtocolHandshake createSession
  357. INFO: Detected dialect: W3C
  358. Running locally...
  359. Starting ChromeDriver 88.0.4324.96 (68dba2d8a0b149a1d3afac56fa74648032bcf46b-refs/branch-heads/4324@{#1784}) on port 14592
  360. Only local connections are allowed.
  361. Please see https://chromedriver.chromium.org/security-considerations for suggestions on keeping ChromeDriver safe.
  362. ChromeDriver was started successfully.
  363. Mar 09, 2021 8:26:30 PM org.openqa.selenium.remote.ProtocolHandshake createSession
  364. INFO: Detected dialect: W3C
  365. Running locally...
  366. Starting ChromeDriver 88.0.4324.96 (68dba2d8a0b149a1d3afac56fa74648032bcf46b-refs/branch-heads/4324@{#1784}) on port 29207
  367. Only local connections are allowed.
  368. Please see https://chromedriver.chromium.org/security-considerations for suggestions on keeping ChromeDriver safe.
  369. ChromeDriver was started successfully.
  370. Mar 09, 2021 8:27:43 PM org.openqa.selenium.remote.ProtocolHandshake createSession
  371. INFO: Detected dialect: W3C
  372. Running locally...
  373. Starting ChromeDriver 88.0.4324.96 (68dba2d8a0b149a1d3afac56fa74648032bcf46b-refs/branch-heads/4324@{#1784}) on port 24173
  374. Only local connections are allowed.
  375. Please see https://chromedriver.chromium.org/security-considerations for suggestions on keeping ChromeDriver safe.
  376. ChromeDriver was started successfully.
  377. Mar 09, 2021 8:27:44 PM org.openqa.selenium.remote.ProtocolHandshake createSession
  378. INFO: Detected dialect: W3C
  379. Running locally...
  380. Starting ChromeDriver 88.0.4324.96 (68dba2d8a0b149a1d3afac56fa74648032bcf46b-refs/branch-heads/4324@{#1784}) on port 31943
  381. Only local connections are allowed.
  382. Please see https://chromedriver.chromium.org/security-considerations for suggestions on keeping ChromeDriver safe.
  383. ChromeDriver was started successfully.
  384. Mar 09, 2021 8:27:44 PM org.openqa.selenium.remote.ProtocolHandshake createSession
  385. INFO: Detected dialect: W3C
  386. Running locally...
  387. Starting ChromeDriver 88.0.4324.96 (68dba2d8a0b149a1d3afac56fa74648032bcf46b-refs/branch-heads/4324@{#1784}) on port 8656
  388. Only local connections are allowed.
  389. Please see https://chromedriver.chromium.org/security-considerations for suggestions on keeping ChromeDriver safe.
  390. ChromeDriver was started successfully.
  391. Mar 09, 2021 8:27:45 PM org.openqa.selenium.remote.ProtocolHandshake createSession
  392. INFO: Detected dialect: W3C
  393. Running locally...
  394. Starting ChromeDriver 88.0.4324.96 (68dba2d8a0b149a1d3afac56fa74648032bcf46b-refs/branch-heads/4324@{#1784}) on port 17251
  395. Only local connections are allowed.
  396. Please see https://chromedriver.chromium.org/security-considerations for suggestions on keeping ChromeDriver safe.
  397. ChromeDriver was started successfully.
  398. Mar 09, 2021 8:27:46 PM org.openqa.selenium.remote.ProtocolHandshake createSession
  399. INFO: Detected dialect: W3C
  400. Running locally...
  401. Starting ChromeDriver 88.0.4324.96 (68dba2d8a0b149a1d3afac56fa74648032bcf46b-refs/branch-heads/4324@{#1784}) on port 26917
  402. Only local connections are allowed.
  403. Please see https://chromedriver.chromium.org/security-considerations for suggestions on keeping ChromeDriver safe.
  404. ChromeDriver was started successfully.
  405. Mar 09, 2021 8:28:43 PM org.openqa.selenium.remote.ProtocolHandshake createSession
  406. INFO: Detected dialect: W3C
  407. Running locally...
  408. Starting ChromeDriver 88.0.4324.96 (68dba2d8a0b149a1d3afac56fa74648032bcf46b-refs/branch-heads/4324@{#1784}) on port 30170
  409. Only local connections are allowed.
  410. Please see https://chromedriver.chromium.org/security-considerations for suggestions on keeping ChromeDriver safe.
  411. ChromeDriver was started successfully.
  412. Mar 09, 2021 8:29:41 PM org.openqa.selenium.remote.ProtocolHandshake createSession
  413. INFO: Detected dialect: W3C
  414. Running locally...
  415. Starting ChromeDriver 88.0.4324.96 (68dba2d8a0b149a1d3afac56fa74648032bcf46b-refs/branch-heads/4324@{#1784}) on port 32684
  416. Only local connections are allowed.
  417. Please see https://chromedriver.chromium.org/security-considerations for suggestions on keeping ChromeDriver safe.
  418. ChromeDriver was started successfully.
  419. Mar 09, 2021 8:29:42 PM org.openqa.selenium.remote.ProtocolHandshake createSession
  420. INFO: Detected dialect: W3C
  421. Running locally...
  422. Starting ChromeDriver 88.0.4324.96 (68dba2d8a0b149a1d3afac56fa74648032bcf46b-refs/branch-heads/4324@{#1784}) on port 27495
  423. Only local connections are allowed.
  424. Please see https://chromedriver.chromium.org/security-considerations for suggestions on keeping ChromeDriver safe.
  425. ChromeDriver was started successfully.
  426. Mar 09, 2021 8:29:43 PM org.openqa.selenium.remote.ProtocolHandshake createSession
  427. INFO: Detected dialect: W3C
  428. Running locally...
  429. Starting ChromeDriver 88.0.4324.96 (68dba2d8a0b149a1d3afac56fa74648032bcf46b-refs/branch-heads/4324@{#1784}) on port 1756
  430. Only local connections are allowed.
  431. Please see https://chromedriver.chromium.org/security-considerations for suggestions on keeping ChromeDriver safe.
  432. ChromeDriver was started successfully.
  433. Mar 09, 2021 8:29:44 PM org.openqa.selenium.remote.ProtocolHandshake createSession
  434. INFO: Detected dialect: W3C
  435. Running locally...
  436. Starting ChromeDriver 88.0.4324.96 (68dba2d8a0b149a1d3afac56fa74648032bcf46b-refs/branch-heads/4324@{#1784}) on port 4633
  437. Only local connections are allowed.
  438. Please see https://chromedriver.chromium.org/security-considerations for suggestions on keeping ChromeDriver safe.
  439. ChromeDriver was started successfully.
  440. Mar 09, 2021 8:29:44 PM org.openqa.selenium.remote.ProtocolHandshake createSession
  441. INFO: Detected dialect: W3C
  442. Running locally...
  443. Starting ChromeDriver 88.0.4324.96 (68dba2d8a0b149a1d3afac56fa74648032bcf46b-refs/branch-heads/4324@{#1784}) on port 13518
  444. Only local connections are allowed.
  445. Please see https://chromedriver.chromium.org/security-considerations for suggestions on keeping ChromeDriver safe.
  446. ChromeDriver was started successfully.
  447. Mar 09, 2021 8:29:45 PM org.openqa.selenium.remote.ProtocolHandshake createSession
  448. INFO: Detected dialect: W3C
  449. Running locally...
  450. Starting ChromeDriver 88.0.4324.96 (68dba2d8a0b149a1d3afac56fa74648032bcf46b-refs/branch-heads/4324@{#1784}) on port 7887
  451. Only local connections are allowed.
  452. Please see https://chromedriver.chromium.org/security-considerations for suggestions on keeping ChromeDriver safe.
  453. ChromeDriver was started successfully.
  454. Mar 09, 2021 8:30:56 PM org.openqa.selenium.remote.ProtocolHandshake createSession
  455. INFO: Detected dialect: W3C
  456. Running locally...
  457. Starting ChromeDriver 88.0.4324.96 (68dba2d8a0b149a1d3afac56fa74648032bcf46b-refs/branch-heads/4324@{#1784}) on port 22137
  458. Only local connections are allowed.
  459. Please see https://chromedriver.chromium.org/security-considerations for suggestions on keeping ChromeDriver safe.
  460. ChromeDriver was started successfully.
  461. Mar 09, 2021 8:30:56 PM org.openqa.selenium.remote.ProtocolHandshake createSession
  462. INFO: Detected dialect: W3C
  463. Running locally...
  464. Starting ChromeDriver 88.0.4324.96 (68dba2d8a0b149a1d3afac56fa74648032bcf46b-refs/branch-heads/4324@{#1784}) on port 30894
  465. Only local connections are allowed.
  466. Please see https://chromedriver.chromium.org/security-considerations for suggestions on keeping ChromeDriver safe.
  467. ChromeDriver was started successfully.
  468. Mar 09, 2021 8:30:57 PM org.openqa.selenium.remote.ProtocolHandshake createSession
  469. INFO: Detected dialect: W3C
  470. Running locally...
  471. Starting ChromeDriver 88.0.4324.96 (68dba2d8a0b149a1d3afac56fa74648032bcf46b-refs/branch-heads/4324@{#1784}) on port 4345
  472. Only local connections are allowed.
  473. Please see https://chromedriver.chromium.org/security-considerations for suggestions on keeping ChromeDriver safe.
  474. ChromeDriver was started successfully.
  475. Mar 09, 2021 8:31:56 PM org.openqa.selenium.remote.ProtocolHandshake createSession
  476. INFO: Detected dialect: W3C
  477. Running locally...
  478. Starting ChromeDriver 88.0.4324.96 (68dba2d8a0b149a1d3afac56fa74648032bcf46b-refs/branch-heads/4324@{#1784}) on port 12159
  479. Only local connections are allowed.
  480. Please see https://chromedriver.chromium.org/security-considerations for suggestions on keeping ChromeDriver safe.
  481. ChromeDriver was started successfully.
  482. Mar 09, 2021 8:31:56 PM org.openqa.selenium.remote.ProtocolHandshake createSession
  483. INFO: Detected dialect: W3C
  484. Running locally...
  485. Starting ChromeDriver 88.0.4324.96 (68dba2d8a0b149a1d3afac56fa74648032bcf46b-refs/branch-heads/4324@{#1784}) on port 23620
  486. Only local connections are allowed.
  487. Please see https://chromedriver.chromium.org/security-considerations for suggestions on keeping ChromeDriver safe.
  488. ChromeDriver was started successfully.
  489. Mar 09, 2021 8:31:57 PM org.openqa.selenium.remote.ProtocolHandshake createSession
  490. INFO: Detected dialect: W3C
  491. Running locally...
  492. Starting ChromeDriver 88.0.4324.96 (68dba2d8a0b149a1d3afac56fa74648032bcf46b-refs/branch-heads/4324@{#1784}) on port 30092
  493. Only local connections are allowed.
  494. Please see https://chromedriver.chromium.org/security-considerations for suggestions on keeping ChromeDriver safe.
  495. ChromeDriver was started successfully.
  496. Mar 09, 2021 8:32:16 PM org.openqa.selenium.remote.ProtocolHandshake createSession
  497. INFO: Detected dialect: W3C
  498. Running locally...
  499. Starting ChromeDriver 88.0.4324.96 (68dba2d8a0b149a1d3afac56fa74648032bcf46b-refs/branch-heads/4324@{#1784}) on port 16974
  500. Only local connections are allowed.
  501. Please see https://chromedriver.chromium.org/security-considerations for suggestions on keeping ChromeDriver safe.
  502. ChromeDriver was started successfully.
  503. Mar 09, 2021 8:32:17 PM org.openqa.selenium.remote.ProtocolHandshake createSession
  504. INFO: Detected dialect: W3C
  505. Running locally...
  506. Starting ChromeDriver 88.0.4324.96 (68dba2d8a0b149a1d3afac56fa74648032bcf46b-refs/branch-heads/4324@{#1784}) on port 21835
  507. Only local connections are allowed.
  508. Please see https://chromedriver.chromium.org/security-considerations for suggestions on keeping ChromeDriver safe.
  509. ChromeDriver was started successfully.
  510. Mar 09, 2021 8:32:18 PM org.openqa.selenium.remote.ProtocolHandshake createSession
  511. INFO: Detected dialect: W3C
  512. Running locally...
  513. Starting ChromeDriver 88.0.4324.96 (68dba2d8a0b149a1d3afac56fa74648032bcf46b-refs/branch-heads/4324@{#1784}) on port 21966
  514. Only local connections are allowed.
  515. Please see https://chromedriver.chromium.org/security-considerations for suggestions on keeping ChromeDriver safe.
  516. ChromeDriver was started successfully.
  517. Mar 09, 2021 8:32:19 PM org.openqa.selenium.remote.ProtocolHandshake createSession
  518. INFO: Detected dialect: W3C
  519. Running locally...
  520. Starting ChromeDriver 88.0.4324.96 (68dba2d8a0b149a1d3afac56fa74648032bcf46b-refs/branch-heads/4324@{#1784}) on port 32460
  521. Only local connections are allowed.
  522. Please see https://chromedriver.chromium.org/security-considerations for suggestions on keeping ChromeDriver safe.
  523. ChromeDriver was started successfully.
  524. Mar 09, 2021 8:32:20 PM org.openqa.selenium.remote.ProtocolHandshake createSession
  525. INFO: Detected dialect: W3C
  526. Running locally...
  527. Starting ChromeDriver 88.0.4324.96 (68dba2d8a0b149a1d3afac56fa74648032bcf46b-refs/branch-heads/4324@{#1784}) on port 2596
  528. Only local connections are allowed.
  529. Please see https://chromedriver.chromium.org/security-considerations for suggestions on keeping ChromeDriver safe.
  530. ChromeDriver was started successfully.
  531. Mar 09, 2021 8:32:20 PM org.openqa.selenium.remote.ProtocolHandshake createSession
  532. INFO: Detected dialect: W3C
  533. Running locally...
  534. Starting ChromeDriver 88.0.4324.96 (68dba2d8a0b149a1d3afac56fa74648032bcf46b-refs/branch-heads/4324@{#1784}) on port 18331
  535. Only local connections are allowed.
  536. Please see https://chromedriver.chromium.org/security-considerations for suggestions on keeping ChromeDriver safe.
  537. ChromeDriver was started successfully.
  538. Mar 09, 2021 8:32:46 PM org.openqa.selenium.remote.ProtocolHandshake createSession
  539. INFO: Detected dialect: W3C
  540. Running locally...
  541. Starting ChromeDriver 88.0.4324.96 (68dba2d8a0b149a1d3afac56fa74648032bcf46b-refs/branch-heads/4324@{#1784}) on port 20980
  542. Only local connections are allowed.
  543. Please see https://chromedriver.chromium.org/security-considerations for suggestions on keeping ChromeDriver safe.
  544. ChromeDriver was started successfully.
  545. Mar 09, 2021 8:32:47 PM org.openqa.selenium.remote.ProtocolHandshake createSession
  546. INFO: Detected dialect: W3C
  547. Running locally...
  548. Starting ChromeDriver 88.0.4324.96 (68dba2d8a0b149a1d3afac56fa74648032bcf46b-refs/branch-heads/4324@{#1784}) on port 9065
  549. Only local connections are allowed.
  550. Please see https://chromedriver.chromium.org/security-considerations for suggestions on keeping ChromeDriver safe.
  551. ChromeDriver was started successfully.
  552. Mar 09, 2021 8:32:49 PM org.openqa.selenium.remote.ProtocolHandshake createSession
  553. INFO: Detected dialect: W3C
  554. Running locally...
  555. Starting ChromeDriver 88.0.4324.96 (68dba2d8a0b149a1d3afac56fa74648032bcf46b-refs/branch-heads/4324@{#1784}) on port 14621
  556. Only local connections are allowed.
  557. Please see https://chromedriver.chromium.org/security-considerations for suggestions on keeping ChromeDriver safe.
  558. ChromeDriver was started successfully.
  559. Mar 09, 2021 8:32:50 PM org.openqa.selenium.remote.ProtocolHandshake createSession
  560. INFO: Detected dialect: W3C
  561. Running locally...
  562. Starting ChromeDriver 88.0.4324.96 (68dba2d8a0b149a1d3afac56fa74648032bcf46b-refs/branch-heads/4324@{#1784}) on port 18213
  563. Only local connections are allowed.
  564. Please see https://chromedriver.chromium.org/security-considerations for suggestions on keeping ChromeDriver safe.
  565. ChromeDriver was started successfully.
  566. Mar 09, 2021 8:32:51 PM org.openqa.selenium.remote.ProtocolHandshake createSession
  567. INFO: Detected dialect: W3C
  568. Running locally...
  569. Starting ChromeDriver 88.0.4324.96 (68dba2d8a0b149a1d3afac56fa74648032bcf46b-refs/branch-heads/4324@{#1784}) on port 8231
  570. Only local connections are allowed.
  571. Please see https://chromedriver.chromium.org/security-considerations for suggestions on keeping ChromeDriver safe.
  572. ChromeDriver was started successfully.
  573. Mar 09, 2021 8:32:51 PM org.openqa.selenium.remote.ProtocolHandshake createSession
  574. INFO: Detected dialect: W3C
  575. Running locally...
  576. Starting ChromeDriver 88.0.4324.96 (68dba2d8a0b149a1d3afac56fa74648032bcf46b-refs/branch-heads/4324@{#1784}) on port 28118
  577. Only local connections are allowed.
  578. Please see https://chromedriver.chromium.org/security-considerations for suggestions on keeping ChromeDriver safe.
  579. ChromeDriver was started successfully.
  580. Mar 09, 2021 8:33:19 PM org.openqa.selenium.remote.ProtocolHandshake createSession
  581. INFO: Detected dialect: W3C
  582. Running locally...
  583. Starting ChromeDriver 88.0.4324.96 (68dba2d8a0b149a1d3afac56fa74648032bcf46b-refs/branch-heads/4324@{#1784}) on port 26643
  584. Only local connections are allowed.
  585. Please see https://chromedriver.chromium.org/security-considerations for suggestions on keeping ChromeDriver safe.
  586. ChromeDriver was started successfully.
  587. Mar 09, 2021 8:33:20 PM org.openqa.selenium.remote.ProtocolHandshake createSession
  588. INFO: Detected dialect: W3C
  589. Running locally...
  590. Starting ChromeDriver 88.0.4324.96 (68dba2d8a0b149a1d3afac56fa74648032bcf46b-refs/branch-heads/4324@{#1784}) on port 16021
  591. Only local connections are allowed.
  592. Please see https://chromedriver.chromium.org/security-considerations for suggestions on keeping ChromeDriver safe.
  593. ChromeDriver was started successfully.
  594. Mar 09, 2021 8:33:21 PM org.openqa.selenium.remote.ProtocolHandshake createSession
  595. INFO: Detected dialect: W3C
  596. Running locally...
  597. Starting ChromeDriver 88.0.4324.96 (68dba2d8a0b149a1d3afac56fa74648032bcf46b-refs/branch-heads/4324@{#1784}) on port 22114
  598. Only local connections are allowed.
  599. Please see https://chromedriver.chromium.org/security-considerations for suggestions on keeping ChromeDriver safe.
  600. ChromeDriver was started successfully.
  601. Mar 09, 2021 8:33:22 PM org.openqa.selenium.remote.ProtocolHandshake createSession
  602. INFO: Detected dialect: W3C
  603. Running locally...
  604. Starting ChromeDriver 88.0.4324.96 (68dba2d8a0b149a1d3afac56fa74648032bcf46b-refs/branch-heads/4324@{#1784}) on port 25760
  605. Only local connections are allowed.
  606. Please see https://chromedriver.chromium.org/security-considerations for suggestions on keeping ChromeDriver safe.
  607. ChromeDriver was started successfully.
  608. Mar 09, 2021 8:33:23 PM org.openqa.selenium.remote.ProtocolHandshake createSession
  609. INFO: Detected dialect: W3C
  610. Running locally...
  611. Starting ChromeDriver 88.0.4324.96 (68dba2d8a0b149a1d3afac56fa74648032bcf46b-refs/branch-heads/4324@{#1784}) on port 12098
  612. Only local connections are allowed.
  613. Please see https://chromedriver.chromium.org/security-considerations for suggestions on keeping ChromeDriver safe.
  614. ChromeDriver was started successfully.
  615. Mar 09, 2021 8:33:24 PM org.openqa.selenium.remote.ProtocolHandshake createSession
  616. INFO: Detected dialect: W3C
  617. Running locally...
  618. Starting ChromeDriver 88.0.4324.96 (68dba2d8a0b149a1d3afac56fa74648032bcf46b-refs/branch-heads/4324@{#1784}) on port 30503
  619. Only local connections are allowed.
  620. Please see https://chromedriver.chromium.org/security-considerations for suggestions on keeping ChromeDriver safe.
  621. ChromeDriver was started successfully.
  622. Mar 09, 2021 8:33:52 PM org.openqa.selenium.remote.ProtocolHandshake createSession
  623. INFO: Detected dialect: W3C
  624. Running locally...
  625. Starting ChromeDriver 88.0.4324.96 (68dba2d8a0b149a1d3afac56fa74648032bcf46b-refs/branch-heads/4324@{#1784}) on port 17427
  626. Only local connections are allowed.
  627. Please see https://chromedriver.chromium.org/security-considerations for suggestions on keeping ChromeDriver safe.
  628. ChromeDriver was started successfully.
  629. Mar 09, 2021 8:33:52 PM org.openqa.selenium.remote.ProtocolHandshake createSession
  630. INFO: Detected dialect: W3C
  631. Running locally...
  632. Starting ChromeDriver 88.0.4324.96 (68dba2d8a0b149a1d3afac56fa74648032bcf46b-refs/branch-heads/4324@{#1784}) on port 17665
  633. Only local connections are allowed.
  634. Please see https://chromedriver.chromium.org/security-considerations for suggestions on keeping ChromeDriver safe.
  635. ChromeDriver was started successfully.
  636. Mar 09, 2021 8:33:53 PM org.openqa.selenium.remote.ProtocolHandshake createSession
  637. INFO: Detected dialect: W3C
  638. Running locally...
  639. Starting ChromeDriver 88.0.4324.96 (68dba2d8a0b149a1d3afac56fa74648032bcf46b-refs/branch-heads/4324@{#1784}) on port 17305
  640. Only local connections are allowed.
  641. Please see https://chromedriver.chromium.org/security-considerations for suggestions on keeping ChromeDriver safe.
  642. ChromeDriver was started successfully.
  643. Mar 09, 2021 8:33:54 PM org.openqa.selenium.remote.ProtocolHandshake createSession
  644. INFO: Detected dialect: W3C
  645. Running locally...
  646. Starting ChromeDriver 88.0.4324.96 (68dba2d8a0b149a1d3afac56fa74648032bcf46b-refs/branch-heads/4324@{#1784}) on port 6242
  647. Only local connections are allowed.
  648. Please see https://chromedriver.chromium.org/security-considerations for suggestions on keeping ChromeDriver safe.
  649. ChromeDriver was started successfully.
  650. Mar 09, 2021 8:33:55 PM org.openqa.selenium.remote.ProtocolHandshake createSession
  651. INFO: Detected dialect: W3C
  652. Running locally...
  653. Starting ChromeDriver 88.0.4324.96 (68dba2d8a0b149a1d3afac56fa74648032bcf46b-refs/branch-heads/4324@{#1784}) on port 1377
  654. Only local connections are allowed.
  655. Please see https://chromedriver.chromium.org/security-considerations for suggestions on keeping ChromeDriver safe.
  656. ChromeDriver was started successfully.
  657. Mar 09, 2021 8:33:56 PM org.openqa.selenium.remote.ProtocolHandshake createSession
  658. INFO: Detected dialect: W3C
  659. Running locally...
  660. Starting ChromeDriver 88.0.4324.96 (68dba2d8a0b149a1d3afac56fa74648032bcf46b-refs/branch-heads/4324@{#1784}) on port 2188
  661. Only local connections are allowed.
  662. Please see https://chromedriver.chromium.org/security-considerations for suggestions on keeping ChromeDriver safe.
  663. ChromeDriver was started successfully.
  664. Mar 09, 2021 8:34:21 PM org.openqa.selenium.remote.ProtocolHandshake createSession
  665. INFO: Detected dialect: W3C
  666. Running locally...
  667. Starting ChromeDriver 88.0.4324.96 (68dba2d8a0b149a1d3afac56fa74648032bcf46b-refs/branch-heads/4324@{#1784}) on port 16511
  668. Only local connections are allowed.
  669. Please see https://chromedriver.chromium.org/security-considerations for suggestions on keeping ChromeDriver safe.
  670. ChromeDriver was started successfully.
  671. Mar 09, 2021 8:34:21 PM org.openqa.selenium.remote.ProtocolHandshake createSession
  672. INFO: Detected dialect: W3C
  673. Running locally...
  674. Starting ChromeDriver 88.0.4324.96 (68dba2d8a0b149a1d3afac56fa74648032bcf46b-refs/branch-heads/4324@{#1784}) on port 21110
  675. Only local connections are allowed.
  676. Please see https://chromedriver.chromium.org/security-considerations for suggestions on keeping ChromeDriver safe.
  677. ChromeDriver was started successfully.
  678. Mar 09, 2021 8:34:22 PM org.openqa.selenium.remote.ProtocolHandshake createSession
  679. INFO: Detected dialect: W3C
  680. Running locally...
  681. Starting ChromeDriver 88.0.4324.96 (68dba2d8a0b149a1d3afac56fa74648032bcf46b-refs/branch-heads/4324@{#1784}) on port 23067
  682. Only local connections are allowed.
  683. Please see https://chromedriver.chromium.org/security-considerations for suggestions on keeping ChromeDriver safe.
  684. ChromeDriver was started successfully.
  685. Mar 09, 2021 8:34:23 PM org.openqa.selenium.remote.ProtocolHandshake createSession
  686. INFO: Detected dialect: W3C
  687. Running locally...
  688. Starting ChromeDriver 88.0.4324.96 (68dba2d8a0b149a1d3afac56fa74648032bcf46b-refs/branch-heads/4324@{#1784}) on port 29454
  689. Only local connections are allowed.
  690. Please see https://chromedriver.chromium.org/security-considerations for suggestions on keeping ChromeDriver safe.
  691. ChromeDriver was started successfully.
  692. Mar 09, 2021 8:34:24 PM org.openqa.selenium.remote.ProtocolHandshake createSession
  693. INFO: Detected dialect: W3C
  694. Running locally...
  695. Starting ChromeDriver 88.0.4324.96 (68dba2d8a0b149a1d3afac56fa74648032bcf46b-refs/branch-heads/4324@{#1784}) on port 22612
  696. Only local connections are allowed.
  697. Please see https://chromedriver.chromium.org/security-considerations for suggestions on keeping ChromeDriver safe.
  698. ChromeDriver was started successfully.
  699. Mar 09, 2021 8:34:24 PM org.openqa.selenium.remote.ProtocolHandshake createSession
  700. INFO: Detected dialect: W3C
  701. Running locally...
  702. Starting ChromeDriver 88.0.4324.96 (68dba2d8a0b149a1d3afac56fa74648032bcf46b-refs/branch-heads/4324@{#1784}) on port 15368
  703. Only local connections are allowed.
  704. Please see https://chromedriver.chromium.org/security-considerations for suggestions on keeping ChromeDriver safe.
  705. ChromeDriver was started successfully.
  706. Mar 09, 2021 8:34:41 PM org.openqa.selenium.remote.ProtocolHandshake createSession
  707. INFO: Detected dialect: W3C
  708. Running locally...
  709. Starting ChromeDriver 88.0.4324.96 (68dba2d8a0b149a1d3afac56fa74648032bcf46b-refs/branch-heads/4324@{#1784}) on port 31505
  710. Only local connections are allowed.
  711. Please see https://chromedriver.chromium.org/security-considerations for suggestions on keeping ChromeDriver safe.
  712. ChromeDriver was started successfully.
  713. Mar 09, 2021 8:34:42 PM org.openqa.selenium.remote.ProtocolHandshake createSession
  714. INFO: Detected dialect: W3C
  715. Running locally...
  716. Starting ChromeDriver 88.0.4324.96 (68dba2d8a0b149a1d3afac56fa74648032bcf46b-refs/branch-heads/4324@{#1784}) on port 31930
  717. Only local connections are allowed.
  718. Please see https://chromedriver.chromium.org/security-considerations for suggestions on keeping ChromeDriver safe.
  719. ChromeDriver was started successfully.
  720. Mar 09, 2021 8:34:43 PM org.openqa.selenium.remote.ProtocolHandshake createSession
  721. INFO: Detected dialect: W3C
  722. Running locally...
  723. Starting ChromeDriver 88.0.4324.96 (68dba2d8a0b149a1d3afac56fa74648032bcf46b-refs/branch-heads/4324@{#1784}) on port 7704
  724. Only local connections are allowed.
  725. Please see https://chromedriver.chromium.org/security-considerations for suggestions on keeping ChromeDriver safe.
  726. ChromeDriver was started successfully.
  727. Mar 09, 2021 8:34:44 PM org.openqa.selenium.remote.ProtocolHandshake createSession
  728. INFO: Detected dialect: W3C
  729. Running locally...
  730. Starting ChromeDriver 88.0.4324.96 (68dba2d8a0b149a1d3afac56fa74648032bcf46b-refs/branch-heads/4324@{#1784}) on port 19054
  731. Only local connections are allowed.
  732. Please see https://chromedriver.chromium.org/security-considerations for suggestions on keeping ChromeDriver safe.
  733. ChromeDriver was started successfully.
  734. Mar 09, 2021 8:34:45 PM org.openqa.selenium.remote.ProtocolHandshake createSession
  735. INFO: Detected dialect: W3C
  736. Tests run: 16, Failures: 0, Errors: 2, Skipped: 0, Time elapsed: 602.127 sec <<< FAILURE!
  737. Searching an existing patient(Patient Search) Time elapsed: 132.854 sec <<< ERROR!
  738. org.openqa.selenium.remote.UnreachableBrowserException: Error communicating with the remote browser. It may have died.
  739. Build info: version: '4.0.0-alpha-6', revision: '5f43a29cfc'
  740. System info: host: 'irynah-Vostro-3560', ip: '127.0.1.1', os.name: 'Linux', os.arch: 'amd64', os.version: '5.4.0-66-generic', java.version: '1.8.0_282'
  741. Driver info: driver.version: RemoteWebDriver
  742. Capabilities {acceptInsecureCerts: false, browserName: chrome, browserVersion: 88.0.4324.182, chrome: {chromedriverVersion: 88.0.4324.96 (68dba2d8a0b14..., userDataDir: /tmp/.com.google.Chrome.VpgT81}, goog:chromeOptions: {debuggerAddress: localhost:37693}, javascriptEnabled: true, networkConnectionEnabled: false, pageLoadStrategy: normal, platform: LINUX, platformName: LINUX, proxy: Proxy(), setWindowRect: true, strictFileInteractability: false, timeouts: {implicit: 0, pageLoad: 300000, script: 30000}, unhandledPromptBehavior: dismiss and notify, webauthn:extension:largeBlob: true, webauthn:virtualAuthenticators: true}
  743. Session ID: e81098052da2e438b79e725f587b261b
  744. at org.openqa.selenium.remote.RemoteWebDriver.execute(RemoteWebDriver.java:603)
  745. at org.openqa.selenium.remote.RemoteWebDriver.findElement(RemoteWebDriver.java:333)
  746. at org.openqa.selenium.remote.RemoteWebDriver.findElementByCssSelector(RemoteWebDriver.java:441)
  747. at org.openqa.selenium.By$ByCssSelector.findElement(By.java:494)
  748. at org.openqa.selenium.remote.RemoteWebDriver.findElement(RemoteWebDriver.java:325)
  749. at org.openmrs.contrib.qaframework.automation.Steps.getElement(Steps.java:42)
  750. at org.openmrs.contrib.qaframework.automation.FindPatientSteps.loadPatientDashboard(FindPatientSteps.java:62)
  751. at ✽.System loads patient dashboard(file:///media/irynah/DATA/0NEW-108G/0PROJECTS/OpenMRS-projects/openmrs-contrib-qaframework/src/test/resources/features/07-patient/findPatient.feature:17)
  752. Caused by: java.lang.RuntimeException: NettyHttpHandler request execution error
  753. at org.openqa.selenium.remote.http.netty.NettyHttpHandler.makeCall(NettyHttpHandler.java:72)
  754. at org.openqa.selenium.remote.http.AddSeleniumUserAgent.lambda$apply$0(AddSeleniumUserAgent.java:42)
  755. at org.openqa.selenium.remote.http.Filter.lambda$andFinally$1(Filter.java:56)
  756. at org.openqa.selenium.remote.http.netty.NettyHttpHandler.execute(NettyHttpHandler.java:47)
  757. at org.openqa.selenium.remote.http.AddSeleniumUserAgent.lambda$apply$0(AddSeleniumUserAgent.java:42)
  758. at org.openqa.selenium.remote.http.Filter.lambda$andFinally$1(Filter.java:56)
  759. at org.openqa.selenium.remote.http.netty.NettyClient.execute(NettyClient.java:55)
  760. at org.openqa.selenium.remote.HttpCommandExecutor.execute(HttpCommandExecutor.java:157)
  761. at org.openqa.selenium.remote.service.DriverCommandExecutor.execute(DriverCommandExecutor.java:83)
  762. at org.openqa.selenium.remote.RemoteWebDriver.execute(RemoteWebDriver.java:582)
  763. at org.openqa.selenium.remote.RemoteWebDriver.findElement(RemoteWebDriver.java:333)
  764. at org.openqa.selenium.remote.RemoteWebDriver.findElementByCssSelector(RemoteWebDriver.java:441)
  765. at org.openqa.selenium.By$ByCssSelector.findElement(By.java:494)
  766. at org.openqa.selenium.remote.RemoteWebDriver.findElement(RemoteWebDriver.java:325)
  767. at org.openmrs.contrib.qaframework.automation.Steps.getElement(Steps.java:42)
  768. at org.openmrs.contrib.qaframework.automation.FindPatientSteps.loadPatientDashboard(FindPatientSteps.java:62)
  769. at sun.reflect.NativeMethodAccessorImpl.invoke0(Native Method)
  770. at sun.reflect.NativeMethodAccessorImpl.invoke(NativeMethodAccessorImpl.java:62)
  771. at sun.reflect.DelegatingMethodAccessorImpl.invoke(DelegatingMethodAccessorImpl.java:43)
  772. at java.lang.reflect.Method.invoke(Method.java:498)
  773. at io.cucumber.java.Invoker.doInvoke(Invoker.java:66)
  774. at io.cucumber.java.Invoker.invoke(Invoker.java:24)
  775. at io.cucumber.java.AbstractGlueDefinition.invokeMethod(AbstractGlueDefinition.java:47)
  776. at io.cucumber.java.JavaStepDefinition.execute(JavaStepDefinition.java:29)
  777. at io.cucumber.core.runner.CoreStepDefinition.execute(CoreStepDefinition.java:66)
  778. at io.cucumber.core.runner.PickleStepDefinitionMatch.runStep(PickleStepDefinitionMatch.java:63)
  779. at io.cucumber.core.runner.ExecutionMode$1.execute(ExecutionMode.java:10)
  780. at io.cucumber.core.runner.TestStep.executeStep(TestStep.java:92)
  781. at io.cucumber.core.runner.TestStep.run(TestStep.java:64)
  782. at io.cucumber.core.runner.PickleStepTestStep.run(PickleStepTestStep.java:51)
  783. at io.cucumber.core.runner.TestCase.run(TestCase.java:104)
  784. at io.cucumber.core.runner.Runner.runPickle(Runner.java:71)
  785. at io.cucumber.junit.PickleRunners$NoStepDescriptions.run(PickleRunners.java:151)
  786. at io.cucumber.junit.FeatureRunner.runChild(FeatureRunner.java:135)
  787. at io.cucumber.junit.FeatureRunner.runChild(FeatureRunner.java:27)
  788. at org.junit.runners.ParentRunner$4.run(ParentRunner.java:331)
  789. at org.junit.runners.ParentRunner$1.schedule(ParentRunner.java:79)
  790. at org.junit.runners.ParentRunner.runChildren(ParentRunner.java:329)
  791. at org.junit.runners.ParentRunner.access$100(ParentRunner.java:66)
  792. at org.junit.runners.ParentRunner$2.evaluate(ParentRunner.java:293)
  793. at org.junit.runners.ParentRunner$3.evaluate(ParentRunner.java:306)
  794. at org.junit.runners.ParentRunner.run(ParentRunner.java:413)
  795. at io.cucumber.junit.Cucumber.runChild(Cucumber.java:199)
  796. at io.cucumber.junit.Cucumber.runChild(Cucumber.java:90)
  797. at org.junit.runners.ParentRunner$4.run(ParentRunner.java:331)
  798. at org.junit.runners.ParentRunner$1.schedule(ParentRunner.java:79)
  799. at org.junit.runners.ParentRunner.runChildren(ParentRunner.java:329)
  800. at org.junit.runners.ParentRunner.access$100(ParentRunner.java:66)
  801. at org.junit.runners.ParentRunner$2.evaluate(ParentRunner.java:293)
  802. at io.cucumber.junit.Cucumber$RunCucumber.evaluate(Cucumber.java:234)
  803. at org.junit.runners.ParentRunner$3.evaluate(ParentRunner.java:306)
  804. at org.junit.runners.ParentRunner.run(ParentRunner.java:413)
  805. at org.apache.maven.surefire.junit4.JUnit4Provider.execute(JUnit4Provider.java:252)
  806. at org.apache.maven.surefire.junit4.JUnit4Provider.executeTestSet(JUnit4Provider.java:141)
  807. at org.apache.maven.surefire.junit4.JUnit4Provider.invoke(JUnit4Provider.java:112)
  808. at sun.reflect.NativeMethodAccessorImpl.invoke0(Native Method)
  809. at sun.reflect.NativeMethodAccessorImpl.invoke(NativeMethodAccessorImpl.java:62)
  810. at sun.reflect.DelegatingMethodAccessorImpl.invoke(DelegatingMethodAccessorImpl.java:43)
  811. at java.lang.reflect.Method.invoke(Method.java:498)
  812. at org.apache.maven.surefire.util.ReflectionUtils.invokeMethodWithArray(ReflectionUtils.java:189)
  813. at org.apache.maven.surefire.booter.ProviderFactory$ProviderProxy.invoke(ProviderFactory.java:165)
  814. at org.apache.maven.surefire.booter.ProviderFactory.invokeProvider(ProviderFactory.java:85)
  815. at org.apache.maven.surefire.booter.ForkedBooter.runSuitesInProcess(ForkedBooter.java:115)
  816. at org.apache.maven.surefire.booter.ForkedBooter.main(ForkedBooter.java:75)
  817. Caused by: java.util.concurrent.ExecutionException: java.util.concurrent.TimeoutException: Request timeout to localhost/127.0.0.1:14592 after 60000 ms
  818. at java.util.concurrent.CompletableFuture.reportGet(CompletableFuture.java:357)
  819. at java.util.concurrent.CompletableFuture.get(CompletableFuture.java:1908)
  820. at org.asynchttpclient.netty.NettyResponseFuture.get(NettyResponseFuture.java:201)
  821. at org.openqa.selenium.remote.http.netty.NettyHttpHandler.makeCall(NettyHttpHandler.java:57)
  822. ... 63 more
  823. Caused by: java.util.concurrent.TimeoutException: Request timeout to localhost/127.0.0.1:14592 after 60000 ms
  824. at org.asynchttpclient.netty.timeout.TimeoutTimerTask.expire(TimeoutTimerTask.java:43)
  825. at org.asynchttpclient.netty.timeout.RequestTimeoutTimerTask.run(RequestTimeoutTimerTask.java:50)
  826. at io.netty.util.HashedWheelTimer$HashedWheelTimeout.expire(HashedWheelTimer.java:672)
  827. at io.netty.util.HashedWheelTimer$HashedWheelBucket.expireTimeouts(HashedWheelTimer.java:747)
  828. at io.netty.util.HashedWheelTimer$Worker.run(HashedWheelTimer.java:472)
  829. at io.netty.util.concurrent.FastThreadLocalRunnable.run(FastThreadLocalRunnable.java:30)
  830. at java.lang.Thread.run(Thread.java:748)
  831.  
  832. Failing or Succeeding to register a patient #2(Patient Registration) Time elapsed: 131.992 sec <<< ERROR!
  833. org.openqa.selenium.remote.UnreachableBrowserException: Error communicating with the remote browser. It may have died.
  834. Build info: version: '4.0.0-alpha-6', revision: '5f43a29cfc'
  835. System info: host: 'irynah-Vostro-3560', ip: '127.0.1.1', os.name: 'Linux', os.arch: 'amd64', os.version: '5.4.0-66-generic', java.version: '1.8.0_282'
  836. Driver info: driver.version: RemoteWebDriver
  837. Capabilities {acceptInsecureCerts: false, browserName: chrome, browserVersion: 88.0.4324.182, chrome: {chromedriverVersion: 88.0.4324.96 (68dba2d8a0b14..., userDataDir: /tmp/.com.google.Chrome.fGj4Uf}, goog:chromeOptions: {debuggerAddress: localhost:38329}, javascriptEnabled: true, networkConnectionEnabled: false, pageLoadStrategy: normal, platform: LINUX, platformName: LINUX, proxy: Proxy(), setWindowRect: true, strictFileInteractability: false, timeouts: {implicit: 0, pageLoad: 300000, script: 30000}, unhandledPromptBehavior: dismiss and notify, webauthn:extension:largeBlob: true, webauthn:virtualAuthenticators: true}
  838. Session ID: 8f49661a855fbb582b9ce6f5f189cbdd
  839. at org.openqa.selenium.remote.RemoteWebDriver.execute(RemoteWebDriver.java:603)
  840. at org.openqa.selenium.remote.RemoteWebDriver.findElement(RemoteWebDriver.java:333)
  841. at org.openqa.selenium.remote.RemoteWebDriver.findElementByName(RemoteWebDriver.java:421)
  842. at org.openqa.selenium.By$ByName.findElement(By.java:311)
  843. at org.openqa.selenium.remote.RemoteWebDriver.findElement(RemoteWebDriver.java:325)
  844. at org.openqa.selenium.support.ui.ExpectedConditions$7.apply(ExpectedConditions.java:205)
  845. at org.openqa.selenium.support.ui.ExpectedConditions$7.apply(ExpectedConditions.java:201)
  846. at org.openqa.selenium.support.ui.FluentWait.lambda$checkConditionInLoop$2(FluentWait.java:233)
  847. at java.util.concurrent.CompletableFuture$AsyncSupply.run(CompletableFuture.java:1604)
  848. at java.util.concurrent.CompletableFuture$AsyncSupply.exec(CompletableFuture.java:1596)
  849. at java.util.concurrent.ForkJoinTask.doExec(ForkJoinTask.java:289)
  850. at java.util.concurrent.ForkJoinPool$WorkQueue.runTask(ForkJoinPool.java:1056)
  851. at java.util.concurrent.ForkJoinPool.runWorker(ForkJoinPool.java:1692)
  852. at java.util.concurrent.ForkJoinWorkerThread.run(ForkJoinWorkerThread.java:175)
  853. at ✽.User enters "wrong" patient details(file:///media/irynah/DATA/0NEW-108G/0PROJECTS/OpenMRS-projects/openmrs-contrib-qaframework/src/test/resources/features/07-patient/patientRegistration.feature:7)
  854. Caused by: java.lang.RuntimeException: NettyHttpHandler request execution error
  855. at org.openqa.selenium.remote.http.netty.NettyHttpHandler.makeCall(NettyHttpHandler.java:72)
  856. at org.openqa.selenium.remote.http.AddSeleniumUserAgent.lambda$apply$0(AddSeleniumUserAgent.java:42)
  857. at org.openqa.selenium.remote.http.Filter.lambda$andFinally$1(Filter.java:56)
  858. at org.openqa.selenium.remote.http.netty.NettyHttpHandler.execute(NettyHttpHandler.java:47)
  859. at org.openqa.selenium.remote.http.AddSeleniumUserAgent.lambda$apply$0(AddSeleniumUserAgent.java:42)
  860. at org.openqa.selenium.remote.http.Filter.lambda$andFinally$1(Filter.java:56)
  861. at org.openqa.selenium.remote.http.netty.NettyClient.execute(NettyClient.java:55)
  862. at org.openqa.selenium.remote.HttpCommandExecutor.execute(HttpCommandExecutor.java:157)
  863. at org.openqa.selenium.remote.service.DriverCommandExecutor.execute(DriverCommandExecutor.java:83)
  864. at org.openqa.selenium.remote.RemoteWebDriver.execute(RemoteWebDriver.java:582)
  865. at org.openqa.selenium.remote.RemoteWebDriver.findElement(RemoteWebDriver.java:333)
  866. at org.openqa.selenium.remote.RemoteWebDriver.findElementByName(RemoteWebDriver.java:421)
  867. at org.openqa.selenium.By$ByName.findElement(By.java:311)
  868. at org.openqa.selenium.remote.RemoteWebDriver.findElement(RemoteWebDriver.java:325)
  869. at org.openqa.selenium.support.ui.ExpectedConditions$7.apply(ExpectedConditions.java:205)
  870. at org.openqa.selenium.support.ui.ExpectedConditions$7.apply(ExpectedConditions.java:201)
  871. at org.openqa.selenium.support.ui.FluentWait.lambda$checkConditionInLoop$2(FluentWait.java:233)
  872. at java.util.concurrent.CompletableFuture$AsyncSupply.run(CompletableFuture.java:1604)
  873. at java.util.concurrent.CompletableFuture$AsyncSupply.exec(CompletableFuture.java:1596)
  874. at java.util.concurrent.ForkJoinTask.doExec(ForkJoinTask.java:289)
  875. at java.util.concurrent.ForkJoinPool$WorkQueue.runTask(ForkJoinPool.java:1056)
  876. at java.util.concurrent.ForkJoinPool.runWorker(ForkJoinPool.java:1692)
  877. at java.util.concurrent.ForkJoinWorkerThread.run(ForkJoinWorkerThread.java:175)
  878. Caused by: java.util.concurrent.ExecutionException: java.util.concurrent.TimeoutException: Request timeout to localhost/127.0.0.1:13518 after 60000 ms
  879. at java.util.concurrent.CompletableFuture.reportGet(CompletableFuture.java:357)
  880. at java.util.concurrent.CompletableFuture.get(CompletableFuture.java:1908)
  881. at org.asynchttpclient.netty.NettyResponseFuture.get(NettyResponseFuture.java:201)
  882. at org.openqa.selenium.remote.http.netty.NettyHttpHandler.makeCall(NettyHttpHandler.java:57)
  883. ... 22 more
  884. Caused by: java.util.concurrent.TimeoutException: Request timeout to localhost/127.0.0.1:13518 after 60000 ms
  885. at org.asynchttpclient.netty.timeout.TimeoutTimerTask.expire(TimeoutTimerTask.java:43)
  886. at org.asynchttpclient.netty.timeout.RequestTimeoutTimerTask.run(RequestTimeoutTimerTask.java:50)
  887. at io.netty.util.HashedWheelTimer$HashedWheelTimeout.expire(HashedWheelTimer.java:672)
  888. at io.netty.util.HashedWheelTimer$HashedWheelBucket.expireTimeouts(HashedWheelTimer.java:747)
  889. at io.netty.util.HashedWheelTimer$Worker.run(HashedWheelTimer.java:472)
  890. at io.netty.util.concurrent.FastThreadLocalRunnable.run(FastThreadLocalRunnable.java:30)
  891. at java.lang.Thread.run(Thread.java:748)
  892.  
  893.  
  894. Results :
  895.  
  896. Tests in error:
  897. Searching an existing patient(Patient Search): Error communicating with the remote browser. It may have died.(..)
  898. Failing or Succeeding to register a patient #2(Patient Registration): Error communicating with the remote browser. It may have died.(..)
  899.  
  900. Tests run: 16, Failures: 0, Errors: 2, Skipped: 0
  901.  
  902. [INFO] ------------------------------------------------------------------------
  903. [INFO] BUILD FAILURE
  904. [INFO] ------------------------------------------------------------------------
  905. [INFO] Total time: 10:11 min
  906. [INFO] Finished at: 2021-03-09T20:34:45+03:00
  907. [INFO] ------------------------------------------------------------------------
  908. [ERROR] Failed to execute goal org.apache.maven.plugins:maven-surefire-plugin:2.12.4:test (default-test) on project qaframework: There are test failures.
  909. [ERROR]
  910. [ERROR] Please refer to /media/irynah/DATA/0NEW-108G/0PROJECTS/OpenMRS-projects/openmrs-contrib-qaframework/target/surefire-reports for the individual test results.
  911. [ERROR] -> [Help 1]
  912. [ERROR]
  913. [ERROR] To see the full stack trace of the errors, re-run Maven with the -e switch.
  914. [ERROR] Re-run Maven using the -X switch to enable full debug logging.
  915. [ERROR]
  916. [ERROR] For more information about the errors and possible solutions, please read the following articles:
  917. [ERROR] [Help 1] http://cwiki.apache.org/confluence/display/MAVEN/MojoFailureException
  918. irynah@irynah-Vostro-3560:/media/irynah/DATA/0NEW-108G/0PROJECTS/OpenMRS-projects/openmrs-contrib-qaframework$
  919.  
Advertisement
Add Comment
Please, Sign In to add comment
Advertisement