Guest User

Urde compile log

a guest
May 10th, 2018
9
Never
Not a member of Pastebin yet? Sign Up, it unlocks many cool features!
  1. 23:57:46: Running steps for project urde...
  2. 23:57:46: Persisting CMake state...
  3. 23:57:51: Starting: "/usr/bin/cmake" --build . --target all -- VERBOSE=1
  4. /usr/bin/cmake -H/home/yonic/Documentos/urde -B/home/yonic/Documentos/urde-build --check-build-system CMakeFiles/Makefile.cmake 0
  5. /usr/bin/cmake -E cmake_progress_start /home/yonic/Documentos/urde-build/CMakeFiles /home/yonic/Documentos/urde-build/CMakeFiles/progress.marks
  6. /usr/bin/make -f CMakeFiles/Makefile2 all
  7. make[1]: Entering directory '/home/yonic/Documentos/urde-build'
  8. /usr/bin/make -f discord-rpc/src/CMakeFiles/discord-rpc.dir/build.make discord-rpc/src/CMakeFiles/discord-rpc.dir/depend
  9. make[2]: Entering directory '/home/yonic/Documentos/urde-build'
  10. cd /home/yonic/Documentos/urde-build && /usr/bin/cmake -E cmake_depends "Unix Makefiles" /home/yonic/Documentos/urde /home/yonic/Documentos/urde/discord-rpc/src /home/yonic/Documentos/urde-build /home/yonic/Documentos/urde-build/discord-rpc/src /home/yonic/Documentos/urde-build/discord-rpc/src/CMakeFiles/discord-rpc.dir/DependInfo.cmake --color=
  11. Dependee "/home/yonic/Documentos/urde-build/discord-rpc/src/CMakeFiles/discord-rpc.dir/DependInfo.cmake" is newer than depender "/home/yonic/Documentos/urde-build/discord-rpc/src/CMakeFiles/discord-rpc.dir/depend.internal".
  12. Dependee "/home/yonic/Documentos/urde-build/discord-rpc/src/CMakeFiles/CMakeDirectoryInformation.cmake" is newer than depender "/home/yonic/Documentos/urde-build/discord-rpc/src/CMakeFiles/discord-rpc.dir/depend.internal".
  13. Scanning dependencies of target discord-rpc
  14. make[2]: Leaving directory '/home/yonic/Documentos/urde-build'
  15. /usr/bin/make -f discord-rpc/src/CMakeFiles/discord-rpc.dir/build.make discord-rpc/src/CMakeFiles/discord-rpc.dir/build
  16. make[2]: Entering directory '/home/yonic/Documentos/urde-build'
  17. [ 1%] Building CXX object discord-rpc/src/CMakeFiles/discord-rpc.dir/discord-rpc.cpp.o
  18. cd /home/yonic/Documentos/urde-build/discord-rpc/src && /usr/bin/g++ -DDISCORD_LINUX -I/home/yonic/Documentos/urde/rapidjson/include -I/home/yonic/Documentos/urde/discord-rpc/include -I/include -msse2 -Wno-multichar -fno-exceptions -Wno-narrowing -Wno-nullability-completeness -Werror=return-type -g -g -Wall -Wextra -Wpedantic -Werror -Wno-unknown-pragmas -Wno-old-style-cast -Wno-c++98-compat -Wno-c++98-compat-pedantic -Wno-missing-noreturn -Wno-padded -Wno-covered-switch-default -Wno-exit-time-destructors -Wno-global-constructors -std=gnu++14 -o CMakeFiles/discord-rpc.dir/discord-rpc.cpp.o -c /home/yonic/Documentos/urde/discord-rpc/src/discord-rpc.cpp
  19. [ 1%] Building CXX object discord-rpc/src/CMakeFiles/discord-rpc.dir/rpc_connection.cpp.o
  20. cd /home/yonic/Documentos/urde-build/discord-rpc/src && /usr/bin/g++ -DDISCORD_LINUX -I/home/yonic/Documentos/urde/rapidjson/include -I/home/yonic/Documentos/urde/discord-rpc/include -I/include -msse2 -Wno-multichar -fno-exceptions -Wno-narrowing -Wno-nullability-completeness -Werror=return-type -g -g -Wall -Wextra -Wpedantic -Werror -Wno-unknown-pragmas -Wno-old-style-cast -Wno-c++98-compat -Wno-c++98-compat-pedantic -Wno-missing-noreturn -Wno-padded -Wno-covered-switch-default -Wno-exit-time-destructors -Wno-global-constructors -std=gnu++14 -o CMakeFiles/discord-rpc.dir/rpc_connection.cpp.o -c /home/yonic/Documentos/urde/discord-rpc/src/rpc_connection.cpp
  21. In file included from /home/yonic/Documentos/urde/discord-rpc/src/serialization.h:15,
  22. from /home/yonic/Documentos/urde/discord-rpc/src/rpc_connection.h:4,
  23. from /home/yonic/Documentos/urde/discord-rpc/src/rpc_connection.cpp:1:
  24. /home/yonic/Documentos/urde/rapidjson/include/rapidjson/document.h: In instantiation of ‘void rapidjson::GenericValue<Encoding, Allocator>::SetObjectRaw(rapidjson::GenericValue<Encoding, Allocator>::Member*, rapidjson::SizeType, Allocator&) [with Encoding = rapidjson::UTF8<>; Allocator = rapidjson::MemoryPoolAllocator<>; rapidjson::GenericValue<Encoding, Allocator>::Member = rapidjson::GenericMember<rapidjson::UTF8<>, rapidjson::MemoryPoolAllocator<> >; rapidjson::SizeType = unsigned int]’:
  25. /home/yonic/Documentos/urde/rapidjson/include/rapidjson/document.h:2363:9: required from ‘bool rapidjson::GenericDocument<Encoding, Allocator, StackAllocator>::EndObject(rapidjson::SizeType) [with Encoding = rapidjson::UTF8<>; Allocator = rapidjson::MemoryPoolAllocator<>; StackAllocator = FixedLinearAllocator<2048>; rapidjson::SizeType = unsigned int]’
  26. /home/yonic/Documentos/urde/rapidjson/include/rapidjson/reader.h:1736:18: required from ‘rapidjson::GenericReader<SourceEncoding, TargetEncoding, StackAllocator>::IterativeParsingState rapidjson::GenericReader<SourceEncoding, TargetEncoding, StackAllocator>::Transit(rapidjson::GenericReader<SourceEncoding, TargetEncoding, StackAllocator>::IterativeParsingState, rapidjson::GenericReader<SourceEncoding, TargetEncoding, StackAllocator>::Token, rapidjson::GenericReader<SourceEncoding, TargetEncoding, StackAllocator>::IterativeParsingState, InputStream&, Handler&) [with unsigned int parseFlags = 1; InputStream = rapidjson::GenericInsituStringStream<rapidjson::UTF8<> >; Handler = rapidjson::GenericDocument<rapidjson::UTF8<>, rapidjson::MemoryPoolAllocator<>, FixedLinearAllocator<2048> >; SourceEncoding = rapidjson::UTF8<>; TargetEncoding = rapidjson::UTF8<>; StackAllocator = FixedLinearAllocator<2048>]’
  27. /home/yonic/Documentos/urde/rapidjson/include/rapidjson/reader.h:1832:58: required from ‘rapidjson::ParseResult rapidjson::GenericReader<SourceEncoding, TargetEncoding, StackAllocator>::IterativeParse(InputStream&, Handler&) [with unsigned int parseFlags = 1; InputStream = rapidjson::GenericInsituStringStream<rapidjson::UTF8<> >; Handler = rapidjson::GenericDocument<rapidjson::UTF8<>, rapidjson::MemoryPoolAllocator<>, FixedLinearAllocator<2048> >; SourceEncoding = rapidjson::UTF8<>; TargetEncoding = rapidjson::UTF8<>; StackAllocator = FixedLinearAllocator<2048>]’
  28. /home/yonic/Documentos/urde/rapidjson/include/rapidjson/reader.h:487:46: required from ‘rapidjson::ParseResult rapidjson::GenericReader<SourceEncoding, TargetEncoding, StackAllocator>::Parse(InputStream&, Handler&) [with unsigned int parseFlags = 1; InputStream = rapidjson::GenericInsituStringStream<rapidjson::UTF8<> >; Handler = rapidjson::GenericDocument<rapidjson::UTF8<>, rapidjson::MemoryPoolAllocator<>, FixedLinearAllocator<2048> >; SourceEncoding = rapidjson::UTF8<>; TargetEncoding = rapidjson::UTF8<>; StackAllocator = FixedLinearAllocator<2048>]’
  29. /home/yonic/Documentos/urde/rapidjson/include/rapidjson/document.h:2159:22: required from ‘rapidjson::GenericDocument<Encoding, Allocator, StackAllocator>& rapidjson::GenericDocument<Encoding, Allocator, StackAllocator>::ParseStream(InputStream&) [with unsigned int parseFlags = 1; SourceEncoding = rapidjson::UTF8<>; InputStream = rapidjson::GenericInsituStringStream<rapidjson::UTF8<> >; Encoding = rapidjson::UTF8<>; Allocator = rapidjson::MemoryPoolAllocator<>; StackAllocator = FixedLinearAllocator<2048>]’
  30. /home/yonic/Documentos/urde/rapidjson/include/rapidjson/document.h:2175:62: required from ‘rapidjson::GenericDocument<Encoding, Allocator, StackAllocator>& rapidjson::GenericDocument<Encoding, Allocator, StackAllocator>::ParseStream(InputStream&) [with unsigned int parseFlags = 1; InputStream = rapidjson::GenericInsituStringStream<rapidjson::UTF8<> >; Encoding = rapidjson::UTF8<>; Allocator = rapidjson::MemoryPoolAllocator<>; StackAllocator = FixedLinearAllocator<2048>]’
  31. /home/yonic/Documentos/urde/rapidjson/include/rapidjson/document.h:2200:58: required from ‘rapidjson::GenericDocument<Encoding, Allocator, StackAllocator>& rapidjson::GenericDocument<Encoding, Allocator, StackAllocator>::ParseInsitu(rapidjson::GenericDocument<Encoding, Allocator, StackAllocator>::Ch*) [with unsigned int parseFlags = 0; Encoding = rapidjson::UTF8<>; Allocator = rapidjson::MemoryPoolAllocator<>; StackAllocator = FixedLinearAllocator<2048>; rapidjson::GenericDocument<Encoding, Allocator, StackAllocator>::Ch = char]’
  32. /home/yonic/Documentos/urde/rapidjson/include/rapidjson/document.h:2208:47: required from ‘rapidjson::GenericDocument<Encoding, Allocator, StackAllocator>& rapidjson::GenericDocument<Encoding, Allocator, StackAllocator>::ParseInsitu(rapidjson::GenericDocument<Encoding, Allocator, StackAllocator>::Ch*) [with Encoding = rapidjson::UTF8<>; Allocator = rapidjson::MemoryPoolAllocator<>; StackAllocator = FixedLinearAllocator<2048>; rapidjson::GenericDocument<Encoding, Allocator, StackAllocator>::Ch = char]’
  33. /home/yonic/Documentos/urde/discord-rpc/src/rpc_connection.cpp:115:50: required from here
  34. /home/yonic/Documentos/urde/rapidjson/include/rapidjson/document.h:1952:24: error: ‘void* memcpy(void*, const void*, size_t)’ writing to an object of type ‘rapidjson::GenericValue<rapidjson::UTF8<> >::Member’ {aka ‘struct rapidjson::GenericMember<rapidjson::UTF8<>, rapidjson::MemoryPoolAllocator<> >’} with no trivial copy-assignment; use copy-assignment instead [-Werror=class-memaccess]
  35. std::memcpy(m, members, count * sizeof(Member));
  36. ~~~~~~~~~~~^~~~~~~~~~~~~~~~~~~~~~~~~~~~~~~~~~~~
  37. In file included from /home/yonic/Documentos/urde/discord-rpc/src/serialization.h:15,
  38. from /home/yonic/Documentos/urde/discord-rpc/src/rpc_connection.h:4,
  39. from /home/yonic/Documentos/urde/discord-rpc/src/rpc_connection.cpp:1:
  40. /home/yonic/Documentos/urde/rapidjson/include/rapidjson/document.h:71:8: note: ‘rapidjson::GenericValue<rapidjson::UTF8<> >::Member’ {aka ‘struct rapidjson::GenericMember<rapidjson::UTF8<>, rapidjson::MemoryPoolAllocator<> >’} declared here
  41. struct GenericMember {
  42. ^~~~~~~~~~~~~
  43. In file included from /home/yonic/Documentos/urde/discord-rpc/src/serialization.h:15,
  44. from /home/yonic/Documentos/urde/discord-rpc/src/rpc_connection.h:4,
  45. from /home/yonic/Documentos/urde/discord-rpc/src/rpc_connection.cpp:1:
  46. /home/yonic/Documentos/urde/rapidjson/include/rapidjson/document.h: In instantiation of ‘void rapidjson::GenericValue<Encoding, Allocator>::SetArrayRaw(rapidjson::GenericValue<Encoding, Allocator>*, rapidjson::SizeType, Allocator&) [with Encoding = rapidjson::UTF8<>; Allocator = rapidjson::MemoryPoolAllocator<>; rapidjson::SizeType = unsigned int]’:
  47. /home/yonic/Documentos/urde/rapidjson/include/rapidjson/document.h:2371:9: required from ‘bool rapidjson::GenericDocument<Encoding, Allocator, StackAllocator>::EndArray(rapidjson::SizeType) [with Encoding = rapidjson::UTF8<>; Allocator = rapidjson::MemoryPoolAllocator<>; StackAllocator = FixedLinearAllocator<2048>; rapidjson::SizeType = unsigned int]’
  48. /home/yonic/Documentos/urde/rapidjson/include/rapidjson/reader.h:1766:18: required from ‘rapidjson::GenericReader<SourceEncoding, TargetEncoding, StackAllocator>::IterativeParsingState rapidjson::GenericReader<SourceEncoding, TargetEncoding, StackAllocator>::Transit(rapidjson::GenericReader<SourceEncoding, TargetEncoding, StackAllocator>::IterativeParsingState, rapidjson::GenericReader<SourceEncoding, TargetEncoding, StackAllocator>::Token, rapidjson::GenericReader<SourceEncoding, TargetEncoding, StackAllocator>::IterativeParsingState, InputStream&, Handler&) [with unsigned int parseFlags = 1; InputStream = rapidjson::GenericInsituStringStream<rapidjson::UTF8<> >; Handler = rapidjson::GenericDocument<rapidjson::UTF8<>, rapidjson::MemoryPoolAllocator<>, FixedLinearAllocator<2048> >; SourceEncoding = rapidjson::UTF8<>; TargetEncoding = rapidjson::UTF8<>; StackAllocator = FixedLinearAllocator<2048>]’
  49. /home/yonic/Documentos/urde/rapidjson/include/rapidjson/reader.h:1832:58: required from ‘rapidjson::ParseResult rapidjson::GenericReader<SourceEncoding, TargetEncoding, StackAllocator>::IterativeParse(InputStream&, Handler&) [with unsigned int parseFlags = 1; InputStream = rapidjson::GenericInsituStringStream<rapidjson::UTF8<> >; Handler = rapidjson::GenericDocument<rapidjson::UTF8<>, rapidjson::MemoryPoolAllocator<>, FixedLinearAllocator<2048> >; SourceEncoding = rapidjson::UTF8<>; TargetEncoding = rapidjson::UTF8<>; StackAllocator = FixedLinearAllocator<2048>]’
  50. /home/yonic/Documentos/urde/rapidjson/include/rapidjson/reader.h:487:46: required from ‘rapidjson::ParseResult rapidjson::GenericReader<SourceEncoding, TargetEncoding, StackAllocator>::Parse(InputStream&, Handler&) [with unsigned int parseFlags = 1; InputStream = rapidjson::GenericInsituStringStream<rapidjson::UTF8<> >; Handler = rapidjson::GenericDocument<rapidjson::UTF8<>, rapidjson::MemoryPoolAllocator<>, FixedLinearAllocator<2048> >; SourceEncoding = rapidjson::UTF8<>; TargetEncoding = rapidjson::UTF8<>; StackAllocator = FixedLinearAllocator<2048>]’
  51. /home/yonic/Documentos/urde/rapidjson/include/rapidjson/document.h:2159:22: required from ‘rapidjson::GenericDocument<Encoding, Allocator, StackAllocator>& rapidjson::GenericDocument<Encoding, Allocator, StackAllocator>::ParseStream(InputStream&) [with unsigned int parseFlags = 1; SourceEncoding = rapidjson::UTF8<>; InputStream = rapidjson::GenericInsituStringStream<rapidjson::UTF8<> >; Encoding = rapidjson::UTF8<>; Allocator = rapidjson::MemoryPoolAllocator<>; StackAllocator = FixedLinearAllocator<2048>]’
  52. /home/yonic/Documentos/urde/rapidjson/include/rapidjson/document.h:2175:62: required from ‘rapidjson::GenericDocument<Encoding, Allocator, StackAllocator>& rapidjson::GenericDocument<Encoding, Allocator, StackAllocator>::ParseStream(InputStream&) [with unsigned int parseFlags = 1; InputStream = rapidjson::GenericInsituStringStream<rapidjson::UTF8<> >; Encoding = rapidjson::UTF8<>; Allocator = rapidjson::MemoryPoolAllocator<>; StackAllocator = FixedLinearAllocator<2048>]’
  53. /home/yonic/Documentos/urde/rapidjson/include/rapidjson/document.h:2200:58: required from ‘rapidjson::GenericDocument<Encoding, Allocator, StackAllocator>& rapidjson::GenericDocument<Encoding, Allocator, StackAllocator>::ParseInsitu(rapidjson::GenericDocument<Encoding, Allocator, StackAllocator>::Ch*) [with unsigned int parseFlags = 0; Encoding = rapidjson::UTF8<>; Allocator = rapidjson::MemoryPoolAllocator<>; StackAllocator = FixedLinearAllocator<2048>; rapidjson::GenericDocument<Encoding, Allocator, StackAllocator>::Ch = char]’
  54. /home/yonic/Documentos/urde/rapidjson/include/rapidjson/document.h:2208:47: required from ‘rapidjson::GenericDocument<Encoding, Allocator, StackAllocator>& rapidjson::GenericDocument<Encoding, Allocator, StackAllocator>::ParseInsitu(rapidjson::GenericDocument<Encoding, Allocator, StackAllocator>::Ch*) [with Encoding = rapidjson::UTF8<>; Allocator = rapidjson::MemoryPoolAllocator<>; StackAllocator = FixedLinearAllocator<2048>; rapidjson::GenericDocument<Encoding, Allocator, StackAllocator>::Ch = char]’
  55. /home/yonic/Documentos/urde/discord-rpc/src/rpc_connection.cpp:115:50: required from here
  56. /home/yonic/Documentos/urde/rapidjson/include/rapidjson/document.h:1939:24: error: ‘void* memcpy(void*, const void*, size_t)’ writing to an object of type ‘class rapidjson::GenericValue<rapidjson::UTF8<> >’ with no trivial copy-assignment; use copy-assignment or copy-initialization instead [-Werror=class-memaccess]
  57. std::memcpy(e, values, count * sizeof(GenericValue));
  58. ~~~~~~~~~~~^~~~~~~~~~~~~~~~~~~~~~~~~~~~~~~~~~~~~~~~~
  59. /home/yonic/Documentos/urde/rapidjson/include/rapidjson/document.h:540:7: note: ‘class rapidjson::GenericValue<rapidjson::UTF8<> >’ declared here
  60. class GenericValue {
  61. ^~~~~~~~~~~~
  62. cc1plus: error: unrecognized command line option ‘-Wno-global-constructors’ [-Werror]
  63. cc1plus: error: unrecognized command line option ‘-Wno-exit-time-destructors’ [-Werror]
  64. cc1plus: error: unrecognized command line option ‘-Wno-covered-switch-default’ [-Werror]
  65. cc1plus: error: unrecognized command line option ‘-Wno-c++98-compat-pedantic’ [-Werror]
  66. cc1plus: error: unrecognized command line option ‘-Wno-c++98-compat’ [-Werror]
  67. cc1plus: error: unrecognized command line option ‘-Wno-nullability-completeness’ [-Werror]
  68. cc1plus: all warnings being treated as errors
  69. make[2]: Leaving directory '/home/yonic/Documentos/urde-build'
  70. make[2]: *** [discord-rpc/src/CMakeFiles/discord-rpc.dir/build.make:76: discord-rpc/src/CMakeFiles/discord-rpc.dir/rpc_connection.cpp.o] Error 1
  71. make[1]: *** [CMakeFiles/Makefile2:86: discord-rpc/src/CMakeFiles/discord-rpc.dir/all] Error 2
  72. make[1]: Leaving directory '/home/yonic/Documentos/urde-build'
  73. make: *** [Makefile:152: all] Error 2
  74. 23:57:53: The process "/usr/bin/cmake" exited with code 2.
  75. Error while building/deploying project urde (kit: Desktop)
  76. The kit Desktop has configuration issues which might be the root cause for this problem.
  77. When executing step "CMake Build"
  78. 23:57:53: Elapsed time: 00:07.
RAW Paste Data