Advertisement
Guest User

Untitled

a guest
Aug 22nd, 2012
16
Never
Not a member of Pastebin yet? Sign Up, it unlocks many cool features!
  1. \t### Compiling ###
  2.  
  3. /home/stefan/openrisc/mor1kx/mor1kx-dev-env/boards/generic/mor1kx/sim/run/../../../../../bench/verilog/mor1kx_monitor.v:192: error: Unable to bind wire/reg/memory `dut.mor1kx0.mor1kx_cpu.monitor_clk' in `orpsoc_testbench.monitor.mor1k_trace_print'
  4. posedge dut.mor1kx0.mor1kx_cpu.monitor_clk
  5. /home/stefan/openrisc/mor1kx/mor1kx-dev-env/boards/generic/mor1kx/sim/run/../../../../../bench/verilog/mor1kx_monitor.v:221: error: Unable to bind wire/reg/memory `dut.mor1kx0.mor1kx_cpu.monitor_rf_result_in' in `orpsoc_testbench.monitor.mor1k_trace_print'
  6. /home/stefan/openrisc/mor1kx/mor1kx-dev-env/boards/generic/mor1kx/sim/run/../../../../../bench/verilog/mor1kx_monitor.v:229: error: No function dut.mor1kx0.mor1kx_cpu.fourstage.mor1kx_cpu.get_gpr in this context (orpsoc_testbench.monitor.mor1k_trace_print).
  7. /home/stefan/openrisc/mor1kx/mor1kx-dev-env/boards/generic/mor1kx/sim/run/../../../../../bench/verilog/mor1kx_monitor.v:230: error: No function dut.mor1kx0.mor1kx_cpu.fourstage.mor1kx_cpu.get_gpr in this context (orpsoc_testbench.monitor.mor1k_trace_print).
  8. /home/stefan/openrisc/mor1kx/mor1kx-dev-env/boards/generic/mor1kx/sim/run/../../../../../bench/verilog/mor1kx_monitor.v:239: error: No function dut.mor1kx0.mor1kx_cpu.fourstage.mor1kx_cpu.get_gpr in this context (orpsoc_testbench.monitor.mor1k_trace_print).
  9. /home/stefan/openrisc/mor1kx/mor1kx-dev-env/boards/generic/mor1kx/sim/run/../../../../../bench/verilog/mor1kx_monitor.v:241: error: No function dut.mor1kx0.mor1kx_cpu.fourstage.mor1kx_cpu.get_gpr in this context (orpsoc_testbench.monitor.mor1k_trace_print).
  10. /home/stefan/openrisc/mor1kx/mor1kx-dev-env/boards/generic/mor1kx/sim/run/../../../../../bench/verilog/mor1kx_monitor.v:54: error: Unable to bind wire/reg/memory `dut.mor1kx0.mor1kx_cpu.monitor_clk' in `orpsoc_testbench.monitor'
  11. /home/stefan/openrisc/mor1kx/mor1kx-dev-env/boards/generic/mor1kx/sim/run/../../../../../bench/verilog/mor1kx_monitor.v:54: error: Unable to elaborate r-value: dut.mor1kx0.mor1kx_cpu.monitor_clk
  12. /home/stefan/openrisc/mor1kx/mor1kx-dev-env/boards/generic/mor1kx/sim/run/../../../../../bench/verilog/mor1kx_monitor.v:75: error: Unable to bind wire/reg/memory `dut.mor1kx0.mor1kx_cpu.monitor_execute_insn' in `orpsoc_testbench.monitor'
  13. sh: line 1: 21563 Done /usr/lib/ivl/ivlpp -L -F"/tmp/ivrlg24062e676" -f"/tmp/ivrlg4062e676" -p"/tmp/ivrli4062e676"
  14. 21564 Segmentation fault (core dumped) | /usr/lib/ivl/ivl -C"/tmp/ivrlh4062e676" -C"/usr/lib/ivl/vvp.conf" -- -
  15. make[1]: *** [vlogsim.elf] Error 139
  16. make[1]: Leaving directory `/home/stefan/openrisc/mor1kx/mor1kx-dev-env/boards/generic/mor1kx/sim/run'
Advertisement
RAW Paste Data Copied
Advertisement