wiktorek140

Untitled

Jul 18th, 2018
70
Never
Not a member of Pastebin yet? Sign Up, it unlocks many cool features!
  1. HABUILD_SDK [surnia] wiktorek140@GUMI:~/android/sfos12$ make -j6 hybris-hal
  2. ============================================
  3. PLATFORM_VERSION_CODENAME=REL
  4. PLATFORM_VERSION=5.1.1
  5. CM_VERSION=12.1-20180718-UNOFFICIAL-surnia
  6. TARGET_PRODUCT=cm_surnia
  7. TARGET_BUILD_VARIANT=userdebug
  8. TARGET_BUILD_TYPE=release
  9. TARGET_BUILD_APPS=
  10. TARGET_ARCH=arm
  11. TARGET_ARCH_VARIANT=armv7-a-neon
  12. TARGET_CPU_VARIANT=cortex-a53
  13. TARGET_2ND_ARCH=
  14. TARGET_2ND_ARCH_VARIANT=
  15. TARGET_2ND_CPU_VARIANT=
  16. HOST_ARCH=x86_64
  17. HOST_OS=linux
  18. HOST_OS_EXTRA=Linux-4.15.0-24-generic-x86_64-with-Ubuntu-14.04-trusty
  19. HOST_BUILD_TYPE=release
  20. BUILD_ID=LMY49J
  21. OUT_DIR=/home/wiktorek140/android/sfos12/out
  22. ============================================
  23. build/core/copy_headers.mk:15: warning: overriding commands for target `/home/wiktorek140/android/sfos12/out/target/product/surnia/obj/include/qcom/display/copybit.h'
  24. build/core/copy_headers.mk:15: warning: ignoring old commands for target `/home/wiktorek140/android/sfos12/out/target/product/surnia/obj/include/qcom/display/copybit.h'
  25. build/core/copy_headers.mk:15: warning: overriding commands for target `/home/wiktorek140/android/sfos12/out/target/product/surnia/obj/include/qcom/display/copybit_priv.h'
  26. build/core/copy_headers.mk:15: warning: ignoring old commands for target `/home/wiktorek140/android/sfos12/out/target/product/surnia/obj/include/qcom/display/copybit_priv.h'
  27. build/core/copy_headers.mk:15: warning: overriding commands for target `/home/wiktorek140/android/sfos12/out/target/product/surnia/obj/include/qcom/display/c2d2.h'
  28. build/core/copy_headers.mk:15: warning: ignoring old commands for target `/home/wiktorek140/android/sfos12/out/target/product/surnia/obj/include/qcom/display/c2d2.h'
  29. perl: warning: Setting locale failed.
  30. perl: warning: Please check that your locale settings:
  31. LANGUAGE = (unset),
  32. LC_ALL = (unset),
  33. LC_MESSAGES = "en_US.UTF-8",
  34. LC_CTYPE = "en_US.UTF-8",
  35. LANG = (unset)
  36. are supported and installed on your system.
  37. perl: warning: Falling back to the standard locale ("C").
  38. perl: warning: Setting locale failed.
  39. perl: warning: Please check that your locale settings:
  40. LANGUAGE = (unset),
  41. LC_ALL = (unset),
  42. LC_MESSAGES = "en_US.UTF-8",
  43. LC_CTYPE = "en_US.UTF-8",
  44. LANG = (unset)
  45. are supported and installed on your system.
  46. perl: warning: Falling back to the standard locale ("C").
  47. hybris/hybris-boot/Android.mk:67: ********************* /boot appears to live on /dev/block/platform/soc.0/by-name/boot
  48. hybris/hybris-boot/Android.mk:68: ********************* /data appears to live on /dev/block/platform/soc.0/by-name/userdata
  49. build/core/Makefile:46: warning: overriding commands for target `/home/wiktorek140/android/sfos12/out/target/product/surnia/system/etc/wifi/wpa_supplicant.conf'
  50. build/core/base_rules.mk:550: warning: ignoring old commands for target `/home/wiktorek140/android/sfos12/out/target/product/surnia/system/etc/wifi/wpa_supplicant.conf'
  51. PRODUCT_COPY_FILES device/motorola/surnia/audio/audio_effects.conf:system/etc/audio_effects.conf ignored.
  52. build/core/Makefile:46: warning: overriding commands for target `/home/wiktorek140/android/sfos12/out/target/product/surnia/system/bin/rild'
  53. build/core/base_rules.mk:550: warning: ignoring old commands for target `/home/wiktorek140/android/sfos12/out/target/product/surnia/system/bin/rild'
  54. build/core/Makefile:46: warning: overriding commands for target `/home/wiktorek140/android/sfos12/out/target/product/surnia/system/lib/libbt-vendor.so'
  55. build/core/base_rules.mk:550: warning: ignoring old commands for target `/home/wiktorek140/android/sfos12/out/target/product/surnia/system/lib/libbt-vendor.so'
  56. build/core/Makefile:46: warning: overriding commands for target `/home/wiktorek140/android/sfos12/out/target/product/surnia/system/lib/libril.so'
  57. build/core/base_rules.mk:550: warning: ignoring old commands for target `/home/wiktorek140/android/sfos12/out/target/product/surnia/system/lib/libril.so'
  58. PRODUCT_COPY_FILES vendor/cm/prebuilt/common/etc/apns-conf.xml:system/etc/apns-conf.xml ignored.
  59. No private recovery resources for TARGET_DEVICE surnia
  60. make -C kernel/motorola/msm8916 O=/home/wiktorek140/android/sfos12/out/target/product/surnia/obj/KERNEL_OBJ ARCH=arm CROSS_COMPILE="/home/wiktorek140/android/sfos12/prebuilts/misc/linux-x86/ccache/ccache arm-eabi-" VARIANT_DEFCONFIG= SELINUX_DEFCONFIG= surnia_defconfig
  61. host Executable: mkbootimg (/home/wiktorek140/android/sfos12/out/host/linux-x86/obj32/EXECUTABLES/mkbootimg_intermediates/mkbootimg)
  62. host Executable: acp (/home/wiktorek140/android/sfos12/out/host/linux-x86/obj32/EXECUTABLES/acp_intermediates/acp)
  63. make[1]: Entering directory `/home/wiktorek140/android/sfos12/kernel/motorola/msm8916'
  64. host Executable: mkbootfs (/home/wiktorek140/android/sfos12/out/host/linux-x86/obj32/EXECUTABLES/mkbootfs_intermediates/mkbootfs)
  65. /home/wiktorek140/android/sfos12/prebuilts/gcc/linux-x86/host/x86_64-linux-glibc2.11-4.6/bin/../lib/gcc/x86_64-linux/4.6/../../../../x86_64-linux/bin/ld: error: /home/wiktorek140/android/sfos12/out/host/linux-x86/obj32/STATIC_LIBRARIES/libmincrypt_intermediates/libmincrypt.a: no archive symbol table (run ranlib)
  66. system/core/mkbootimg/mkbootimg.c:255: error: undefined reference to 'SHA_init'
  67. system/core/mkbootimg/mkbootimg.c:256: error: undefined reference to 'SHA_update'
  68. system/core/mkbootimg/mkbootimg.c:257: error: undefined reference to 'SHA_update'
  69. system/core/mkbootimg/mkbootimg.c:258: error: undefined reference to 'SHA_update'
  70. system/core/mkbootimg/mkbootimg.c:259: error: undefined reference to 'SHA_update'
  71. system/core/mkbootimg/mkbootimg.c:266: error: undefined reference to 'SHA_final'
  72. system/core/mkbootimg/mkbootimg.c:255: error: undefined reference to 'SHA_init'
  73. collect2: ld returned 1 exit status
  74. make: *** [/home/wiktorek140/android/sfos12/out/host/linux-x86/obj32/EXECUTABLES/mkbootimg_intermediates/mkbootimg] Error 1
  75. make: *** Waiting for unfinished jobs....
  76. host C: checkpolicy <= external/checkpolicy/parse_util.c
  77. /home/wiktorek140/android/sfos12/prebuilts/gcc/linux-x86/host/x86_64-linux-glibc2.11-4.6/bin/../lib/gcc/x86_64-linux/4.6/../../../../x86_64-linux/bin/ld: error: /home/wiktorek140/android/sfos12/out/host/linux-x86/obj32/STATIC_LIBRARIES/libhost_intermediates/libhost.a: no archive symbol table (run ranlib)
  78. build/tools/acp/acp.c:154: error: undefined reference to 'copyFile'
  79. collect2: ld returned 1 exit status
  80. make: *** [/home/wiktorek140/android/sfos12/out/host/linux-x86/obj32/EXECUTABLES/acp_intermediates/acp] Error 1
  81. /home/wiktorek140/android/sfos12/prebuilts/gcc/linux-x86/host/x86_64-linux-glibc2.11-4.6/bin/../lib/gcc/x86_64-linux/4.6/../../../../x86_64-linux/bin/ld: error: /home/wiktorek140/android/sfos12/out/host/linux-x86/obj32/EXECUTABLES/mkbootfs_intermediates/mkbootfs.o: file is empty
  82. /home/wiktorek140/android/sfos12/prebuilts/gcc/linux-x86/host/x86_64-linux-glibc2.11-4.6/bin/../sysroot/usr/lib/../lib32/Scrt1.o(.text+0x28): error: undefined reference to 'main'
  83. collect2: ld returned 1 exit status
  84. make: *** [/home/wiktorek140/android/sfos12/out/host/linux-x86/obj32/EXECUTABLES/mkbootfs_intermediates/mkbootfs] Error 1
  85. HOSTLD scripts/kconfig/conf
  86. scripts/kconfig/conf.o: In function `print_help':
  87. conf.c:(.text+0xbc): undefined reference to `str_new'
  88. conf.c:(.text+0xc7): undefined reference to `menu_get_ext_help'
  89. conf.c:(.text+0xcf): undefined reference to `str_get'
  90. conf.c:(.text+0xeb): undefined reference to `str_free'
  91. scripts/kconfig/conf.o: In function `conf_askvalue':
  92. conf.c:(.text+0x14b): undefined reference to `sym_get_type'
  93. conf.c:(.text+0x16e): undefined reference to `sym_is_changable'
  94. scripts/kconfig/conf.o: In function `conf_sym':
  95. conf.c:(.text+0x3e4): undefined reference to `sym_tristate_within_range'
  96. conf.c:(.text+0x402): undefined reference to `sym_tristate_within_range'
  97. conf.c:(.text+0x41f): undefined reference to `menu_has_help'
  98. conf.c:(.text+0x440): undefined reference to `sym_get_string_value'
  99. conf.c:(.text+0x48b): undefined reference to `sym_set_tristate_value'
  100. conf.c:(.text+0x4b9): undefined reference to `sym_tristate_within_range'
  101. conf.c:(.text+0x4d2): undefined reference to `menu_has_help'
  102. conf.c:(.text+0x54c): undefined reference to `sym_set_tristate_value'
  103. conf.c:(.text+0x5a7): undefined reference to `sym_tristate_within_range'
  104. scripts/kconfig/conf.o: In function `conf':
  105. conf.c:(.text+0x672): undefined reference to `menu_is_visible'
  106. conf.c:(.text+0x6dc): undefined reference to `menu_get_prompt'
  107. conf.c:(.text+0x7e7): undefined reference to `sym_get_string_value'
  108. conf.c:(.text+0x7f2): undefined reference to `sym_get_string_value'
  109. conf.c:(.text+0x88c): undefined reference to `sym_set_string_value'
  110. conf.c:(.text+0x8d4): undefined reference to `sym_is_changable'
  111. conf.c:(.text+0x903): undefined reference to `menu_get_prompt'
  112. conf.c:(.text+0x97b): undefined reference to `menu_is_visible'
  113. conf.c:(.text+0x9bd): undefined reference to `menu_get_prompt'
  114. conf.c:(.text+0xa3c): undefined reference to `menu_get_prompt'
  115. conf.c:(.text+0xada): undefined reference to `menu_has_help'
  116. conf.c:(.text+0xba8): undefined reference to `menu_is_visible'
  117. conf.c:(.text+0xc14): undefined reference to `sym_set_tristate_value'
  118. conf.c:(.text+0xc92): undefined reference to `sym_calc_value'
  119. conf.c:(.text+0xcaa): undefined reference to `menu_get_prompt'
  120. scripts/kconfig/conf.o: In function `check_conf':
  121. conf.c:(.text+0xd98): undefined reference to `menu_is_visible'
  122. conf.c:(.text+0xddc): undefined reference to `sym_is_changable'
  123. conf.c:(.text+0xe17): undefined reference to `menu_get_parent_menu'
  124. scripts/kconfig/conf.o: In function `main':
  125. conf.c:(.text.startup+0x17c): undefined reference to `conf_parse'
  126. conf.c:(.text.startup+0x1c1): undefined reference to `conf_read'
  127. conf.c:(.text.startup+0x1f9): undefined reference to `conf_read'
  128. conf.c:(.text.startup+0x22b): undefined reference to `rootmenu'
  129. conf.c:(.text.startup+0x26b): undefined reference to `conf_write'
  130. conf.c:(.text.startup+0x286): undefined reference to `conf_get_changed'
  131. conf.c:(.text.startup+0x2a4): undefined reference to `conf_get_configname'
  132. conf.c:(.text.startup+0x2d5): undefined reference to `conf_get_changed'
  133. conf.c:(.text.startup+0x2e5): undefined reference to `conf_write'
  134. conf.c:(.text.startup+0x31f): undefined reference to `conf_write_autoconf'
  135. conf.c:(.text.startup+0x33d): undefined reference to `conf_set_all_new_symbols'
  136. conf.c:(.text.startup+0x34c): undefined reference to `conf_set_all_new_symbols'
  137. conf.c:(.text.startup+0x35b): undefined reference to `conf_set_all_new_symbols'
  138. conf.c:(.text.startup+0x366): undefined reference to `rootmenu'
  139. conf.c:(.text.startup+0x371): undefined reference to `rootmenu'
  140. conf.c:(.text.startup+0x38f): undefined reference to `conf_set_all_new_symbols'
  141. conf.c:(.text.startup+0x39e): undefined reference to `conf_set_all_new_symbols'
  142. conf.c:(.text.startup+0x3d6): undefined reference to `conf_read_simple'
  143. conf.c:(.text.startup+0x467): undefined reference to `conf_write_defconfig'
  144. conf.c:(.text.startup+0x4d1): undefined reference to `conf_read_simple'
  145. conf.c:(.text.startup+0x4e5): undefined reference to `conf_read_simple'
  146. conf.c:(.text.startup+0x51d): undefined reference to `conf_get_default_confname'
  147. collect2: error: ld returned 1 exit status
  148. make[3]: *** [scripts/kconfig/conf] Error 1
  149. make[2]: *** [surnia_defconfig] Error 2
  150. make[1]: *** [sub-make] Error 2
  151. make[1]: Leaving directory `/home/wiktorek140/android/sfos12/kernel/motorola/msm8916'
  152. make: *** [/home/wiktorek140/android/sfos12/out/target/product/surnia/obj/KERNEL_OBJ/.config] Error 2
  153.  
  154. #### make failed to build some targets (12 seconds) ####
  155.  
  156. HABUILD_SDK [surnia] wiktorek140@GUMI:~/android/sfos12$
RAW Paste Data